hadoop-hdfs-dev mailing list archives

Site index · List index
Message view « Date » · « Thread »
Top « Date » · « Thread »
From Apache Jenkins Server <jenk...@builds.apache.org>
Subject Hadoop-Hdfs-trunk - Build # 2540 - Still Failing
Date Fri, 13 Nov 2015 10:01:44 GMT
See https://builds.apache.org/job/Hadoop-Hdfs-trunk/2540/

###################################################################################
########################## LAST 60 LINES OF THE CONSOLE ###########################
[...truncated 6385 lines...]
[INFO] Executing tasks

main:
    [mkdir] Created dir: /home/jenkins/jenkins-slave/workspace/Hadoop-Hdfs-trunk/hadoop-hdfs-project/target/test-dir
[INFO] Executed tasks
[INFO] 
[INFO] --- maven-source-plugin:2.3:jar-no-fork (hadoop-java-sources) @ hadoop-hdfs-project
---
[INFO] 
[INFO] --- maven-source-plugin:2.3:test-jar-no-fork (hadoop-java-sources) @ hadoop-hdfs-project
---
[INFO] 
[INFO] --- maven-enforcer-plugin:1.3.1:enforce (dist-enforce) @ hadoop-hdfs-project ---
[INFO] 
[INFO] --- maven-site-plugin:3.4:attach-descriptor (attach-descriptor) @ hadoop-hdfs-project
---
[INFO] 
[INFO] --- maven-javadoc-plugin:2.8.1:jar (module-javadocs) @ hadoop-hdfs-project ---
[INFO] Skipping javadoc generation
[INFO] 
[INFO] --- maven-enforcer-plugin:1.3.1:enforce (depcheck) @ hadoop-hdfs-project ---
[INFO] 
[INFO] --- maven-checkstyle-plugin:2.15:checkstyle (default-cli) @ hadoop-hdfs-project ---
[INFO] 
[INFO] --- findbugs-maven-plugin:3.0.0:findbugs (default-cli) @ hadoop-hdfs-project ---
[INFO] ------------------------------------------------------------------------
[INFO] Reactor Summary:
[INFO] 
[INFO] Apache Hadoop HDFS Client ......................... SUCCESS [03:52 min]
[INFO] Apache Hadoop HDFS ................................ FAILURE [  03:08 h]
[INFO] Apache Hadoop HDFS Native Client .................. SKIPPED
[INFO] Apache Hadoop HttpFS .............................. SKIPPED
[INFO] Apache Hadoop HDFS BookKeeper Journal ............. SKIPPED
[INFO] Apache Hadoop HDFS-NFS ............................ SKIPPED
[INFO] Apache Hadoop HDFS Project ........................ SUCCESS [  0.076 s]
[INFO] ------------------------------------------------------------------------
[INFO] BUILD FAILURE
[INFO] ------------------------------------------------------------------------
[INFO] Total time: 03:12 h
[INFO] Finished at: 2015-11-13T10:01:34+00:00
[INFO] Final Memory: 56M/781M
[INFO] ------------------------------------------------------------------------
[ERROR] Failed to execute goal org.apache.maven.plugins:maven-surefire-plugin:2.17:test (default-test)
on project hadoop-hdfs: There are test failures.
[ERROR] 
[ERROR] Please refer to /home/jenkins/jenkins-slave/workspace/Hadoop-Hdfs-trunk/hadoop-hdfs-project/hadoop-hdfs/target/surefire-reports
for the individual test results.
[ERROR] -> [Help 1]
[ERROR] 
[ERROR] To see the full stack trace of the errors, re-run Maven with the -e switch.
[ERROR] Re-run Maven using the -X switch to enable full debug logging.
[ERROR] 
[ERROR] For more information about the errors and possible solutions, please read the following
articles:
[ERROR] [Help 1] http://cwiki.apache.org/confluence/display/MAVEN/MojoFailureException
[ERROR] 
[ERROR] After correcting the problems, you can resume the build with the command
[ERROR]   mvn <goals> -rf :hadoop-hdfs
Build step 'Execute shell' marked build as failure
Archiving artifacts
Recording test results
Updating HDFS-9410
Sending e-mails to: hdfs-dev@hadoop.apache.org
Email was triggered for: Failure - Any
Sending email for trigger: Failure - Any



###################################################################################
############################## FAILED TESTS (if any) ##############################
4 tests failed.
FAILED:  org.apache.hadoop.hdfs.TestAbandonBlock.testAbandonBlock

Error Message:
org.xml.sax.SAXParseException; systemId: jar:file:/home/jenkins/.m2/repository/org/apache/hadoop/hadoop-common/3.0.0-SNAPSHOT/hadoop-common-3.0.0-SNAPSHOT.jar!/core-default.xml;
lineNumber: 923; columnNumber: 52; The element type "propeiption" must be terminated by the
matching end-tag "</propeiption>".

Stack Trace:
java.lang.RuntimeException: org.xml.sax.SAXParseException; systemId: jar:file:/home/jenkins/.m2/repository/org/apache/hadoop/hadoop-common/3.0.0-SNAPSHOT/hadoop-common-3.0.0-SNAPSHOT.jar!/core-default.xml;
lineNumber: 923; columnNumber: 52; The element type "propeiption" must be terminated by the
matching end-tag "</propeiption>".
	at org.apache.xerces.parsers.DOMParser.parse(Unknown Source)
	at org.apache.xerces.jaxp.DocumentBuilderImpl.parse(Unknown Source)
	at javax.xml.parsers.DocumentBuilder.parse(DocumentBuilder.java:150)
	at org.apache.hadoop.conf.Configuration.parse(Configuration.java:2555)
	at org.apache.hadoop.conf.Configuration.parse(Configuration.java:2543)
	at org.apache.hadoop.conf.Configuration.loadResource(Configuration.java:2614)
	at org.apache.hadoop.conf.Configuration.loadResources(Configuration.java:2567)
	at org.apache.hadoop.conf.Configuration.getProps(Configuration.java:2471)
	at org.apache.hadoop.conf.Configuration.get(Configuration.java:1296)
	at org.apache.hadoop.hdfs.server.datanode.FsDatasetTestUtils$Factory.getFactory(FsDatasetTestUtils.java:47)
	at org.apache.hadoop.hdfs.MiniDFSCluster$Builder.<init>(MiniDFSCluster.java:195)
	at org.apache.hadoop.hdfs.TestAbandonBlock.setUp(TestAbandonBlock.java:52)


FAILED:  org.apache.hadoop.hdfs.TestAbandonBlock.testAbandonBlock

Error Message:
null

Stack Trace:
java.lang.NullPointerException: null
	at org.apache.hadoop.hdfs.TestAbandonBlock.tearDown(TestAbandonBlock.java:59)


FAILED:  org.apache.hadoop.hdfs.TestAbandonBlock.testQuotaUpdatedWhenBlockAbandoned

Error Message:
org/apache/hadoop/util/ReflectionUtils

Stack Trace:
java.lang.NoClassDefFoundError: org/apache/hadoop/util/ReflectionUtils
	at java.net.URLClassLoader$1.run(URLClassLoader.java:366)
	at java.net.URLClassLoader$1.run(URLClassLoader.java:355)
	at java.security.AccessController.doPrivileged(Native Method)
	at java.net.URLClassLoader.findClass(URLClassLoader.java:354)
	at java.lang.ClassLoader.loadClass(ClassLoader.java:425)
	at sun.misc.Launcher$AppClassLoader.loadClass(Launcher.java:308)
	at java.lang.ClassLoader.loadClass(ClassLoader.java:358)
	at org.apache.hadoop.hdfs.server.datanode.FsDatasetTestUtils$Factory.getFactory(FsDatasetTestUtils.java:56)
	at org.apache.hadoop.hdfs.MiniDFSCluster$Builder.<init>(MiniDFSCluster.java:195)
	at org.apache.hadoop.hdfs.TestAbandonBlock.setUp(TestAbandonBlock.java:52)


FAILED:  org.apache.hadoop.hdfs.TestAbandonBlock.testQuotaUpdatedWhenBlockAbandoned

Error Message:
null

Stack Trace:
java.lang.NullPointerException: null
	at org.apache.hadoop.hdfs.TestAbandonBlock.tearDown(TestAbandonBlock.java:59)



Mime
  • Unnamed multipart/mixed (inline, None, 0 bytes)
View raw message