hadoop-hdfs-dev mailing list archives

Site index · List index
Message view « Date » · « Thread »
Top « Date » · « Thread »
From Apache Jenkins Server <jenk...@builds.apache.org>
Subject Hadoop-Hdfs-trunk - Build # 2501 - Still Failing
Date Tue, 03 Nov 2015 03:04:49 GMT
See https://builds.apache.org/job/Hadoop-Hdfs-trunk/2501/

###################################################################################
########################## LAST 60 LINES OF THE CONSOLE ###########################
[...truncated 9563 lines...]
[INFO] Executed tasks
[INFO] 
[INFO] --- maven-source-plugin:2.3:jar-no-fork (hadoop-java-sources) @ hadoop-hdfs-project
---
[INFO] 
[INFO] --- maven-source-plugin:2.3:test-jar-no-fork (hadoop-java-sources) @ hadoop-hdfs-project
---
[INFO] 
[INFO] --- maven-enforcer-plugin:1.3.1:enforce (dist-enforce) @ hadoop-hdfs-project ---
[INFO] 
[INFO] --- maven-site-plugin:3.4:attach-descriptor (attach-descriptor) @ hadoop-hdfs-project
---
[INFO] 
[INFO] --- maven-javadoc-plugin:2.8.1:jar (module-javadocs) @ hadoop-hdfs-project ---
[INFO] Skipping javadoc generation
[INFO] 
[INFO] --- maven-enforcer-plugin:1.3.1:enforce (depcheck) @ hadoop-hdfs-project ---
[INFO] 
[INFO] --- maven-checkstyle-plugin:2.15:checkstyle (default-cli) @ hadoop-hdfs-project ---
[INFO] 
[INFO] --- findbugs-maven-plugin:3.0.0:findbugs (default-cli) @ hadoop-hdfs-project ---
[INFO] ------------------------------------------------------------------------
[INFO] Reactor Summary:
[INFO] 
[INFO] Apache Hadoop HDFS Client ......................... SUCCESS [04:00 min]
[INFO] Apache Hadoop HDFS ................................ FAILURE [  03:18 h]
[INFO] Apache Hadoop HDFS Native Client .................. SKIPPED
[INFO] Apache Hadoop HttpFS .............................. SKIPPED
[INFO] Apache Hadoop HDFS BookKeeper Journal ............. SKIPPED
[INFO] Apache Hadoop HDFS-NFS ............................ SKIPPED
[INFO] Apache Hadoop HDFS Project ........................ SUCCESS [  0.096 s]
[INFO] ------------------------------------------------------------------------
[INFO] BUILD FAILURE
[INFO] ------------------------------------------------------------------------
[INFO] Total time: 03:22 h
[INFO] Finished at: 2015-11-03T03:04:40+00:00
[INFO] Final Memory: 57M/755M
[INFO] ------------------------------------------------------------------------
[ERROR] Failed to execute goal org.apache.maven.plugins:maven-surefire-plugin:2.17:test (default-test)
on project hadoop-hdfs: There are test failures.
[ERROR] 
[ERROR] Please refer to /home/jenkins/jenkins-slave/workspace/Hadoop-Hdfs-trunk/hadoop-hdfs-project/hadoop-hdfs/target/surefire-reports
for the individual test results.
[ERROR] -> [Help 1]
[ERROR] 
[ERROR] To see the full stack trace of the errors, re-run Maven with the -e switch.
[ERROR] Re-run Maven using the -X switch to enable full debug logging.
[ERROR] 
[ERROR] For more information about the errors and possible solutions, please read the following
articles:
[ERROR] [Help 1] http://cwiki.apache.org/confluence/display/MAVEN/MojoFailureException
[ERROR] 
[ERROR] After correcting the problems, you can resume the build with the command
[ERROR]   mvn <goals> -rf :hadoop-hdfs
Build step 'Execute shell' marked build as failure
Archiving artifacts
Recording test results
Updating HDFS-9329
Updating HADOOP-12508
Updating HADOOP-12533
Updating HDFS-9339
Updating MAPREDUCE-6525
Sending e-mails to: hdfs-dev@hadoop.apache.org
Email was triggered for: Failure - Any
Sending email for trigger: Failure - Any



###################################################################################
############################## FAILED TESTS (if any) ##############################
23 tests failed.
FAILED:  org.apache.hadoop.hdfs.TestCrcCorruption.testCorruptionDuringWrt

Error Message:
test timed out after 50000 milliseconds

Stack Trace:
java.lang.Exception: test timed out after 50000 milliseconds
	at java.lang.Object.wait(Native Method)
	at org.apache.hadoop.hdfs.DataStreamer.waitForAckedSeqno(DataStreamer.java:763)
	at org.apache.hadoop.hdfs.DFSOutputStream.flushInternal(DFSOutputStream.java:700)
	at org.apache.hadoop.hdfs.DFSOutputStream.closeImpl(DFSOutputStream.java:774)
	at org.apache.hadoop.hdfs.DFSOutputStream.close(DFSOutputStream.java:753)
	at org.apache.hadoop.fs.FSDataOutputStream$PositionCache.close(FSDataOutputStream.java:72)
	at org.apache.hadoop.fs.FSDataOutputStream.close(FSDataOutputStream.java:101)
	at org.apache.hadoop.hdfs.TestCrcCorruption.testCorruptionDuringWrt(TestCrcCorruption.java:134)


FAILED:  org.apache.hadoop.hdfs.TestEncryptionZonesWithKMS.testDelegationToken

Error Message:
org.apache.hadoop.security.authentication.client.AuthenticationException: Authentication failed,
status: 500, message: org/apache/hadoop/crypto/key/kms/server/KMSAuthenticationFilter$KMSResponse

Stack Trace:
java.io.IOException: org.apache.hadoop.security.authentication.client.AuthenticationException:
Authentication failed, status: 500, message: org/apache/hadoop/crypto/key/kms/server/KMSAuthenticationFilter$KMSResponse
	at org.apache.hadoop.security.authentication.client.AuthenticatedURL.extractToken(AuthenticatedURL.java:275)
	at org.apache.hadoop.security.authentication.client.PseudoAuthenticator.authenticate(PseudoAuthenticator.java:77)
	at org.apache.hadoop.security.token.delegation.web.DelegationTokenAuthenticator.authenticate(DelegationTokenAuthenticator.java:128)
	at org.apache.hadoop.security.authentication.client.KerberosAuthenticator.authenticate(KerberosAuthenticator.java:214)
	at org.apache.hadoop.security.token.delegation.web.DelegationTokenAuthenticator.authenticate(DelegationTokenAuthenticator.java:128)
	at org.apache.hadoop.security.authentication.client.AuthenticatedURL.openConnection(AuthenticatedURL.java:215)
	at org.apache.hadoop.security.token.delegation.web.DelegationTokenAuthenticatedURL.openConnection(DelegationTokenAuthenticatedURL.java:322)
	at org.apache.hadoop.crypto.key.kms.KMSClientProvider$1.run(KMSClientProvider.java:483)
	at org.apache.hadoop.crypto.key.kms.KMSClientProvider$1.run(KMSClientProvider.java:478)
	at java.security.AccessController.doPrivileged(Native Method)
	at javax.security.auth.Subject.doAs(Subject.java:415)
	at org.apache.hadoop.security.UserGroupInformation.doAs(UserGroupInformation.java:1669)
	at org.apache.hadoop.crypto.key.kms.KMSClientProvider.createConnection(KMSClientProvider.java:478)
	at org.apache.hadoop.crypto.key.kms.KMSClientProvider.createKeyInternal(KMSClientProvider.java:677)
	at org.apache.hadoop.crypto.key.kms.KMSClientProvider.createKey(KMSClientProvider.java:687)
	at org.apache.hadoop.crypto.key.KeyProviderExtension.createKey(KeyProviderExtension.java:74)
	at org.apache.hadoop.hdfs.DFSTestUtil.createKey(DFSTestUtil.java:1640)
	at org.apache.hadoop.hdfs.DFSTestUtil.createKey(DFSTestUtil.java:1621)
	at org.apache.hadoop.hdfs.TestEncryptionZones.setup(TestEncryptionZones.java:156)
	at org.apache.hadoop.hdfs.TestEncryptionZonesWithKMS.setup(TestEncryptionZonesWithKMS.java:56)


FAILED:  org.apache.hadoop.hdfs.TestEncryptionZonesWithKMS.testCreateEZPopulatesEDEKCache

Error Message:
null

Stack Trace:
java.lang.NullPointerException: null
	at org.apache.commons.io.IOUtils.copyLarge(IOUtils.java:1792)
	at org.apache.commons.io.IOUtils.copyLarge(IOUtils.java:1769)
	at org.apache.commons.io.IOUtils.copy(IOUtils.java:1744)
	at org.apache.hadoop.crypto.key.kms.server.MiniKMS.start(MiniKMS.java:159)
	at org.apache.hadoop.hdfs.TestEncryptionZonesWithKMS.setup(TestEncryptionZonesWithKMS.java:55)


FAILED:  org.apache.hadoop.hdfs.TestEncryptionZonesWithKMS.testVersionAndSuiteNegotiation

Error Message:
null

Stack Trace:
java.lang.NullPointerException: null
	at org.apache.commons.io.IOUtils.copyLarge(IOUtils.java:1792)
	at org.apache.commons.io.IOUtils.copyLarge(IOUtils.java:1769)
	at org.apache.commons.io.IOUtils.copy(IOUtils.java:1744)
	at org.apache.hadoop.crypto.key.kms.server.MiniKMS.start(MiniKMS.java:159)
	at org.apache.hadoop.hdfs.TestEncryptionZonesWithKMS.setup(TestEncryptionZonesWithKMS.java:55)


FAILED:  org.apache.hadoop.hdfs.TestEncryptionZonesWithKMS.testGetEZAsNonSuperUser

Error Message:
null

Stack Trace:
java.lang.NullPointerException: null
	at org.apache.commons.io.IOUtils.copyLarge(IOUtils.java:1792)
	at org.apache.commons.io.IOUtils.copyLarge(IOUtils.java:1769)
	at org.apache.commons.io.IOUtils.copy(IOUtils.java:1744)
	at org.apache.hadoop.crypto.key.kms.server.MiniKMS.start(MiniKMS.java:159)
	at org.apache.hadoop.hdfs.TestEncryptionZonesWithKMS.setup(TestEncryptionZonesWithKMS.java:55)


FAILED:  org.apache.hadoop.hdfs.TestEncryptionZonesWithKMS.testReadWriteUsingWebHdfs

Error Message:
null

Stack Trace:
java.lang.NullPointerException: null
	at org.apache.commons.io.IOUtils.copyLarge(IOUtils.java:1792)
	at org.apache.commons.io.IOUtils.copyLarge(IOUtils.java:1769)
	at org.apache.commons.io.IOUtils.copy(IOUtils.java:1744)
	at org.apache.hadoop.crypto.key.kms.server.MiniKMS.start(MiniKMS.java:159)
	at org.apache.hadoop.hdfs.TestEncryptionZonesWithKMS.setup(TestEncryptionZonesWithKMS.java:55)


FAILED:  org.apache.hadoop.hdfs.TestEncryptionZonesWithKMS.testEncryptionZonesOnRootPath

Error Message:
null

Stack Trace:
java.lang.NullPointerException: null
	at org.apache.commons.io.IOUtils.copyLarge(IOUtils.java:1792)
	at org.apache.commons.io.IOUtils.copyLarge(IOUtils.java:1769)
	at org.apache.commons.io.IOUtils.copy(IOUtils.java:1744)
	at org.apache.hadoop.crypto.key.kms.server.MiniKMS.start(MiniKMS.java:159)
	at org.apache.hadoop.hdfs.TestEncryptionZonesWithKMS.setup(TestEncryptionZonesWithKMS.java:55)


FAILED:  org.apache.hadoop.hdfs.TestEncryptionZonesWithKMS.testReadWrite

Error Message:
null

Stack Trace:
java.lang.NullPointerException: null
	at org.apache.commons.io.IOUtils.copyLarge(IOUtils.java:1792)
	at org.apache.commons.io.IOUtils.copyLarge(IOUtils.java:1769)
	at org.apache.commons.io.IOUtils.copy(IOUtils.java:1744)
	at org.apache.hadoop.crypto.key.kms.server.MiniKMS.start(MiniKMS.java:159)
	at org.apache.hadoop.hdfs.TestEncryptionZonesWithKMS.setup(TestEncryptionZonesWithKMS.java:55)


FAILED:  org.apache.hadoop.hdfs.TestEncryptionZonesWithKMS.testRenameFileSystem

Error Message:
null

Stack Trace:
java.lang.NullPointerException: null
	at org.apache.commons.io.IOUtils.copyLarge(IOUtils.java:1792)
	at org.apache.commons.io.IOUtils.copyLarge(IOUtils.java:1769)
	at org.apache.commons.io.IOUtils.copy(IOUtils.java:1744)
	at org.apache.hadoop.crypto.key.kms.server.MiniKMS.start(MiniKMS.java:159)
	at org.apache.hadoop.hdfs.TestEncryptionZonesWithKMS.setup(TestEncryptionZonesWithKMS.java:55)


FAILED:  org.apache.hadoop.hdfs.TestEncryptionZonesWithKMS.testListEncryptionZonesAsNonSuperUser

Error Message:
null

Stack Trace:
java.lang.NullPointerException: null
	at org.apache.commons.io.IOUtils.copyLarge(IOUtils.java:1792)
	at org.apache.commons.io.IOUtils.copyLarge(IOUtils.java:1769)
	at org.apache.commons.io.IOUtils.copy(IOUtils.java:1744)
	at org.apache.hadoop.crypto.key.kms.server.MiniKMS.start(MiniKMS.java:159)
	at org.apache.hadoop.hdfs.TestEncryptionZonesWithKMS.setup(TestEncryptionZonesWithKMS.java:55)


FAILED:  org.apache.hadoop.hdfs.TestEncryptionZonesWithKMS.testSnapshotsOnEncryptionZones

Error Message:
null

Stack Trace:
java.lang.NullPointerException: null
	at org.apache.commons.io.IOUtils.copyLarge(IOUtils.java:1792)
	at org.apache.commons.io.IOUtils.copyLarge(IOUtils.java:1769)
	at org.apache.commons.io.IOUtils.copy(IOUtils.java:1744)
	at org.apache.hadoop.crypto.key.kms.server.MiniKMS.start(MiniKMS.java:159)
	at org.apache.hadoop.hdfs.TestEncryptionZonesWithKMS.setup(TestEncryptionZonesWithKMS.java:55)


FAILED:  org.apache.hadoop.hdfs.TestEncryptionZonesWithKMS.testConcatFailsInEncryptionZones

Error Message:
null

Stack Trace:
java.lang.NullPointerException: null
	at org.apache.commons.io.IOUtils.copyLarge(IOUtils.java:1792)
	at org.apache.commons.io.IOUtils.copyLarge(IOUtils.java:1769)
	at org.apache.commons.io.IOUtils.copy(IOUtils.java:1744)
	at org.apache.hadoop.crypto.key.kms.server.MiniKMS.start(MiniKMS.java:159)
	at org.apache.hadoop.hdfs.TestEncryptionZonesWithKMS.setup(TestEncryptionZonesWithKMS.java:55)


FAILED:  org.apache.hadoop.hdfs.TestEncryptionZonesWithKMS.testOfflineImageViewerOnEncryptionZones

Error Message:
null

Stack Trace:
java.lang.NullPointerException: null
	at org.apache.commons.io.IOUtils.copyLarge(IOUtils.java:1792)
	at org.apache.commons.io.IOUtils.copyLarge(IOUtils.java:1769)
	at org.apache.commons.io.IOUtils.copy(IOUtils.java:1744)
	at org.apache.hadoop.crypto.key.kms.server.MiniKMS.start(MiniKMS.java:159)
	at org.apache.hadoop.hdfs.TestEncryptionZonesWithKMS.setup(TestEncryptionZonesWithKMS.java:55)


FAILED:  org.apache.hadoop.hdfs.TestEncryptionZonesWithKMS.testRenameFileContext

Error Message:
null

Stack Trace:
java.lang.NullPointerException: null
	at org.apache.commons.io.IOUtils.copyLarge(IOUtils.java:1792)
	at org.apache.commons.io.IOUtils.copyLarge(IOUtils.java:1769)
	at org.apache.commons.io.IOUtils.copy(IOUtils.java:1744)
	at org.apache.hadoop.crypto.key.kms.server.MiniKMS.start(MiniKMS.java:159)
	at org.apache.hadoop.hdfs.TestEncryptionZonesWithKMS.setup(TestEncryptionZonesWithKMS.java:55)


FAILED:  org.apache.hadoop.hdfs.TestEncryptionZonesWithKMS.testFsckOnEncryptionZones

Error Message:
null

Stack Trace:
java.lang.NullPointerException: null
	at org.apache.commons.io.IOUtils.copyLarge(IOUtils.java:1792)
	at org.apache.commons.io.IOUtils.copyLarge(IOUtils.java:1769)
	at org.apache.commons.io.IOUtils.copy(IOUtils.java:1744)
	at org.apache.hadoop.crypto.key.kms.server.MiniKMS.start(MiniKMS.java:159)
	at org.apache.hadoop.hdfs.TestEncryptionZonesWithKMS.setup(TestEncryptionZonesWithKMS.java:55)


FAILED:  org.apache.hadoop.hdfs.TestEncryptionZonesWithKMS.testBasicOperations

Error Message:
null

Stack Trace:
java.lang.NullPointerException: null
	at org.apache.commons.io.IOUtils.copyLarge(IOUtils.java:1792)
	at org.apache.commons.io.IOUtils.copyLarge(IOUtils.java:1769)
	at org.apache.commons.io.IOUtils.copy(IOUtils.java:1744)
	at org.apache.hadoop.crypto.key.kms.server.MiniKMS.start(MiniKMS.java:159)
	at org.apache.hadoop.hdfs.TestEncryptionZonesWithKMS.setup(TestEncryptionZonesWithKMS.java:55)


FAILED:  org.apache.hadoop.hdfs.TestEncryptionZonesWithKMS.testCreateEZWithNoProvider

Error Message:
null

Stack Trace:
java.lang.NullPointerException: null
	at org.apache.commons.io.IOUtils.copyLarge(IOUtils.java:1792)
	at org.apache.commons.io.IOUtils.copyLarge(IOUtils.java:1769)
	at org.apache.commons.io.IOUtils.copy(IOUtils.java:1744)
	at org.apache.hadoop.crypto.key.kms.server.MiniKMS.start(MiniKMS.java:159)
	at org.apache.hadoop.hdfs.TestEncryptionZonesWithKMS.setup(TestEncryptionZonesWithKMS.java:55)


FAILED:  org.apache.hadoop.hdfs.TestEncryptionZonesWithKMS.testStartFileRetry

Error Message:
null

Stack Trace:
java.lang.NullPointerException: null
	at org.apache.commons.io.IOUtils.copyLarge(IOUtils.java:1792)
	at org.apache.commons.io.IOUtils.copyLarge(IOUtils.java:1769)
	at org.apache.commons.io.IOUtils.copy(IOUtils.java:1744)
	at org.apache.hadoop.crypto.key.kms.server.MiniKMS.start(MiniKMS.java:159)
	at org.apache.hadoop.hdfs.TestEncryptionZonesWithKMS.setup(TestEncryptionZonesWithKMS.java:55)


FAILED:  org.apache.hadoop.hdfs.TestEncryptionZonesWithKMS.testEncryptionZonesOnRelativePath

Error Message:
null

Stack Trace:
java.lang.NullPointerException: null
	at org.apache.commons.io.IOUtils.copyLarge(IOUtils.java:1792)
	at org.apache.commons.io.IOUtils.copyLarge(IOUtils.java:1769)
	at org.apache.commons.io.IOUtils.copy(IOUtils.java:1744)
	at org.apache.hadoop.crypto.key.kms.server.MiniKMS.start(MiniKMS.java:159)
	at org.apache.hadoop.hdfs.TestEncryptionZonesWithKMS.setup(TestEncryptionZonesWithKMS.java:55)


FAILED:  org.apache.hadoop.hdfs.TestEncryptionZonesWithKMS.testEncryptionZonesWithSymlinks

Error Message:
null

Stack Trace:
java.lang.NullPointerException: null
	at org.apache.commons.io.IOUtils.copyLarge(IOUtils.java:1792)
	at org.apache.commons.io.IOUtils.copyLarge(IOUtils.java:1769)
	at org.apache.commons.io.IOUtils.copy(IOUtils.java:1744)
	at org.apache.hadoop.crypto.key.kms.server.MiniKMS.start(MiniKMS.java:159)
	at org.apache.hadoop.hdfs.TestEncryptionZonesWithKMS.setup(TestEncryptionZonesWithKMS.java:55)


FAILED:  org.apache.hadoop.hdfs.TestEncryptionZonesWithKMS.testIsEncryptedMethod

Error Message:
null

Stack Trace:
java.lang.NullPointerException: null
	at org.apache.commons.io.IOUtils.copyLarge(IOUtils.java:1792)
	at org.apache.commons.io.IOUtils.copyLarge(IOUtils.java:1769)
	at org.apache.commons.io.IOUtils.copy(IOUtils.java:1744)
	at org.apache.hadoop.crypto.key.kms.server.MiniKMS.start(MiniKMS.java:159)
	at org.apache.hadoop.hdfs.TestEncryptionZonesWithKMS.setup(TestEncryptionZonesWithKMS.java:55)


FAILED:  org.apache.hadoop.hdfs.server.blockmanagement.TestNodeCount.testNodeCount

Error Message:
Timeout: excess replica count not equal to 2 for block blk_1073741825_1001 after 20000 msec.
 Last counts: live = 2, excess = 0, corrupt = 0

Stack Trace:
java.util.concurrent.TimeoutException: Timeout: excess replica count not equal to 2 for block
blk_1073741825_1001 after 20000 msec.  Last counts: live = 2, excess = 0, corrupt = 0
	at org.apache.hadoop.hdfs.server.blockmanagement.TestNodeCount.checkTimeout(TestNodeCount.java:152)
	at org.apache.hadoop.hdfs.server.blockmanagement.TestNodeCount.checkTimeout(TestNodeCount.java:146)
	at org.apache.hadoop.hdfs.server.blockmanagement.TestNodeCount.testNodeCount(TestNodeCount.java:130)


FAILED:  org.apache.hadoop.hdfs.server.namenode.TestFileTruncate.testTruncateWithDataNodesRestart

Error Message:
Problem binding to [localhost:40102] java.net.BindException: Address already in use; For more
details see:  http://wiki.apache.org/hadoop/BindException

Stack Trace:
java.net.BindException: Problem binding to [localhost:40102] java.net.BindException: Address
already in use; For more details see:  http://wiki.apache.org/hadoop/BindException
	at sun.nio.ch.Net.bind0(Native Method)
	at sun.nio.ch.Net.bind(Net.java:444)
	at sun.nio.ch.Net.bind(Net.java:436)
	at sun.nio.ch.ServerSocketChannelImpl.bind(ServerSocketChannelImpl.java:214)
	at sun.nio.ch.ServerSocketAdaptor.bind(ServerSocketAdaptor.java:74)
	at org.apache.hadoop.ipc.Server.bind(Server.java:469)
	at org.apache.hadoop.ipc.Server$Listener.<init>(Server.java:695)
	at org.apache.hadoop.ipc.Server.<init>(Server.java:2464)
	at org.apache.hadoop.ipc.RPC$Server.<init>(RPC.java:945)
	at org.apache.hadoop.ipc.ProtobufRpcEngine$Server.<init>(ProtobufRpcEngine.java:535)
	at org.apache.hadoop.ipc.ProtobufRpcEngine.getServer(ProtobufRpcEngine.java:510)
	at org.apache.hadoop.ipc.RPC$Builder.build(RPC.java:787)
	at org.apache.hadoop.hdfs.server.datanode.DataNode.initIpcServer(DataNode.java:870)
	at org.apache.hadoop.hdfs.server.datanode.DataNode.startDataNode(DataNode.java:1208)
	at org.apache.hadoop.hdfs.server.datanode.DataNode.<init>(DataNode.java:467)
	at org.apache.hadoop.hdfs.server.datanode.DataNode.makeInstance(DataNode.java:2486)
	at org.apache.hadoop.hdfs.server.datanode.DataNode.instantiateDataNode(DataNode.java:2374)
	at org.apache.hadoop.hdfs.server.datanode.DataNode.createDataNode(DataNode.java:2421)
	at org.apache.hadoop.hdfs.MiniDFSCluster.restartDataNode(MiniDFSCluster.java:2195)
	at org.apache.hadoop.hdfs.MiniDFSCluster.restartDataNode(MiniDFSCluster.java:2234)
	at org.apache.hadoop.hdfs.server.namenode.TestFileTruncate.testTruncateWithDataNodesRestart(TestFileTruncate.java:683)



Mime
  • Unnamed multipart/mixed (inline, None, 0 bytes)
View raw message