hadoop-hdfs-dev mailing list archives

Site index · List index
Message view « Date » · « Thread »
Top « Date » · « Thread »
From Apache Jenkins Server <jenk...@builds.apache.org>
Subject Hadoop-Hdfs-trunk-Java8 - Build # 641 - Still Failing
Date Wed, 25 Nov 2015 09:08:03 GMT
See https://builds.apache.org/job/Hadoop-Hdfs-trunk-Java8/641/

###################################################################################
########################## LAST 60 LINES OF THE CONSOLE ###########################
[...truncated 7230 lines...]
[INFO] Executing tasks

main:
    [mkdir] Created dir: /home/jenkins/jenkins-slave/workspace/Hadoop-Hdfs-trunk-Java8/hadoop-hdfs-project/target/test-dir
[INFO] Executed tasks
[INFO] 
[INFO] --- maven-source-plugin:2.3:jar-no-fork (hadoop-java-sources) @ hadoop-hdfs-project
---
[INFO] 
[INFO] --- maven-source-plugin:2.3:test-jar-no-fork (hadoop-java-sources) @ hadoop-hdfs-project
---
[INFO] 
[INFO] --- maven-enforcer-plugin:1.3.1:enforce (dist-enforce) @ hadoop-hdfs-project ---
[INFO] 
[INFO] --- maven-site-plugin:3.4:attach-descriptor (attach-descriptor) @ hadoop-hdfs-project
---
[INFO] 
[INFO] --- maven-javadoc-plugin:2.8.1:jar (module-javadocs) @ hadoop-hdfs-project ---
[INFO] Not executing Javadoc as the project is not a Java classpath-capable package
[INFO] 
[INFO] --- maven-enforcer-plugin:1.3.1:enforce (depcheck) @ hadoop-hdfs-project ---
[INFO] 
[INFO] --- maven-checkstyle-plugin:2.15:checkstyle (default-cli) @ hadoop-hdfs-project ---
[INFO] 
[INFO] --- findbugs-maven-plugin:3.0.0:findbugs (default-cli) @ hadoop-hdfs-project ---
[INFO] ------------------------------------------------------------------------
[INFO] Reactor Summary:
[INFO] 
[INFO] Apache Hadoop HDFS Client ......................... SUCCESS [05:59 min]
[INFO] Apache Hadoop HDFS ................................ FAILURE [  03:58 h]
[INFO] Apache Hadoop HDFS Native Client .................. SKIPPED
[INFO] Apache Hadoop HttpFS .............................. SKIPPED
[INFO] Apache Hadoop HDFS BookKeeper Journal ............. SKIPPED
[INFO] Apache Hadoop HDFS-NFS ............................ SKIPPED
[INFO] Apache Hadoop HDFS Project ........................ SUCCESS [  0.116 s]
[INFO] ------------------------------------------------------------------------
[INFO] BUILD FAILURE
[INFO] ------------------------------------------------------------------------
[INFO] Total time: 04:04 h
[INFO] Finished at: 2015-11-25T09:07:35+00:00
[INFO] Final Memory: 56M/669M
[INFO] ------------------------------------------------------------------------
[ERROR] Failed to execute goal org.apache.maven.plugins:maven-surefire-plugin:2.17:test (default-test)
on project hadoop-hdfs: There are test failures.
[ERROR] 
[ERROR] Please refer to /home/jenkins/jenkins-slave/workspace/Hadoop-Hdfs-trunk-Java8/hadoop-hdfs-project/hadoop-hdfs/target/surefire-reports
for the individual test results.
[ERROR] -> [Help 1]
[ERROR] 
[ERROR] To see the full stack trace of the errors, re-run Maven with the -e switch.
[ERROR] Re-run Maven using the -X switch to enable full debug logging.
[ERROR] 
[ERROR] For more information about the errors and possible solutions, please read the following
articles:
[ERROR] [Help 1] http://cwiki.apache.org/confluence/display/MAVEN/MojoFailureException
[ERROR] 
[ERROR] After correcting the problems, you can resume the build with the command
[ERROR]   mvn <goals> -rf :hadoop-hdfs
Build step 'Execute shell' marked build as failure
Archiving artifacts
Recording test results
Updating HADOOP-12415
Sending e-mails to: hdfs-dev@hadoop.apache.org
Email was triggered for: Failure - Any
Sending email for trigger: Failure - Any



###################################################################################
############################## FAILED TESTS (if any) ##############################
21 tests failed.
FAILED:  org.apache.hadoop.hdfs.TestDistributedFileSystem.testDFSClientPeerWriteTimeout

Error Message:
write timedout too late in 1342 ms

Stack Trace:
java.lang.AssertionError: write timedout too late in 1342 ms
	at org.junit.Assert.fail(Assert.java:88)
	at org.junit.Assert.assertTrue(Assert.java:41)
	at org.apache.hadoop.hdfs.TestDistributedFileSystem.testDFSClientPeerWriteTimeout(TestDistributedFileSystem.java:1042)


FAILED:  org.apache.hadoop.hdfs.TestEncryptionZonesWithKMS.testReadWrite

Error Message:
org/apache/hadoop/fs/BatchedRemoteIterator

Stack Trace:
java.lang.NoClassDefFoundError: org/apache/hadoop/fs/BatchedRemoteIterator
	at java.lang.ClassLoader.defineClass1(Native Method)
	at java.lang.ClassLoader.defineClass(ClassLoader.java:760)
	at java.security.SecureClassLoader.defineClass(SecureClassLoader.java:142)
	at java.net.URLClassLoader.defineClass(URLClassLoader.java:455)
	at java.net.URLClassLoader.access$100(URLClassLoader.java:73)
	at java.net.URLClassLoader$1.run(URLClassLoader.java:367)
	at java.net.URLClassLoader$1.run(URLClassLoader.java:361)
	at java.security.AccessController.doPrivileged(Native Method)
	at java.net.URLClassLoader.findClass(URLClassLoader.java:360)
	at java.lang.ClassLoader.loadClass(ClassLoader.java:424)
	at sun.misc.Launcher$AppClassLoader.loadClass(Launcher.java:308)
	at java.lang.ClassLoader.loadClass(ClassLoader.java:357)
	at org.apache.hadoop.hdfs.DFSClient.listEncryptionZones(DFSClient.java:2682)
	at org.apache.hadoop.hdfs.DistributedFileSystem.listEncryptionZones(DistributedFileSystem.java:2079)
	at org.apache.hadoop.hdfs.client.HdfsAdmin.listEncryptionZones(HdfsAdmin.java:305)
	at org.apache.hadoop.hdfs.TestEncryptionZones.assertNumZones(TestEncryptionZones.java:176)
	at org.apache.hadoop.hdfs.TestEncryptionZones.testReadWrite(TestEncryptionZones.java:609)
	at sun.reflect.NativeMethodAccessorImpl.invoke0(Native Method)
	at sun.reflect.NativeMethodAccessorImpl.invoke(NativeMethodAccessorImpl.java:62)
	at sun.reflect.DelegatingMethodAccessorImpl.invoke(DelegatingMethodAccessorImpl.java:43)
	at java.lang.reflect.Method.invoke(Method.java:483)
	at org.junit.runners.model.FrameworkMethod$1.runReflectiveCall(FrameworkMethod.java:47)
	at org.junit.internal.runners.model.ReflectiveCallable.run(ReflectiveCallable.java:12)
	at org.junit.runners.model.FrameworkMethod.invokeExplosively(FrameworkMethod.java:44)
	at org.junit.internal.runners.statements.InvokeMethod.evaluate(InvokeMethod.java:17)
	at org.junit.internal.runners.statements.FailOnTimeout$StatementThread.run(FailOnTimeout.java:74)
Caused by: java.lang.ClassNotFoundException: org.apache.hadoop.fs.BatchedRemoteIterator
	at java.net.URLClassLoader$1.run(URLClassLoader.java:372)
	at java.net.URLClassLoader$1.run(URLClassLoader.java:361)
	at java.security.AccessController.doPrivileged(Native Method)
	at java.net.URLClassLoader.findClass(URLClassLoader.java:360)
	at java.lang.ClassLoader.loadClass(ClassLoader.java:424)
	at sun.misc.Launcher$AppClassLoader.loadClass(Launcher.java:308)
	at java.lang.ClassLoader.loadClass(ClassLoader.java:357)
	at java.lang.ClassLoader.defineClass1(Native Method)
	at java.lang.ClassLoader.defineClass(ClassLoader.java:760)
	at java.security.SecureClassLoader.defineClass(SecureClassLoader.java:142)
	at java.net.URLClassLoader.defineClass(URLClassLoader.java:455)
	at java.net.URLClassLoader.access$100(URLClassLoader.java:73)
	at java.net.URLClassLoader$1.run(URLClassLoader.java:367)
	at java.net.URLClassLoader$1.run(URLClassLoader.java:361)
	at java.security.AccessController.doPrivileged(Native Method)
	at java.net.URLClassLoader.findClass(URLClassLoader.java:360)
	at java.lang.ClassLoader.loadClass(ClassLoader.java:424)
	at sun.misc.Launcher$AppClassLoader.loadClass(Launcher.java:308)
	at java.lang.ClassLoader.loadClass(ClassLoader.java:357)
	at org.apache.hadoop.hdfs.DFSClient.listEncryptionZones(DFSClient.java:2682)
	at org.apache.hadoop.hdfs.DistributedFileSystem.listEncryptionZones(DistributedFileSystem.java:2079)
	at org.apache.hadoop.hdfs.client.HdfsAdmin.listEncryptionZones(HdfsAdmin.java:305)
	at org.apache.hadoop.hdfs.TestEncryptionZones.assertNumZones(TestEncryptionZones.java:176)
	at org.apache.hadoop.hdfs.TestEncryptionZones.testReadWrite(TestEncryptionZones.java:609)
	at sun.reflect.NativeMethodAccessorImpl.invoke0(Native Method)
	at sun.reflect.NativeMethodAccessorImpl.invoke(NativeMethodAccessorImpl.java:62)
	at sun.reflect.DelegatingMethodAccessorImpl.invoke(DelegatingMethodAccessorImpl.java:43)
	at java.lang.reflect.Method.invoke(Method.java:483)
	at org.junit.runners.model.FrameworkMethod$1.runReflectiveCall(FrameworkMethod.java:47)
	at org.junit.internal.runners.model.ReflectiveCallable.run(ReflectiveCallable.java:12)
	at org.junit.runners.model.FrameworkMethod.invokeExplosively(FrameworkMethod.java:44)
	at org.junit.internal.runners.statements.InvokeMethod.evaluate(InvokeMethod.java:17)
	at org.junit.internal.runners.statements.FailOnTimeout$StatementThread.run(FailOnTimeout.java:74)


FAILED:  org.apache.hadoop.hdfs.TestEncryptionZonesWithKMS.testRenameFileSystem

Error Message:
fs.AbstractFileSystem.hdfs.impl=null: No AbstractFileSystem configured for scheme: hdfs

Stack Trace:
org.apache.hadoop.fs.UnsupportedFileSystemException: fs.AbstractFileSystem.hdfs.impl=null:
No AbstractFileSystem configured for scheme: hdfs
	at org.apache.hadoop.fs.AbstractFileSystem.createFileSystem(AbstractFileSystem.java:161)
	at org.apache.hadoop.fs.AbstractFileSystem.get(AbstractFileSystem.java:250)
	at org.apache.hadoop.fs.FileContext$2.run(FileContext.java:332)
	at org.apache.hadoop.fs.FileContext$2.run(FileContext.java:329)
	at java.security.AccessController.doPrivileged(Native Method)
	at javax.security.auth.Subject.doAs(Subject.java:422)
	at org.apache.hadoop.security.UserGroupInformation.doAs(UserGroupInformation.java:1669)
	at org.apache.hadoop.fs.FileContext.getAbstractFileSystem(FileContext.java:329)
	at org.apache.hadoop.fs.FileContext.getFileContext(FileContext.java:446)
	at org.apache.hadoop.hdfs.TestEncryptionZones.setup(TestEncryptionZones.java:153)
	at org.apache.hadoop.hdfs.TestEncryptionZonesWithKMS.setup(TestEncryptionZonesWithKMS.java:56)


FAILED:  org.apache.hadoop.hdfs.TestEncryptionZonesWithKMS.testListEncryptionZonesAsNonSuperUser

Error Message:
fs.AbstractFileSystem.hdfs.impl=null: No AbstractFileSystem configured for scheme: hdfs

Stack Trace:
org.apache.hadoop.fs.UnsupportedFileSystemException: fs.AbstractFileSystem.hdfs.impl=null:
No AbstractFileSystem configured for scheme: hdfs
	at org.apache.hadoop.fs.AbstractFileSystem.createFileSystem(AbstractFileSystem.java:161)
	at org.apache.hadoop.fs.AbstractFileSystem.get(AbstractFileSystem.java:250)
	at org.apache.hadoop.fs.FileContext$2.run(FileContext.java:332)
	at org.apache.hadoop.fs.FileContext$2.run(FileContext.java:329)
	at java.security.AccessController.doPrivileged(Native Method)
	at javax.security.auth.Subject.doAs(Subject.java:422)
	at org.apache.hadoop.security.UserGroupInformation.doAs(UserGroupInformation.java:1669)
	at org.apache.hadoop.fs.FileContext.getAbstractFileSystem(FileContext.java:329)
	at org.apache.hadoop.fs.FileContext.getFileContext(FileContext.java:446)
	at org.apache.hadoop.hdfs.TestEncryptionZones.setup(TestEncryptionZones.java:153)
	at org.apache.hadoop.hdfs.TestEncryptionZonesWithKMS.setup(TestEncryptionZonesWithKMS.java:56)


FAILED:  org.apache.hadoop.hdfs.TestEncryptionZonesWithKMS.testSnapshotsOnEncryptionZones

Error Message:
null

Stack Trace:
java.lang.NullPointerException: null
	at org.apache.commons.io.IOUtils.copyLarge(IOUtils.java:1792)
	at org.apache.commons.io.IOUtils.copyLarge(IOUtils.java:1769)
	at org.apache.commons.io.IOUtils.copy(IOUtils.java:1744)
	at org.apache.hadoop.crypto.key.kms.server.MiniKMS.start(MiniKMS.java:159)
	at org.apache.hadoop.hdfs.TestEncryptionZonesWithKMS.setup(TestEncryptionZonesWithKMS.java:55)


FAILED:  org.apache.hadoop.hdfs.TestEncryptionZonesWithKMS.testConcatFailsInEncryptionZones

Error Message:
null

Stack Trace:
java.lang.NullPointerException: null
	at org.apache.commons.io.IOUtils.copyLarge(IOUtils.java:1792)
	at org.apache.commons.io.IOUtils.copyLarge(IOUtils.java:1769)
	at org.apache.commons.io.IOUtils.copy(IOUtils.java:1744)
	at org.apache.hadoop.crypto.key.kms.server.MiniKMS.start(MiniKMS.java:159)
	at org.apache.hadoop.hdfs.TestEncryptionZonesWithKMS.setup(TestEncryptionZonesWithKMS.java:55)


FAILED:  org.apache.hadoop.hdfs.TestEncryptionZonesWithKMS.testOfflineImageViewerOnEncryptionZones

Error Message:
null

Stack Trace:
java.lang.NullPointerException: null
	at org.apache.commons.io.IOUtils.copyLarge(IOUtils.java:1792)
	at org.apache.commons.io.IOUtils.copyLarge(IOUtils.java:1769)
	at org.apache.commons.io.IOUtils.copy(IOUtils.java:1744)
	at org.apache.hadoop.crypto.key.kms.server.MiniKMS.start(MiniKMS.java:159)
	at org.apache.hadoop.hdfs.TestEncryptionZonesWithKMS.setup(TestEncryptionZonesWithKMS.java:55)


FAILED:  org.apache.hadoop.hdfs.TestEncryptionZonesWithKMS.testRenameFileContext

Error Message:
null

Stack Trace:
java.lang.NullPointerException: null
	at org.apache.commons.io.IOUtils.copyLarge(IOUtils.java:1792)
	at org.apache.commons.io.IOUtils.copyLarge(IOUtils.java:1769)
	at org.apache.commons.io.IOUtils.copy(IOUtils.java:1744)
	at org.apache.hadoop.crypto.key.kms.server.MiniKMS.start(MiniKMS.java:159)
	at org.apache.hadoop.hdfs.TestEncryptionZonesWithKMS.setup(TestEncryptionZonesWithKMS.java:55)


FAILED:  org.apache.hadoop.hdfs.TestEncryptionZonesWithKMS.testFsckOnEncryptionZones

Error Message:
null

Stack Trace:
java.lang.NullPointerException: null
	at org.apache.commons.io.IOUtils.copyLarge(IOUtils.java:1792)
	at org.apache.commons.io.IOUtils.copyLarge(IOUtils.java:1769)
	at org.apache.commons.io.IOUtils.copy(IOUtils.java:1744)
	at org.apache.hadoop.crypto.key.kms.server.MiniKMS.start(MiniKMS.java:159)
	at org.apache.hadoop.hdfs.TestEncryptionZonesWithKMS.setup(TestEncryptionZonesWithKMS.java:55)


FAILED:  org.apache.hadoop.hdfs.TestEncryptionZonesWithKMS.testBasicOperations

Error Message:
null

Stack Trace:
java.lang.NullPointerException: null
	at org.apache.commons.io.IOUtils.copyLarge(IOUtils.java:1792)
	at org.apache.commons.io.IOUtils.copyLarge(IOUtils.java:1769)
	at org.apache.commons.io.IOUtils.copy(IOUtils.java:1744)
	at org.apache.hadoop.crypto.key.kms.server.MiniKMS.start(MiniKMS.java:159)
	at org.apache.hadoop.hdfs.TestEncryptionZonesWithKMS.setup(TestEncryptionZonesWithKMS.java:55)


FAILED:  org.apache.hadoop.hdfs.TestEncryptionZonesWithKMS.testCreateEZWithNoProvider

Error Message:
null

Stack Trace:
java.lang.NullPointerException: null
	at org.apache.commons.io.IOUtils.copyLarge(IOUtils.java:1792)
	at org.apache.commons.io.IOUtils.copyLarge(IOUtils.java:1769)
	at org.apache.commons.io.IOUtils.copy(IOUtils.java:1744)
	at org.apache.hadoop.crypto.key.kms.server.MiniKMS.start(MiniKMS.java:159)
	at org.apache.hadoop.hdfs.TestEncryptionZonesWithKMS.setup(TestEncryptionZonesWithKMS.java:55)


FAILED:  org.apache.hadoop.hdfs.TestEncryptionZonesWithKMS.testStartFileRetry

Error Message:
null

Stack Trace:
java.lang.NullPointerException: null
	at org.apache.commons.io.IOUtils.copyLarge(IOUtils.java:1792)
	at org.apache.commons.io.IOUtils.copyLarge(IOUtils.java:1769)
	at org.apache.commons.io.IOUtils.copy(IOUtils.java:1744)
	at org.apache.hadoop.crypto.key.kms.server.MiniKMS.start(MiniKMS.java:159)
	at org.apache.hadoop.hdfs.TestEncryptionZonesWithKMS.setup(TestEncryptionZonesWithKMS.java:55)


FAILED:  org.apache.hadoop.hdfs.TestEncryptionZonesWithKMS.testEncryptionZonesOnRelativePath

Error Message:
null

Stack Trace:
java.lang.NullPointerException: null
	at org.apache.commons.io.IOUtils.copyLarge(IOUtils.java:1792)
	at org.apache.commons.io.IOUtils.copyLarge(IOUtils.java:1769)
	at org.apache.commons.io.IOUtils.copy(IOUtils.java:1744)
	at org.apache.hadoop.crypto.key.kms.server.MiniKMS.start(MiniKMS.java:159)
	at org.apache.hadoop.hdfs.TestEncryptionZonesWithKMS.setup(TestEncryptionZonesWithKMS.java:55)


FAILED:  org.apache.hadoop.hdfs.TestEncryptionZonesWithKMS.testEncryptionZonesWithSymlinks

Error Message:
null

Stack Trace:
java.lang.NullPointerException: null
	at org.apache.commons.io.IOUtils.copyLarge(IOUtils.java:1792)
	at org.apache.commons.io.IOUtils.copyLarge(IOUtils.java:1769)
	at org.apache.commons.io.IOUtils.copy(IOUtils.java:1744)
	at org.apache.hadoop.crypto.key.kms.server.MiniKMS.start(MiniKMS.java:159)
	at org.apache.hadoop.hdfs.TestEncryptionZonesWithKMS.setup(TestEncryptionZonesWithKMS.java:55)


FAILED:  org.apache.hadoop.hdfs.TestEncryptionZonesWithKMS.testIsEncryptedMethod

Error Message:
null

Stack Trace:
java.lang.NullPointerException: null
	at org.apache.commons.io.IOUtils.copyLarge(IOUtils.java:1792)
	at org.apache.commons.io.IOUtils.copyLarge(IOUtils.java:1769)
	at org.apache.commons.io.IOUtils.copy(IOUtils.java:1744)
	at org.apache.hadoop.crypto.key.kms.server.MiniKMS.start(MiniKMS.java:159)
	at org.apache.hadoop.hdfs.TestEncryptionZonesWithKMS.setup(TestEncryptionZonesWithKMS.java:55)


FAILED:  org.apache.hadoop.hdfs.TestRollingUpgrade.testCheckpointWithMultipleNN

Error Message:
Test resulted in an unexpected exit

Stack Trace:
java.lang.AssertionError: Test resulted in an unexpected exit
	at org.apache.hadoop.hdfs.MiniDFSCluster.shutdown(MiniDFSCluster.java:1895)
	at org.apache.hadoop.hdfs.MiniDFSCluster.shutdown(MiniDFSCluster.java:1882)
	at org.apache.hadoop.hdfs.MiniDFSCluster.shutdown(MiniDFSCluster.java:1875)
	at org.apache.hadoop.hdfs.qjournal.MiniQJMHACluster.shutdown(MiniQJMHACluster.java:160)
	at org.apache.hadoop.hdfs.TestRollingUpgrade.testCheckpoint(TestRollingUpgrade.java:601)
	at org.apache.hadoop.hdfs.TestRollingUpgrade.testCheckpointWithMultipleNN(TestRollingUpgrade.java:565)


FAILED:  org.apache.hadoop.hdfs.TestRollingUpgrade.testDFSAdminRollingUpgradeCommands

Error Message:
expected null, but was:<javax.management.openmbean.CompositeDataSupport(compositeType=javax.management.openmbean.CompositeType(name=org.apache.hadoop.hdfs.protocol.RollingUpgradeInfo$Bean,items=((itemName=blockPoolId,itemType=javax.management.openmbean.SimpleType(name=java.lang.String)),(itemName=createdRollbackImages,itemType=javax.management.openmbean.SimpleType(name=java.lang.Boolean)),(itemName=finalizeTime,itemType=javax.management.openmbean.SimpleType(name=java.lang.Long)),(itemName=startTime,itemType=javax.management.openmbean.SimpleType(name=java.lang.Long)))),contents={blockPoolId=BP-540620785-67.195.81.150-1448438275535,
createdRollbackImages=true, finalizeTime=0, startTime=1448438276990})>

Stack Trace:
java.lang.AssertionError: expected null, but was:<javax.management.openmbean.CompositeDataSupport(compositeType=javax.management.openmbean.CompositeType(name=org.apache.hadoop.hdfs.protocol.RollingUpgradeInfo$Bean,items=((itemName=blockPoolId,itemType=javax.management.openmbean.SimpleType(name=java.lang.String)),(itemName=createdRollbackImages,itemType=javax.management.openmbean.SimpleType(name=java.lang.Boolean)),(itemName=finalizeTime,itemType=javax.management.openmbean.SimpleType(name=java.lang.Long)),(itemName=startTime,itemType=javax.management.openmbean.SimpleType(name=java.lang.Long)))),contents={blockPoolId=BP-540620785-67.195.81.150-1448438275535,
createdRollbackImages=true, finalizeTime=0, startTime=1448438276990})>
	at org.junit.Assert.fail(Assert.java:88)
	at org.junit.Assert.failNotNull(Assert.java:664)
	at org.junit.Assert.assertNull(Assert.java:646)
	at org.junit.Assert.assertNull(Assert.java:656)
	at org.apache.hadoop.hdfs.TestRollingUpgrade.checkMxBeanIsNull(TestRollingUpgrade.java:293)
	at org.apache.hadoop.hdfs.TestRollingUpgrade.testDFSAdminRollingUpgradeCommands(TestRollingUpgrade.java:101)


FAILED:  org.apache.hadoop.hdfs.TestRollingUpgrade.testRollback

Error Message:
expected null, but was:<javax.management.openmbean.CompositeDataSupport(compositeType=javax.management.openmbean.CompositeType(name=org.apache.hadoop.hdfs.protocol.RollingUpgradeInfo$Bean,items=((itemName=blockPoolId,itemType=javax.management.openmbean.SimpleType(name=java.lang.String)),(itemName=createdRollbackImages,itemType=javax.management.openmbean.SimpleType(name=java.lang.Boolean)),(itemName=finalizeTime,itemType=javax.management.openmbean.SimpleType(name=java.lang.Long)),(itemName=startTime,itemType=javax.management.openmbean.SimpleType(name=java.lang.Long)))),contents={blockPoolId=BP-540620785-67.195.81.150-1448438275535,
createdRollbackImages=true, finalizeTime=0, startTime=1448438276990})>

Stack Trace:
java.lang.AssertionError: expected null, but was:<javax.management.openmbean.CompositeDataSupport(compositeType=javax.management.openmbean.CompositeType(name=org.apache.hadoop.hdfs.protocol.RollingUpgradeInfo$Bean,items=((itemName=blockPoolId,itemType=javax.management.openmbean.SimpleType(name=java.lang.String)),(itemName=createdRollbackImages,itemType=javax.management.openmbean.SimpleType(name=java.lang.Boolean)),(itemName=finalizeTime,itemType=javax.management.openmbean.SimpleType(name=java.lang.Long)),(itemName=startTime,itemType=javax.management.openmbean.SimpleType(name=java.lang.Long)))),contents={blockPoolId=BP-540620785-67.195.81.150-1448438275535,
createdRollbackImages=true, finalizeTime=0, startTime=1448438276990})>
	at org.junit.Assert.fail(Assert.java:88)
	at org.junit.Assert.failNotNull(Assert.java:664)
	at org.junit.Assert.assertNull(Assert.java:646)
	at org.junit.Assert.assertNull(Assert.java:656)
	at org.apache.hadoop.hdfs.TestRollingUpgrade.checkMxBeanIsNull(TestRollingUpgrade.java:293)
	at org.apache.hadoop.hdfs.TestRollingUpgrade.testRollback(TestRollingUpgrade.java:322)


FAILED:  org.apache.hadoop.hdfs.TestWriteReadStripedFile.testConcatWithDifferentECPolicy

Error Message:
org/apache/hadoop/ipc/ProtobufHelper

Stack Trace:
java.lang.NoClassDefFoundError: org/apache/hadoop/ipc/ProtobufHelper
	at java.net.URLClassLoader$1.run(URLClassLoader.java:372)
	at java.net.URLClassLoader$1.run(URLClassLoader.java:361)
	at java.security.AccessController.doPrivileged(Native Method)
	at java.net.URLClassLoader.findClass(URLClassLoader.java:360)
	at java.lang.ClassLoader.loadClass(ClassLoader.java:424)
	at sun.misc.Launcher$AppClassLoader.loadClass(Launcher.java:308)
	at java.lang.ClassLoader.loadClass(ClassLoader.java:357)
	at org.apache.hadoop.hdfs.protocolPB.ClientNamenodeProtocolTranslatorPB.concat(ClientNamenodeProtocolTranslatorPB.java:508)
	at sun.reflect.NativeMethodAccessorImpl.invoke0(Native Method)
	at sun.reflect.NativeMethodAccessorImpl.invoke(NativeMethodAccessorImpl.java:62)
	at sun.reflect.DelegatingMethodAccessorImpl.invoke(DelegatingMethodAccessorImpl.java:43)
	at java.lang.reflect.Method.invoke(Method.java:483)
	at org.apache.hadoop.io.retry.RetryInvocationHandler.invokeMethod(RetryInvocationHandler.java:255)
	at org.apache.hadoop.io.retry.RetryInvocationHandler.invoke(RetryInvocationHandler.java:103)
	at com.sun.proxy.$Proxy25.concat(Unknown Source)
	at org.apache.hadoop.hdfs.DFSClient.concat(DFSClient.java:1468)
	at org.apache.hadoop.hdfs.DistributedFileSystem.concat(DistributedFileSystem.java:584)
	at org.apache.hadoop.hdfs.TestWriteReadStripedFile.testConcatWithDifferentECPolicy(TestWriteReadStripedFile.java:307)


FAILED:  org.apache.hadoop.hdfs.shortcircuit.TestShortCircuitCache.testDataXceiverCleansUpSlotsOnFailure

Error Message:
expected:<1> but was:<2>

Stack Trace:
java.lang.AssertionError: expected:<1> but was:<2>
	at org.junit.Assert.fail(Assert.java:88)
	at org.junit.Assert.failNotEquals(Assert.java:743)
	at org.junit.Assert.assertEquals(Assert.java:118)
	at org.junit.Assert.assertEquals(Assert.java:555)
	at org.junit.Assert.assertEquals(Assert.java:542)
	at org.apache.hadoop.hdfs.shortcircuit.TestShortCircuitCache$17.accept(TestShortCircuitCache.java:633)
	at org.apache.hadoop.hdfs.server.datanode.ShortCircuitRegistry.visit(ShortCircuitRegistry.java:395)
	at org.apache.hadoop.hdfs.shortcircuit.TestShortCircuitCache.checkNumberOfSegmentsAndSlots(TestShortCircuitCache.java:628)
	at org.apache.hadoop.hdfs.shortcircuit.TestShortCircuitCache.testDataXceiverCleansUpSlotsOnFailure(TestShortCircuitCache.java:682)


FAILED:  org.apache.hadoop.security.TestPermission.testBackwardCompatibility

Error Message:
expected:<18> but was:<0>

Stack Trace:
java.lang.AssertionError: expected:<18> but was:<0>
	at org.junit.Assert.fail(Assert.java:88)
	at org.junit.Assert.failNotEquals(Assert.java:743)
	at org.junit.Assert.assertEquals(Assert.java:118)
	at org.junit.Assert.assertEquals(Assert.java:555)
	at org.junit.Assert.assertEquals(Assert.java:542)
	at org.apache.hadoop.security.TestPermission.testBackwardCompatibility(TestPermission.java:98)



Mime
  • Unnamed multipart/mixed (inline, None, 0 bytes)
View raw message