hadoop-hdfs-dev mailing list archives

Site index · List index
Message view « Date » · « Thread »
Top « Date » · « Thread »
From Apache Jenkins Server <jenk...@builds.apache.org>
Subject Hadoop-Hdfs-trunk-Java8 - Build # 629 - Still Failing
Date Mon, 23 Nov 2015 07:22:50 GMT
See https://builds.apache.org/job/Hadoop-Hdfs-trunk-Java8/629/

###################################################################################
########################## LAST 60 LINES OF THE CONSOLE ###########################
[...truncated 6990 lines...]
[INFO] --- maven-enforcer-plugin:1.3.1:enforce (depcheck) @ hadoop-hdfs-project ---
[INFO] 
[INFO] --- maven-checkstyle-plugin:2.15:checkstyle (default-cli) @ hadoop-hdfs-project ---
[INFO] 
[INFO] --- findbugs-maven-plugin:3.0.0:findbugs (default-cli) @ hadoop-hdfs-project ---
[INFO] ------------------------------------------------------------------------
[INFO] Reactor Summary:
[INFO] 
[INFO] Apache Hadoop HDFS Client ......................... SUCCESS [03:56 min]
[INFO] Apache Hadoop HDFS ................................ FAILURE [  03:21 h]
[INFO] Apache Hadoop HDFS Native Client .................. SKIPPED
[INFO] Apache Hadoop HttpFS .............................. SKIPPED
[INFO] Apache Hadoop HDFS BookKeeper Journal ............. SKIPPED
[INFO] Apache Hadoop HDFS-NFS ............................ SKIPPED
[INFO] Apache Hadoop HDFS Project ........................ SUCCESS [  0.251 s]
[INFO] ------------------------------------------------------------------------
[INFO] BUILD FAILURE
[INFO] ------------------------------------------------------------------------
[INFO] Total time: 03:25 h
[INFO] Finished at: 2015-11-23T07:22:27+00:00
[INFO] Final Memory: 56M/458M
[INFO] ------------------------------------------------------------------------
[ERROR] Failed to execute goal org.apache.maven.plugins:maven-surefire-plugin:2.17:test (default-test)
on project hadoop-hdfs: There are test failures.
[ERROR] 
[ERROR] Please refer to /home/jenkins/jenkins-slave/workspace/Hadoop-Hdfs-trunk-Java8/hadoop-hdfs-project/hadoop-hdfs/target/surefire-reports
for the individual test results.
[ERROR] -> [Help 1]
[ERROR] 
[ERROR] To see the full stack trace of the errors, re-run Maven with the -e switch.
[ERROR] Re-run Maven using the -X switch to enable full debug logging.
[ERROR] 
[ERROR] For more information about the errors and possible solutions, please read the following
articles:
[ERROR] [Help 1] http://cwiki.apache.org/confluence/display/MAVEN/MojoFailureException
[ERROR] 
[ERROR] After correcting the problems, you can resume the build with the command
[ERROR]   mvn <goals> -rf :hadoop-hdfs
Build step 'Execute shell' marked build as failure
Archiving artifacts
Recording test results
Updating HADOOP-11149
Updating HADOOP-10035
Updating HDFS-7796
Updating HDFS-9402
Updating HDFS-9153
Updating HADOOP-10465
Updating HADOOP-12572
Updating HDFS-7897
Updating HADOOP-12467
Updating HDFS-3302
Updating HADOOP-10068
Updating HADOOP-12294
Updating HDFS-8914
Updating HADOOP-12098
Updating HADOOP-10555
Updating HDFS-6885
Updating HADOOP-11218
Updating HADOOP-12181
Sending e-mails to: hdfs-dev@hadoop.apache.org
Email was triggered for: Failure - Any
Sending email for trigger: Failure - Any



###################################################################################
############################## FAILED TESTS (if any) ##############################
2 tests failed.
FAILED:  org.apache.hadoop.hdfs.server.datanode.TestDataNodeHotSwapVolumes.testRemoveVolumeBeingWritten

Error Message:
Timed out waiting for /test to reach 3 replicas

Stack Trace:
java.util.concurrent.TimeoutException: Timed out waiting for /test to reach 3 replicas
	at org.apache.hadoop.hdfs.DFSTestUtil.waitReplication(DFSTestUtil.java:768)
	at org.apache.hadoop.hdfs.server.datanode.TestDataNodeHotSwapVolumes.testRemoveVolumeBeingWrittenForDatanode(TestDataNodeHotSwapVolumes.java:644)
	at org.apache.hadoop.hdfs.server.datanode.TestDataNodeHotSwapVolumes.testRemoveVolumeBeingWritten(TestDataNodeHotSwapVolumes.java:569)


FAILED:  org.apache.hadoop.security.TestPermission.testBackwardCompatibility

Error Message:
expected:<18> but was:<0>

Stack Trace:
java.lang.AssertionError: expected:<18> but was:<0>
	at org.junit.Assert.fail(Assert.java:88)
	at org.junit.Assert.failNotEquals(Assert.java:743)
	at org.junit.Assert.assertEquals(Assert.java:118)
	at org.junit.Assert.assertEquals(Assert.java:555)
	at org.junit.Assert.assertEquals(Assert.java:542)
	at org.apache.hadoop.security.TestPermission.testBackwardCompatibility(TestPermission.java:98)



Mime
  • Unnamed multipart/mixed (inline, None, 0 bytes)
View raw message