hadoop-hdfs-dev mailing list archives

Site index · List index
Message view « Date » · « Thread »
Top « Date » · « Thread »
From Apache Jenkins Server <jenk...@builds.apache.org>
Subject Build failed in Jenkins: Hadoop-Hdfs-trunk-Java8 #632
Date Mon, 23 Nov 2015 22:32:07 GMT
See <https://builds.apache.org/job/Hadoop-Hdfs-trunk-Java8/632/changes>

Changes:

[vinodkv] HADOOP-12577. Bumped up commons-collections version to 3.2.2 to address

------------------------------------------
[...truncated 6862 lines...]
Java HotSpot(TM) 64-Bit Server VM warning: ignoring option MaxPermSize=768m; support was removed
in 8.0
Running org.apache.hadoop.fs.contract.hdfs.TestHDFSContractGetFileStatus
Tests run: 1, Failures: 0, Errors: 0, Skipped: 0, Time elapsed: 5.265 sec - in org.apache.hadoop.fs.contract.hdfs.TestHDFSContractGetFileStatus
Java HotSpot(TM) 64-Bit Server VM warning: ignoring option MaxPermSize=768m; support was removed
in 8.0
Running org.apache.hadoop.fs.contract.hdfs.TestHDFSContractConcat
Tests run: 4, Failures: 0, Errors: 0, Skipped: 0, Time elapsed: 6.084 sec - in org.apache.hadoop.fs.contract.hdfs.TestHDFSContractConcat
Java HotSpot(TM) 64-Bit Server VM warning: ignoring option MaxPermSize=768m; support was removed
in 8.0
Running org.apache.hadoop.fs.contract.hdfs.TestHDFSContractMkdir
Tests run: 5, Failures: 0, Errors: 0, Skipped: 0, Time elapsed: 5.61 sec - in org.apache.hadoop.fs.contract.hdfs.TestHDFSContractMkdir
Java HotSpot(TM) 64-Bit Server VM warning: ignoring option MaxPermSize=768m; support was removed
in 8.0
Running org.apache.hadoop.fs.contract.hdfs.TestHDFSContractCreate
Tests run: 6, Failures: 0, Errors: 0, Skipped: 0, Time elapsed: 5.851 sec - in org.apache.hadoop.fs.contract.hdfs.TestHDFSContractCreate
Java HotSpot(TM) 64-Bit Server VM warning: ignoring option MaxPermSize=768m; support was removed
in 8.0
Running org.apache.hadoop.fs.contract.hdfs.TestHDFSContractRootDirectory
Tests run: 6, Failures: 0, Errors: 0, Skipped: 0, Time elapsed: 5.568 sec - in org.apache.hadoop.fs.contract.hdfs.TestHDFSContractRootDirectory
Java HotSpot(TM) 64-Bit Server VM warning: ignoring option MaxPermSize=768m; support was removed
in 8.0
Running org.apache.hadoop.fs.contract.hdfs.TestHDFSContractSeek
Tests run: 10, Failures: 0, Errors: 0, Skipped: 0, Time elapsed: 7.921 sec - in org.apache.hadoop.fs.contract.hdfs.TestHDFSContractSeek
Java HotSpot(TM) 64-Bit Server VM warning: ignoring option MaxPermSize=768m; support was removed
in 8.0
Running org.apache.hadoop.fs.contract.hdfs.TestHDFSContractSetTimes
Tests run: 1, Failures: 0, Errors: 0, Skipped: 0, Time elapsed: 4.961 sec - in org.apache.hadoop.fs.contract.hdfs.TestHDFSContractSetTimes
Java HotSpot(TM) 64-Bit Server VM warning: ignoring option MaxPermSize=768m; support was removed
in 8.0
Running org.apache.hadoop.fs.TestEnhancedByteBufferAccess
Tests run: 10, Failures: 0, Errors: 0, Skipped: 1, Time elapsed: 18.137 sec - in org.apache.hadoop.fs.TestEnhancedByteBufferAccess
Java HotSpot(TM) 64-Bit Server VM warning: ignoring option MaxPermSize=768m; support was removed
in 8.0
Running org.apache.hadoop.fs.permission.TestStickyBit
Tests run: 6, Failures: 0, Errors: 0, Skipped: 0, Time elapsed: 10.486 sec - in org.apache.hadoop.fs.permission.TestStickyBit
Java HotSpot(TM) 64-Bit Server VM warning: ignoring option MaxPermSize=768m; support was removed
in 8.0
Running org.apache.hadoop.fs.TestSymlinkHdfsDisable
Tests run: 1, Failures: 0, Errors: 0, Skipped: 0, Time elapsed: 4.719 sec - in org.apache.hadoop.fs.TestSymlinkHdfsDisable
Java HotSpot(TM) 64-Bit Server VM warning: ignoring option MaxPermSize=768m; support was removed
in 8.0
Running org.apache.hadoop.fs.TestHDFSFileContextMainOperations
Tests run: 68, Failures: 0, Errors: 0, Skipped: 0, Time elapsed: 10.214 sec - in org.apache.hadoop.fs.TestHDFSFileContextMainOperations
Java HotSpot(TM) 64-Bit Server VM warning: ignoring option MaxPermSize=768m; support was removed
in 8.0
Running org.apache.hadoop.fs.TestWebHdfsFileContextMainOperations
Tests run: 60, Failures: 0, Errors: 0, Skipped: 0, Time elapsed: 14.202 sec - in org.apache.hadoop.fs.TestWebHdfsFileContextMainOperations
Java HotSpot(TM) 64-Bit Server VM warning: ignoring option MaxPermSize=768m; support was removed
in 8.0
Running org.apache.hadoop.fs.TestSWebHdfsFileContextMainOperations
Tests run: 60, Failures: 0, Errors: 0, Skipped: 0, Time elapsed: 16.733 sec - in org.apache.hadoop.fs.TestSWebHdfsFileContextMainOperations
Java HotSpot(TM) 64-Bit Server VM warning: ignoring option MaxPermSize=768m; support was removed
in 8.0
Running org.apache.hadoop.fs.TestSymlinkHdfsFileContext
Tests run: 71, Failures: 0, Errors: 0, Skipped: 0, Time elapsed: 12.628 sec - in org.apache.hadoop.fs.TestSymlinkHdfsFileContext
Java HotSpot(TM) 64-Bit Server VM warning: ignoring option MaxPermSize=768m; support was removed
in 8.0
Running org.apache.hadoop.fs.TestUnbuffer
Tests run: 2, Failures: 0, Errors: 0, Skipped: 0, Time elapsed: 8.262 sec - in org.apache.hadoop.fs.TestUnbuffer
Java HotSpot(TM) 64-Bit Server VM warning: ignoring option MaxPermSize=768m; support was removed
in 8.0
Running org.apache.hadoop.fs.shell.TestHdfsTextCommand
Tests run: 1, Failures: 0, Errors: 0, Skipped: 0, Time elapsed: 5.115 sec - in org.apache.hadoop.fs.shell.TestHdfsTextCommand
Java HotSpot(TM) 64-Bit Server VM warning: ignoring option MaxPermSize=768m; support was removed
in 8.0
Running org.apache.hadoop.fs.TestResolveHdfsSymlink
Tests run: 4, Failures: 0, Errors: 0, Skipped: 0, Time elapsed: 4.68 sec - in org.apache.hadoop.fs.TestResolveHdfsSymlink
Java HotSpot(TM) 64-Bit Server VM warning: ignoring option MaxPermSize=768m; support was removed
in 8.0
Running org.apache.hadoop.fs.TestFcHdfsCreateMkdir
Tests run: 8, Failures: 0, Errors: 0, Skipped: 0, Time elapsed: 5.779 sec - in org.apache.hadoop.fs.TestFcHdfsCreateMkdir
Java HotSpot(TM) 64-Bit Server VM warning: ignoring option MaxPermSize=768m; support was removed
in 8.0
Running org.apache.hadoop.fs.TestFcHdfsPermission
Tests run: 4, Failures: 0, Errors: 0, Skipped: 0, Time elapsed: 5.609 sec - in org.apache.hadoop.fs.TestFcHdfsPermission
Java HotSpot(TM) 64-Bit Server VM warning: ignoring option MaxPermSize=768m; support was removed
in 8.0
Running org.apache.hadoop.fs.TestGlobPaths
Tests run: 36, Failures: 0, Errors: 0, Skipped: 6, Time elapsed: 5.47 sec - in org.apache.hadoop.fs.TestGlobPaths
Java HotSpot(TM) 64-Bit Server VM warning: ignoring option MaxPermSize=768m; support was removed
in 8.0
Running org.apache.hadoop.fs.TestUrlStreamHandler
Tests run: 2, Failures: 0, Errors: 0, Skipped: 0, Time elapsed: 5.514 sec - in org.apache.hadoop.fs.TestUrlStreamHandler
Java HotSpot(TM) 64-Bit Server VM warning: ignoring option MaxPermSize=768m; support was removed
in 8.0
Running org.apache.hadoop.fs.viewfs.TestViewFileSystemAtHdfsRoot
Tests run: 60, Failures: 0, Errors: 0, Skipped: 0, Time elapsed: 12.867 sec - in org.apache.hadoop.fs.viewfs.TestViewFileSystemAtHdfsRoot
Java HotSpot(TM) 64-Bit Server VM warning: ignoring option MaxPermSize=768m; support was removed
in 8.0
Running org.apache.hadoop.fs.viewfs.TestViewFsWithAcls
Tests run: 1, Failures: 0, Errors: 0, Skipped: 0, Time elapsed: 5.523 sec - in org.apache.hadoop.fs.viewfs.TestViewFsWithAcls
Java HotSpot(TM) 64-Bit Server VM warning: ignoring option MaxPermSize=768m; support was removed
in 8.0
Running org.apache.hadoop.fs.viewfs.TestViewFsDefaultValue
Tests run: 4, Failures: 0, Errors: 0, Skipped: 0, Time elapsed: 4.838 sec - in org.apache.hadoop.fs.viewfs.TestViewFsDefaultValue
Java HotSpot(TM) 64-Bit Server VM warning: ignoring option MaxPermSize=768m; support was removed
in 8.0
Running org.apache.hadoop.fs.viewfs.TestViewFileSystemWithAcls
Tests run: 1, Failures: 0, Errors: 0, Skipped: 0, Time elapsed: 5.43 sec - in org.apache.hadoop.fs.viewfs.TestViewFileSystemWithAcls
Java HotSpot(TM) 64-Bit Server VM warning: ignoring option MaxPermSize=768m; support was removed
in 8.0
Running org.apache.hadoop.fs.viewfs.TestViewFileSystemHdfs
Tests run: 60, Failures: 0, Errors: 0, Skipped: 0, Time elapsed: 11.19 sec - in org.apache.hadoop.fs.viewfs.TestViewFileSystemHdfs
Java HotSpot(TM) 64-Bit Server VM warning: ignoring option MaxPermSize=768m; support was removed
in 8.0
Running org.apache.hadoop.fs.viewfs.TestViewFsAtHdfsRoot
Tests run: 58, Failures: 0, Errors: 0, Skipped: 0, Time elapsed: 8.717 sec - in org.apache.hadoop.fs.viewfs.TestViewFsAtHdfsRoot
Java HotSpot(TM) 64-Bit Server VM warning: ignoring option MaxPermSize=768m; support was removed
in 8.0
Running org.apache.hadoop.fs.viewfs.TestViewFsFileStatusHdfs
Tests run: 2, Failures: 0, Errors: 0, Skipped: 0, Time elapsed: 4.342 sec - in org.apache.hadoop.fs.viewfs.TestViewFsFileStatusHdfs
Java HotSpot(TM) 64-Bit Server VM warning: ignoring option MaxPermSize=768m; support was removed
in 8.0
Running org.apache.hadoop.fs.viewfs.TestViewFileSystemWithXAttrs
Tests run: 1, Failures: 0, Errors: 0, Skipped: 0, Time elapsed: 5.48 sec - in org.apache.hadoop.fs.viewfs.TestViewFileSystemWithXAttrs
Java HotSpot(TM) 64-Bit Server VM warning: ignoring option MaxPermSize=768m; support was removed
in 8.0
Running org.apache.hadoop.fs.viewfs.TestViewFsWithXAttrs
Tests run: 1, Failures: 0, Errors: 0, Skipped: 0, Time elapsed: 5.505 sec - in org.apache.hadoop.fs.viewfs.TestViewFsWithXAttrs
Java HotSpot(TM) 64-Bit Server VM warning: ignoring option MaxPermSize=768m; support was removed
in 8.0
Running org.apache.hadoop.fs.viewfs.TestViewFsHdfs
Tests run: 58, Failures: 0, Errors: 0, Skipped: 0, Time elapsed: 8.892 sec - in org.apache.hadoop.fs.viewfs.TestViewFsHdfs
Java HotSpot(TM) 64-Bit Server VM warning: ignoring option MaxPermSize=768m; support was removed
in 8.0
Running org.apache.hadoop.fs.TestHdfsNativeCodeLoader
Tests run: 1, Failures: 0, Errors: 0, Skipped: 0, Time elapsed: 0.219 sec - in org.apache.hadoop.fs.TestHdfsNativeCodeLoader
Java HotSpot(TM) 64-Bit Server VM warning: ignoring option MaxPermSize=768m; support was removed
in 8.0
Running org.apache.hadoop.tools.TestJMXGet
Tests run: 2, Failures: 0, Errors: 0, Skipped: 0, Time elapsed: 7.32 sec - in org.apache.hadoop.tools.TestJMXGet
Java HotSpot(TM) 64-Bit Server VM warning: ignoring option MaxPermSize=768m; support was removed
in 8.0
Running org.apache.hadoop.tools.TestTools
Tests run: 5, Failures: 0, Errors: 0, Skipped: 0, Time elapsed: 1.283 sec - in org.apache.hadoop.tools.TestTools
Java HotSpot(TM) 64-Bit Server VM warning: ignoring option MaxPermSize=768m; support was removed
in 8.0
Running org.apache.hadoop.tools.TestHdfsConfigFields
Tests run: 2, Failures: 0, Errors: 0, Skipped: 0, Time elapsed: 0.651 sec - in org.apache.hadoop.tools.TestHdfsConfigFields
Java HotSpot(TM) 64-Bit Server VM warning: ignoring option MaxPermSize=768m; support was removed
in 8.0
Running org.apache.hadoop.TestRefreshCallQueue
Tests run: 1, Failures: 0, Errors: 0, Skipped: 0, Time elapsed: 4.946 sec - in org.apache.hadoop.TestRefreshCallQueue
Java HotSpot(TM) 64-Bit Server VM warning: ignoring option MaxPermSize=768m; support was removed
in 8.0
Running org.apache.hadoop.net.TestNetworkTopology
Tests run: 10, Failures: 0, Errors: 0, Skipped: 0, Time elapsed: 10.036 sec - in org.apache.hadoop.net.TestNetworkTopology
Java HotSpot(TM) 64-Bit Server VM warning: ignoring option MaxPermSize=768m; support was removed
in 8.0
Running org.apache.hadoop.cli.TestCacheAdminCLI
Tests run: 1, Failures: 0, Errors: 0, Skipped: 0, Time elapsed: 7.735 sec - in org.apache.hadoop.cli.TestCacheAdminCLI
Java HotSpot(TM) 64-Bit Server VM warning: ignoring option MaxPermSize=768m; support was removed
in 8.0
Running org.apache.hadoop.cli.TestCryptoAdminCLI
Tests run: 1, Failures: 0, Errors: 0, Skipped: 0, Time elapsed: 7.689 sec - in org.apache.hadoop.cli.TestCryptoAdminCLI
Java HotSpot(TM) 64-Bit Server VM warning: ignoring option MaxPermSize=768m; support was removed
in 8.0
Running org.apache.hadoop.cli.TestDeleteCLI
Tests run: 1, Failures: 0, Errors: 0, Skipped: 0, Time elapsed: 8.622 sec - in org.apache.hadoop.cli.TestDeleteCLI
Java HotSpot(TM) 64-Bit Server VM warning: ignoring option MaxPermSize=768m; support was removed
in 8.0
Running org.apache.hadoop.cli.TestAclCLI
Tests run: 1, Failures: 0, Errors: 0, Skipped: 0, Time elapsed: 5.94 sec - in org.apache.hadoop.cli.TestAclCLI
Java HotSpot(TM) 64-Bit Server VM warning: ignoring option MaxPermSize=768m; support was removed
in 8.0
Running org.apache.hadoop.cli.TestErasureCodingCLI
Tests run: 1, Failures: 0, Errors: 0, Skipped: 0, Time elapsed: 8.35 sec - in org.apache.hadoop.cli.TestErasureCodingCLI
Java HotSpot(TM) 64-Bit Server VM warning: ignoring option MaxPermSize=768m; support was removed
in 8.0
Running org.apache.hadoop.cli.TestXAttrCLI
Tests run: 1, Failures: 0, Errors: 0, Skipped: 0, Time elapsed: 7.286 sec - in org.apache.hadoop.cli.TestXAttrCLI
Java HotSpot(TM) 64-Bit Server VM warning: ignoring option MaxPermSize=768m; support was removed
in 8.0
Running org.apache.hadoop.cli.TestHDFSCLI
Tests run: 1, Failures: 0, Errors: 0, Skipped: 0, Time elapsed: 45.16 sec - in org.apache.hadoop.cli.TestHDFSCLI

Results :

Failed tests: 
  TestDFSStripedOutputStreamWithFailure120>TestDFSStripedOutputStreamWithFailure$TestBase.test5:494->TestDFSStripedOutputStreamWithFailure$TestBase.run:486
failed, dn=7, length=2686976java.lang.AssertionError: expected:<1001> but was:<1002>
	at org.junit.Assert.fail(Assert.java:88)
	at org.junit.Assert.failNotEquals(Assert.java:743)
	at org.junit.Assert.assertEquals(Assert.java:118)
	at org.junit.Assert.assertEquals(Assert.java:555)
	at org.junit.Assert.assertEquals(Assert.java:542)
	at org.apache.hadoop.hdfs.TestDFSStripedOutputStreamWithFailure.runTest(TestDFSStripedOutputStreamWithFailure.java:362)
	at org.apache.hadoop.hdfs.TestDFSStripedOutputStreamWithFailure.runTest(TestDFSStripedOutputStreamWithFailure.java:281)
	at org.apache.hadoop.hdfs.TestDFSStripedOutputStreamWithFailure$TestBase.run(TestDFSStripedOutputStreamWithFailure.java:486)
	at org.apache.hadoop.hdfs.TestDFSStripedOutputStreamWithFailure$TestBase.test5(TestDFSStripedOutputStreamWithFailure.java:494)
	at sun.reflect.NativeMethodAccessorImpl.invoke0(Native Method)
	at sun.reflect.NativeMethodAccessorImpl.invoke(NativeMethodAccessorImpl.java:62)
	at sun.reflect.DelegatingMethodAccessorImpl.invoke(DelegatingMethodAccessorImpl.java:43)
	at java.lang.reflect.Method.invoke(Method.java:483)
	at org.junit.runners.model.FrameworkMethod$1.runReflectiveCall(FrameworkMethod.java:47)
	at org.junit.internal.runners.model.ReflectiveCallable.run(ReflectiveCallable.java:12)
	at org.junit.runners.model.FrameworkMethod.invokeExplosively(FrameworkMethod.java:44)
	at org.junit.internal.runners.statements.InvokeMethod.evaluate(InvokeMethod.java:17)
	at org.junit.internal.runners.statements.FailOnTimeout$StatementThread.run(FailOnTimeout.java:74)

  TestPermission.testBackwardCompatibility:98 expected:<18> but was:<0>

Tests in error: 
  TestFSOutputSummer.TestDFSCheckSumType:156 » IO Problem in starting http serve...
  TestFSOutputSummer.testFSOutputSummer:121->doTestFSOutputSummer:133 » IO Probl...

Tests run: 4094, Failures: 2, Errors: 2, Skipped: 17

[INFO]                                                                         
[INFO] ------------------------------------------------------------------------
[INFO] Skipping Apache Hadoop HDFS Native Client
[INFO] This project has been banned from the build due to previous failures.
[INFO] ------------------------------------------------------------------------
[INFO]                                                                         
[INFO] ------------------------------------------------------------------------
[INFO] Skipping Apache Hadoop HttpFS
[INFO] This project has been banned from the build due to previous failures.
[INFO] ------------------------------------------------------------------------
[INFO]                                                                         
[INFO] ------------------------------------------------------------------------
[INFO] Skipping Apache Hadoop HDFS BookKeeper Journal
[INFO] This project has been banned from the build due to previous failures.
[INFO] ------------------------------------------------------------------------
[INFO]                                                                         
[INFO] ------------------------------------------------------------------------
[INFO] Skipping Apache Hadoop HDFS-NFS
[INFO] This project has been banned from the build due to previous failures.
[INFO] ------------------------------------------------------------------------
[INFO]                                                                         
[INFO] ------------------------------------------------------------------------
[INFO] Building Apache Hadoop HDFS Project 3.0.0-SNAPSHOT
[INFO] ------------------------------------------------------------------------
[INFO] 
[INFO] --- maven-clean-plugin:2.5:clean (default-clean) @ hadoop-hdfs-project ---
[INFO] Deleting <https://builds.apache.org/job/Hadoop-Hdfs-trunk-Java8/ws/hadoop-hdfs-project/target>
[INFO] 
[INFO] --- maven-antrun-plugin:1.7:run (create-testdirs) @ hadoop-hdfs-project ---
[INFO] Executing tasks

main:
    [mkdir] Created dir: <https://builds.apache.org/job/Hadoop-Hdfs-trunk-Java8/ws/hadoop-hdfs-project/target/test-dir>
[INFO] Executed tasks
[INFO] 
[INFO] --- maven-source-plugin:2.3:jar-no-fork (hadoop-java-sources) @ hadoop-hdfs-project
---
[INFO] 
[INFO] --- maven-source-plugin:2.3:test-jar-no-fork (hadoop-java-sources) @ hadoop-hdfs-project
---
[INFO] 
[INFO] --- maven-enforcer-plugin:1.3.1:enforce (dist-enforce) @ hadoop-hdfs-project ---
[INFO] 
[INFO] --- maven-site-plugin:3.4:attach-descriptor (attach-descriptor) @ hadoop-hdfs-project
---
[INFO] 
[INFO] --- maven-javadoc-plugin:2.8.1:jar (module-javadocs) @ hadoop-hdfs-project ---
[INFO] Not executing Javadoc as the project is not a Java classpath-capable package
[INFO] 
[INFO] --- maven-enforcer-plugin:1.3.1:enforce (depcheck) @ hadoop-hdfs-project ---
[INFO] 
[INFO] --- maven-checkstyle-plugin:2.15:checkstyle (default-cli) @ hadoop-hdfs-project ---
[INFO] 
[INFO] --- findbugs-maven-plugin:3.0.0:findbugs (default-cli) @ hadoop-hdfs-project ---
[INFO] ------------------------------------------------------------------------
[INFO] Reactor Summary:
[INFO] 
[INFO] Apache Hadoop HDFS Client ......................... SUCCESS [04:26 min]
[INFO] Apache Hadoop HDFS ................................ FAILURE [  03:33 h]
[INFO] Apache Hadoop HDFS Native Client .................. SKIPPED
[INFO] Apache Hadoop HttpFS .............................. SKIPPED
[INFO] Apache Hadoop HDFS BookKeeper Journal ............. SKIPPED
[INFO] Apache Hadoop HDFS-NFS ............................ SKIPPED
[INFO] Apache Hadoop HDFS Project ........................ SUCCESS [  0.053 s]
[INFO] ------------------------------------------------------------------------
[INFO] BUILD FAILURE
[INFO] ------------------------------------------------------------------------
[INFO] Total time: 03:37 h
[INFO] Finished at: 2015-11-23T22:31:55+00:00
[INFO] Final Memory: 56M/596M
[INFO] ------------------------------------------------------------------------
[ERROR] Failed to execute goal org.apache.maven.plugins:maven-surefire-plugin:2.17:test (default-test)
on project hadoop-hdfs: There are test failures.
[ERROR] 
[ERROR] Please refer to <https://builds.apache.org/job/Hadoop-Hdfs-trunk-Java8/ws/hadoop-hdfs-project/hadoop-hdfs/target/surefire-reports>
for the individual test results.
[ERROR] -> [Help 1]
[ERROR] 
[ERROR] To see the full stack trace of the errors, re-run Maven with the -e switch.
[ERROR] Re-run Maven using the -X switch to enable full debug logging.
[ERROR] 
[ERROR] For more information about the errors and possible solutions, please read the following
articles:
[ERROR] [Help 1] http://cwiki.apache.org/confluence/display/MAVEN/MojoFailureException
[ERROR] 
[ERROR] After correcting the problems, you can resume the build with the command
[ERROR]   mvn <goals> -rf :hadoop-hdfs
Build step 'Execute shell' marked build as failure
Archiving artifacts
Recording test results
Updating HADOOP-12577

Mime
View raw message