hadoop-hdfs-dev mailing list archives

Site index · List index
Message view « Date » · « Thread »
Top « Date » · « Thread »
From Apache Jenkins Server <jenk...@builds.apache.org>
Subject Build failed in Jenkins: Hadoop-Hdfs-trunk-Java8 #604
Date Fri, 13 Nov 2015 15:19:14 GMT
See <https://builds.apache.org/job/Hadoop-Hdfs-trunk-Java8/604/changes>

Changes:

[aajisaka] HADOOP-12545. Hadoop javadoc has broken links for AccessControlList,

------------------------------------------
[...truncated 5866 lines...]
Running org.apache.hadoop.hdfs.server.namenode.TestFSNamesystem
Tests run: 11, Failures: 0, Errors: 0, Skipped: 0, Time elapsed: 6.615 sec - in org.apache.hadoop.hdfs.server.namenode.TestFSNamesystem
Java HotSpot(TM) 64-Bit Server VM warning: ignoring option MaxPermSize=768m; support was removed
in 8.0
Running org.apache.hadoop.hdfs.server.namenode.TestFSPermissionChecker
Tests run: 15, Failures: 0, Errors: 0, Skipped: 0, Time elapsed: 1.523 sec - in org.apache.hadoop.hdfs.server.namenode.TestFSPermissionChecker
Java HotSpot(TM) 64-Bit Server VM warning: ignoring option MaxPermSize=768m; support was removed
in 8.0
Running org.apache.hadoop.hdfs.server.namenode.TestSaveNamespace
Tests run: 14, Failures: 0, Errors: 0, Skipped: 0, Time elapsed: 9.955 sec - in org.apache.hadoop.hdfs.server.namenode.TestSaveNamespace
Java HotSpot(TM) 64-Bit Server VM warning: ignoring option MaxPermSize=768m; support was removed
in 8.0
Running org.apache.hadoop.hdfs.server.namenode.TestEditLogRace
Tests run: 4, Failures: 0, Errors: 0, Skipped: 0, Time elapsed: 29.344 sec - in org.apache.hadoop.hdfs.server.namenode.TestEditLogRace
Java HotSpot(TM) 64-Bit Server VM warning: ignoring option MaxPermSize=768m; support was removed
in 8.0
Running org.apache.hadoop.hdfs.server.namenode.TestStartup
Tests run: 10, Failures: 0, Errors: 0, Skipped: 0, Time elapsed: 27.028 sec - in org.apache.hadoop.hdfs.server.namenode.TestStartup
Java HotSpot(TM) 64-Bit Server VM warning: ignoring option MaxPermSize=768m; support was removed
in 8.0
Running org.apache.hadoop.hdfs.server.namenode.TestCheckpoint
Tests run: 38, Failures: 0, Errors: 0, Skipped: 0, Time elapsed: 58.766 sec - in org.apache.hadoop.hdfs.server.namenode.TestCheckpoint
Java HotSpot(TM) 64-Bit Server VM warning: ignoring option MaxPermSize=768m; support was removed
in 8.0
Running org.apache.hadoop.hdfs.server.namenode.TestParallelImageWrite
Tests run: 1, Failures: 0, Errors: 0, Skipped: 0, Time elapsed: 13.276 sec - in org.apache.hadoop.hdfs.server.namenode.TestParallelImageWrite
Java HotSpot(TM) 64-Bit Server VM warning: ignoring option MaxPermSize=768m; support was removed
in 8.0
Running org.apache.hadoop.hdfs.server.namenode.TestFileContextAcl
Tests run: 64, Failures: 0, Errors: 0, Skipped: 0, Time elapsed: 23.619 sec - in org.apache.hadoop.hdfs.server.namenode.TestFileContextAcl
Java HotSpot(TM) 64-Bit Server VM warning: ignoring option MaxPermSize=768m; support was removed
in 8.0
Running org.apache.hadoop.hdfs.server.namenode.TestAddBlockRetry
Tests run: 2, Failures: 0, Errors: 0, Skipped: 0, Time elapsed: 11.711 sec - in org.apache.hadoop.hdfs.server.namenode.TestAddBlockRetry
Java HotSpot(TM) 64-Bit Server VM warning: ignoring option MaxPermSize=768m; support was removed
in 8.0
Running org.apache.hadoop.hdfs.server.namenode.TestRecoverStripedBlocks
Tests run: 4, Failures: 0, Errors: 0, Skipped: 0, Time elapsed: 17.222 sec - in org.apache.hadoop.hdfs.server.namenode.TestRecoverStripedBlocks
Java HotSpot(TM) 64-Bit Server VM warning: ignoring option MaxPermSize=768m; support was removed
in 8.0
Running org.apache.hadoop.hdfs.server.namenode.TestINodeFile
Tests run: 26, Failures: 0, Errors: 0, Skipped: 0, Time elapsed: 43.586 sec - in org.apache.hadoop.hdfs.server.namenode.TestINodeFile
Java HotSpot(TM) 64-Bit Server VM warning: ignoring option MaxPermSize=768m; support was removed
in 8.0
Running org.apache.hadoop.hdfs.server.namenode.TestNameNodeRetryCacheMetrics
Tests run: 1, Failures: 0, Errors: 0, Skipped: 0, Time elapsed: 8.078 sec - in org.apache.hadoop.hdfs.server.namenode.TestNameNodeRetryCacheMetrics
Java HotSpot(TM) 64-Bit Server VM warning: ignoring option MaxPermSize=768m; support was removed
in 8.0
Running org.apache.hadoop.hdfs.server.namenode.TestQuotaWithStripedBlocks
Tests run: 1, Failures: 0, Errors: 0, Skipped: 0, Time elapsed: 5.895 sec - in org.apache.hadoop.hdfs.server.namenode.TestQuotaWithStripedBlocks
Java HotSpot(TM) 64-Bit Server VM warning: ignoring option MaxPermSize=768m; support was removed
in 8.0
Running org.apache.hadoop.hdfs.server.namenode.TestGetImageServlet
Tests run: 1, Failures: 0, Errors: 0, Skipped: 0, Time elapsed: 0.972 sec - in org.apache.hadoop.hdfs.server.namenode.TestGetImageServlet
Java HotSpot(TM) 64-Bit Server VM warning: ignoring option MaxPermSize=768m; support was removed
in 8.0
Running org.apache.hadoop.hdfs.server.namenode.TestAuditLogs
Tests run: 14, Failures: 0, Errors: 0, Skipped: 0, Time elapsed: 29.837 sec - in org.apache.hadoop.hdfs.server.namenode.TestAuditLogs
Java HotSpot(TM) 64-Bit Server VM warning: ignoring option MaxPermSize=768m; support was removed
in 8.0
Running org.apache.hadoop.hdfs.server.namenode.TestFSNamesystemMBean
Tests run: 3, Failures: 0, Errors: 0, Skipped: 0, Time elapsed: 5.675 sec - in org.apache.hadoop.hdfs.server.namenode.TestFSNamesystemMBean
Java HotSpot(TM) 64-Bit Server VM warning: ignoring option MaxPermSize=768m; support was removed
in 8.0
Running org.apache.hadoop.hdfs.server.namenode.snapshot.TestGetContentSummaryWithSnapshot
Tests run: 1, Failures: 0, Errors: 0, Skipped: 0, Time elapsed: 5.067 sec - in org.apache.hadoop.hdfs.server.namenode.snapshot.TestGetContentSummaryWithSnapshot
Java HotSpot(TM) 64-Bit Server VM warning: ignoring option MaxPermSize=768m; support was removed
in 8.0
Running org.apache.hadoop.hdfs.server.namenode.snapshot.TestSnapshotFileLength
Tests run: 2, Failures: 0, Errors: 0, Skipped: 0, Time elapsed: 5.616 sec - in org.apache.hadoop.hdfs.server.namenode.snapshot.TestSnapshotFileLength
Java HotSpot(TM) 64-Bit Server VM warning: ignoring option MaxPermSize=768m; support was removed
in 8.0
Running org.apache.hadoop.hdfs.server.namenode.snapshot.TestXAttrWithSnapshot
Tests run: 8, Failures: 0, Errors: 0, Skipped: 0, Time elapsed: 7.952 sec - in org.apache.hadoop.hdfs.server.namenode.snapshot.TestXAttrWithSnapshot
Java HotSpot(TM) 64-Bit Server VM warning: ignoring option MaxPermSize=768m; support was removed
in 8.0
Running org.apache.hadoop.hdfs.server.namenode.snapshot.TestSnapshotDiffReport
Tests run: 8, Failures: 0, Errors: 0, Skipped: 0, Time elapsed: 15.676 sec - in org.apache.hadoop.hdfs.server.namenode.snapshot.TestSnapshotDiffReport
Java HotSpot(TM) 64-Bit Server VM warning: ignoring option MaxPermSize=768m; support was removed
in 8.0
Running org.apache.hadoop.hdfs.server.namenode.snapshot.TestSnapshotManager
Tests run: 1, Failures: 0, Errors: 0, Skipped: 0, Time elapsed: 0.532 sec - in org.apache.hadoop.hdfs.server.namenode.snapshot.TestSnapshotManager
Java HotSpot(TM) 64-Bit Server VM warning: ignoring option MaxPermSize=768m; support was removed
in 8.0
Running org.apache.hadoop.hdfs.server.namenode.snapshot.TestSnapshot
Tests run: 6, Failures: 0, Errors: 0, Skipped: 0, Time elapsed: 74.647 sec - in org.apache.hadoop.hdfs.server.namenode.snapshot.TestSnapshot
Java HotSpot(TM) 64-Bit Server VM warning: ignoring option MaxPermSize=768m; support was removed
in 8.0
Running org.apache.hadoop.hdfs.server.namenode.snapshot.TestSnapshotBlocksMap
Tests run: 7, Failures: 0, Errors: 0, Skipped: 0, Time elapsed: 24.638 sec - in org.apache.hadoop.hdfs.server.namenode.snapshot.TestSnapshotBlocksMap
Java HotSpot(TM) 64-Bit Server VM warning: ignoring option MaxPermSize=768m; support was removed
in 8.0
Running org.apache.hadoop.hdfs.server.namenode.snapshot.TestNestedSnapshots
Tests run: 5, Failures: 0, Errors: 0, Skipped: 0, Time elapsed: 56.438 sec - in org.apache.hadoop.hdfs.server.namenode.snapshot.TestNestedSnapshots
Java HotSpot(TM) 64-Bit Server VM warning: ignoring option MaxPermSize=768m; support was removed
in 8.0
Running org.apache.hadoop.hdfs.server.namenode.snapshot.TestUpdatePipelineWithSnapshots
Tests run: 1, Failures: 0, Errors: 0, Skipped: 0, Time elapsed: 10.605 sec - in org.apache.hadoop.hdfs.server.namenode.snapshot.TestUpdatePipelineWithSnapshots
Java HotSpot(TM) 64-Bit Server VM warning: ignoring option MaxPermSize=768m; support was removed
in 8.0
Running org.apache.hadoop.hdfs.server.namenode.snapshot.TestSnapshotDeletion
Tests run: 17, Failures: 0, Errors: 0, Skipped: 0, Time elapsed: 61.149 sec - in org.apache.hadoop.hdfs.server.namenode.snapshot.TestSnapshotDeletion
Java HotSpot(TM) 64-Bit Server VM warning: ignoring option MaxPermSize=768m; support was removed
in 8.0
Running org.apache.hadoop.hdfs.server.namenode.snapshot.TestRenameWithSnapshots
Tests run: 36, Failures: 0, Errors: 0, Skipped: 0, Time elapsed: 113.553 sec - in org.apache.hadoop.hdfs.server.namenode.snapshot.TestRenameWithSnapshots
Java HotSpot(TM) 64-Bit Server VM warning: ignoring option MaxPermSize=768m; support was removed
in 8.0
Running org.apache.hadoop.hdfs.server.namenode.snapshot.TestAclWithSnapshot
Tests run: 16, Failures: 0, Errors: 0, Skipped: 0, Time elapsed: 11.64 sec - in org.apache.hadoop.hdfs.server.namenode.snapshot.TestAclWithSnapshot
Java HotSpot(TM) 64-Bit Server VM warning: ignoring option MaxPermSize=768m; support was removed
in 8.0
Running org.apache.hadoop.hdfs.server.namenode.snapshot.TestDisallowModifyROSnapshot
Tests run: 11, Failures: 0, Errors: 0, Skipped: 0, Time elapsed: 3.99 sec - in org.apache.hadoop.hdfs.server.namenode.snapshot.TestDisallowModifyROSnapshot
Java HotSpot(TM) 64-Bit Server VM warning: ignoring option MaxPermSize=768m; support was removed
in 8.0
Running org.apache.hadoop.hdfs.server.namenode.snapshot.TestCheckpointsWithSnapshots
Tests run: 1, Failures: 0, Errors: 0, Skipped: 0, Time elapsed: 4.532 sec - in org.apache.hadoop.hdfs.server.namenode.snapshot.TestCheckpointsWithSnapshots
Java HotSpot(TM) 64-Bit Server VM warning: ignoring option MaxPermSize=768m; support was removed
in 8.0
Running org.apache.hadoop.hdfs.server.namenode.snapshot.TestFileWithSnapshotFeature
Tests run: 1, Failures: 0, Errors: 0, Skipped: 0, Time elapsed: 0.535 sec - in org.apache.hadoop.hdfs.server.namenode.snapshot.TestFileWithSnapshotFeature
Java HotSpot(TM) 64-Bit Server VM warning: ignoring option MaxPermSize=768m; support was removed
in 8.0
Running org.apache.hadoop.hdfs.server.namenode.snapshot.TestSnapshotReplication
Tests run: 3, Failures: 0, Errors: 0, Skipped: 0, Time elapsed: 10.238 sec - in org.apache.hadoop.hdfs.server.namenode.snapshot.TestSnapshotReplication
Java HotSpot(TM) 64-Bit Server VM warning: ignoring option MaxPermSize=768m; support was removed
in 8.0
Running org.apache.hadoop.hdfs.server.namenode.snapshot.TestSnapshottableDirListing
Tests run: 2, Failures: 0, Errors: 0, Skipped: 0, Time elapsed: 6.698 sec - in org.apache.hadoop.hdfs.server.namenode.snapshot.TestSnapshottableDirListing
Java HotSpot(TM) 64-Bit Server VM warning: ignoring option MaxPermSize=768m; support was removed
in 8.0
Running org.apache.hadoop.hdfs.server.namenode.snapshot.TestSnapshotNameWithInvalidCharacters
Tests run: 2, Failures: 0, Errors: 0, Skipped: 0, Time elapsed: 5.559 sec - in org.apache.hadoop.hdfs.server.namenode.snapshot.TestSnapshotNameWithInvalidCharacters
Java HotSpot(TM) 64-Bit Server VM warning: ignoring option MaxPermSize=768m; support was removed
in 8.0
Running org.apache.hadoop.hdfs.server.namenode.snapshot.TestSnapshotStatsMXBean
Tests run: 1, Failures: 0, Errors: 0, Skipped: 0, Time elapsed: 3.983 sec - in org.apache.hadoop.hdfs.server.namenode.snapshot.TestSnapshotStatsMXBean
Java HotSpot(TM) 64-Bit Server VM warning: ignoring option MaxPermSize=768m; support was removed
in 8.0
Running org.apache.hadoop.hdfs.server.namenode.snapshot.TestOpenFilesWithSnapshot
Tests run: 7, Failures: 0, Errors: 0, Skipped: 0, Time elapsed: 53.884 sec - in org.apache.hadoop.hdfs.server.namenode.snapshot.TestOpenFilesWithSnapshot
Java HotSpot(TM) 64-Bit Server VM warning: ignoring option MaxPermSize=768m; support was removed
in 8.0
Running org.apache.hadoop.hdfs.server.namenode.snapshot.TestSnapshotRename
Tests run: 6, Failures: 0, Errors: 0, Skipped: 0, Time elapsed: 12.46 sec - in org.apache.hadoop.hdfs.server.namenode.snapshot.TestSnapshotRename
Java HotSpot(TM) 64-Bit Server VM warning: ignoring option MaxPermSize=768m; support was removed
in 8.0
Running org.apache.hadoop.hdfs.server.namenode.snapshot.TestSnapshotMetrics
Tests run: 2, Failures: 0, Errors: 0, Skipped: 0, Time elapsed: 7.246 sec - in org.apache.hadoop.hdfs.server.namenode.snapshot.TestSnapshotMetrics
Java HotSpot(TM) 64-Bit Server VM warning: ignoring option MaxPermSize=768m; support was removed
in 8.0
Running org.apache.hadoop.hdfs.server.namenode.snapshot.TestINodeFileUnderConstructionWithSnapshot
Tests run: 4, Failures: 0, Errors: 0, Skipped: 0, Time elapsed: 10.809 sec - in org.apache.hadoop.hdfs.server.namenode.snapshot.TestINodeFileUnderConstructionWithSnapshot
Java HotSpot(TM) 64-Bit Server VM warning: ignoring option MaxPermSize=768m; support was removed
in 8.0
Running org.apache.hadoop.hdfs.server.namenode.snapshot.TestSetQuotaWithSnapshot
Tests run: 2, Failures: 0, Errors: 0, Skipped: 0, Time elapsed: 6.918 sec - in org.apache.hadoop.hdfs.server.namenode.snapshot.TestSetQuotaWithSnapshot
Java HotSpot(TM) 64-Bit Server VM warning: ignoring option MaxPermSize=768m; support was removed
in 8.0
Running org.apache.hadoop.hdfs.server.namenode.snapshot.TestSnapshotListing
Tests run: 1, Failures: 0, Errors: 0, Skipped: 0, Time elapsed: 4.461 sec - in org.apache.hadoop.hdfs.server.namenode.snapshot.TestSnapshotListing
Java HotSpot(TM) 64-Bit Server VM warning: ignoring option MaxPermSize=768m; support was removed
in 8.0
Running org.apache.hadoop.hdfs.server.namenode.snapshot.TestFileContextSnapshot
Tests run: 2, Failures: 0, Errors: 0, Skipped: 0, Time elapsed: 6.545 sec - in org.apache.hadoop.hdfs.server.namenode.snapshot.TestFileContextSnapshot
Java HotSpot(TM) 64-Bit Server VM warning: ignoring option MaxPermSize=768m; support was removed
in 8.0
Running org.apache.hadoop.hdfs.server.namenode.TestSecondaryWebUi
Tests run: 1, Failures: 0, Errors: 0, Skipped: 0, Time elapsed: 3.611 sec - in org.apache.hadoop.hdfs.server.namenode.TestSecondaryWebUi
Java HotSpot(TM) 64-Bit Server VM warning: ignoring option MaxPermSize=768m; support was removed
in 8.0
Running org.apache.hadoop.hdfs.server.namenode.TestAuditLogger
Tests run: 7, Failures: 0, Errors: 0, Skipped: 0, Time elapsed: 10.291 sec - in org.apache.hadoop.hdfs.server.namenode.TestAuditLogger
Java HotSpot(TM) 64-Bit Server VM warning: ignoring option MaxPermSize=768m; support was removed
in 8.0
Running org.apache.hadoop.hdfs.server.namenode.TestSnapshotPathINodes
Tests run: 6, Failures: 0, Errors: 0, Skipped: 0, Time elapsed: 5.367 sec - in org.apache.hadoop.hdfs.server.namenode.TestSnapshotPathINodes
Java HotSpot(TM) 64-Bit Server VM warning: ignoring option MaxPermSize=768m; support was removed
in 8.0
Running org.apache.hadoop.hdfs.server.namenode.TestCheckPointForSecurityTokens
Tests run: 1, Failures: 0, Errors: 0, Skipped: 0, Time elapsed: 8.716 sec - in org.apache.hadoop.hdfs.server.namenode.TestCheckPointForSecurityTokens
Java HotSpot(TM) 64-Bit Server VM warning: ignoring option MaxPermSize=768m; support was removed
in 8.0
Running org.apache.hadoop.hdfs.server.namenode.TestEditLogJournalFailures
Tests run: 6, Failures: 0, Errors: 0, Skipped: 0, Time elapsed: 8.612 sec - in org.apache.hadoop.hdfs.server.namenode.TestEditLogJournalFailures
Java HotSpot(TM) 64-Bit Server VM warning: ignoring option MaxPermSize=768m; support was removed
in 8.0
Running org.apache.hadoop.hdfs.server.namenode.TestCacheDirectives
Tests run: 13, Failures: 0, Errors: 0, Skipped: 0, Time elapsed: 92.267 sec - in org.apache.hadoop.hdfs.server.namenode.TestCacheDirectives
Java HotSpot(TM) 64-Bit Server VM warning: ignoring option MaxPermSize=768m; support was removed
in 8.0
Running org.apache.hadoop.hdfs.server.namenode.web.resources.TestWebHdfsDataLocality
Tests run: 3, Failures: 0, Errors: 0, Skipped: 0, Time elapsed: 8.391 sec - in org.apache.hadoop.hdfs.server.namenode.web.resources.TestWebHdfsDataLocality
Java HotSpot(TM) 64-Bit Server VM warning: ignoring option MaxPermSize=768m; support was removed
in 8.0
Running org.apache.hadoop.hdfs.server.namenode.TestSecurityTokenEditLog
Tests run: 2, Failures: 0, Errors: 0, Skipped: 0, Time elapsed: 14.98 sec - in org.apache.hadoop.hdfs.server.namenode.TestSecurityTokenEditLog
Java HotSpot(TM) 64-Bit Server VM warning: ignoring option MaxPermSize=768m; support was removed
in 8.0
Running org.apache.hadoop.hdfs.server.namenode.TestGetBlockLocations
Tests run: 3, Failures: 0, Errors: 0, Skipped: 0, Time elapsed: 1.749 sec - in org.apache.hadoop.hdfs.server.namenode.TestGetBlockLocations
Java HotSpot(TM) 64-Bit Server VM warning: ignoring option MaxPermSize=768m; support was removed
in 8.0
Running org.apache.hadoop.hdfs.server.namenode.TestNameNodeAcl
Tests run: 64, Failures: 0, Errors: 0, Skipped: 0, Time elapsed: 23.253 sec - in org.apache.hadoop.hdfs.server.namenode.TestNameNodeAcl
Java HotSpot(TM) 64-Bit Server VM warning: ignoring option MaxPermSize=768m; support was removed
in 8.0
Running org.apache.hadoop.hdfs.server.namenode.TestAddBlock
Tests run: 2, Failures: 0, Errors: 0, Skipped: 0, Time elapsed: 17.313 sec - in org.apache.hadoop.hdfs.server.namenode.TestAddBlock
Java HotSpot(TM) 64-Bit Server VM warning: ignoring option MaxPermSize=768m; support was removed
in 8.0
Running org.apache.hadoop.hdfs.server.namenode.TestFsck

Results :

Tests run: 2434, Failures: 0, Errors: 0, Skipped: 12

[INFO]                                                                         
[INFO] ------------------------------------------------------------------------
[INFO] Skipping Apache Hadoop HDFS Native Client
[INFO] This project has been banned from the build due to previous failures.
[INFO] ------------------------------------------------------------------------
[INFO]                                                                         
[INFO] ------------------------------------------------------------------------
[INFO] Skipping Apache Hadoop HttpFS
[INFO] This project has been banned from the build due to previous failures.
[INFO] ------------------------------------------------------------------------
[INFO]                                                                         
[INFO] ------------------------------------------------------------------------
[INFO] Skipping Apache Hadoop HDFS BookKeeper Journal
[INFO] This project has been banned from the build due to previous failures.
[INFO] ------------------------------------------------------------------------
[INFO]                                                                         
[INFO] ------------------------------------------------------------------------
[INFO] Skipping Apache Hadoop HDFS-NFS
[INFO] This project has been banned from the build due to previous failures.
[INFO] ------------------------------------------------------------------------
[INFO]                                                                         
[INFO] ------------------------------------------------------------------------
[INFO] Building Apache Hadoop HDFS Project 3.0.0-SNAPSHOT
[INFO] ------------------------------------------------------------------------
[INFO] 
[INFO] --- maven-clean-plugin:2.5:clean (default-clean) @ hadoop-hdfs-project ---
[INFO] Deleting <https://builds.apache.org/job/Hadoop-Hdfs-trunk-Java8/ws/hadoop-hdfs-project/target>
[INFO] 
[INFO] --- maven-antrun-plugin:1.7:run (create-testdirs) @ hadoop-hdfs-project ---
[INFO] Executing tasks

main:
    [mkdir] Created dir: <https://builds.apache.org/job/Hadoop-Hdfs-trunk-Java8/ws/hadoop-hdfs-project/target/test-dir>
[INFO] Executed tasks
[INFO] 
[INFO] --- maven-source-plugin:2.3:jar-no-fork (hadoop-java-sources) @ hadoop-hdfs-project
---
[INFO] 
[INFO] --- maven-source-plugin:2.3:test-jar-no-fork (hadoop-java-sources) @ hadoop-hdfs-project
---
[INFO] 
[INFO] --- maven-enforcer-plugin:1.3.1:enforce (dist-enforce) @ hadoop-hdfs-project ---
[INFO] 
[INFO] --- maven-site-plugin:3.4:attach-descriptor (attach-descriptor) @ hadoop-hdfs-project
---
[INFO] 
[INFO] --- maven-javadoc-plugin:2.8.1:jar (module-javadocs) @ hadoop-hdfs-project ---
[INFO] Not executing Javadoc as the project is not a Java classpath-capable package
[INFO] 
[INFO] --- maven-enforcer-plugin:1.3.1:enforce (depcheck) @ hadoop-hdfs-project ---
[INFO] 
[INFO] --- maven-checkstyle-plugin:2.15:checkstyle (default-cli) @ hadoop-hdfs-project ---
[INFO] 
[INFO] --- findbugs-maven-plugin:3.0.0:findbugs (default-cli) @ hadoop-hdfs-project ---
[INFO] ------------------------------------------------------------------------
[INFO] Reactor Summary:
[INFO] 
[INFO] Apache Hadoop HDFS Client ......................... SUCCESS [04:14 min]
[INFO] Apache Hadoop HDFS ................................ FAILURE [  01:26 h]
[INFO] Apache Hadoop HDFS Native Client .................. SKIPPED
[INFO] Apache Hadoop HttpFS .............................. SKIPPED
[INFO] Apache Hadoop HDFS BookKeeper Journal ............. SKIPPED
[INFO] Apache Hadoop HDFS-NFS ............................ SKIPPED
[INFO] Apache Hadoop HDFS Project ........................ SUCCESS [  0.062 s]
[INFO] ------------------------------------------------------------------------
[INFO] BUILD FAILURE
[INFO] ------------------------------------------------------------------------
[INFO] Total time: 01:30 h
[INFO] Finished at: 2015-11-13T15:19:06+00:00
[INFO] Final Memory: 76M/1003M
[INFO] ------------------------------------------------------------------------
[ERROR] Failed to execute goal org.apache.maven.plugins:maven-surefire-plugin:2.17:test (default-test)
on project hadoop-hdfs: ExecutionException: java.lang.RuntimeException: The forked VM terminated
without properly saying goodbye. VM crash or System.exit called?
[ERROR] Command was /bin/sh -c cd <https://builds.apache.org/job/Hadoop-Hdfs-trunk-Java8/ws/hadoop-hdfs-project/hadoop-hdfs>
&& /home/jenkins/tools/java/jdk1.8.0/jre/bin/java -Xmx2048m -XX:MaxPermSize=768m -XX:+HeapDumpOnOutOfMemoryError
-jar <https://builds.apache.org/job/Hadoop-Hdfs-trunk-Java8/ws/hadoop-hdfs-project/hadoop-hdfs/target/surefire/surefirebooter5413237646871261131.jar>
<https://builds.apache.org/job/Hadoop-Hdfs-trunk-Java8/ws/hadoop-hdfs-project/hadoop-hdfs/target/surefire/surefire1488638023973797926tmp>
<https://builds.apache.org/job/Hadoop-Hdfs-trunk-Java8/ws/hadoop-hdfs-project/hadoop-hdfs/target/surefire/surefire_1164648410580352922998tmp>
[ERROR] -> [Help 1]
[ERROR] 
[ERROR] To see the full stack trace of the errors, re-run Maven with the -e switch.
[ERROR] Re-run Maven using the -X switch to enable full debug logging.
[ERROR] 
[ERROR] For more information about the errors and possible solutions, please read the following
articles:
[ERROR] [Help 1] http://cwiki.apache.org/confluence/display/MAVEN/MojoFailureException
[ERROR] 
[ERROR] After correcting the problems, you can resume the build with the command
[ERROR]   mvn <goals> -rf :hadoop-hdfs
Build step 'Execute shell' marked build as failure
Archiving artifacts
Recording test results
Updating HADOOP-12545

Mime
View raw message