hadoop-hdfs-dev mailing list archives

Site index · List index
Message view « Date » · « Thread »
Top « Date » · « Thread »
From Apache Jenkins Server <jenk...@builds.apache.org>
Subject Build failed in Jenkins: Hadoop-Hdfs-trunk-Java8 #479
Date Sat, 10 Oct 2015 03:29:56 GMT
See <https://builds.apache.org/job/Hadoop-Hdfs-trunk-Java8/479/changes>

Changes:

[wangda] YARN-4140. RM container allocation delayed incase of app submitted to

------------------------------------------
[...truncated 5260 lines...]
[INFO] 
[INFO] --- maven-clean-plugin:2.5:clean (default-clean) @ hadoop-tools ---
[INFO] 
[INFO] --- maven-antrun-plugin:1.7:run (create-testdirs) @ hadoop-tools ---
[INFO] Executing tasks

main:
    [mkdir] Created dir: <https://builds.apache.org/job/Hadoop-Hdfs-trunk-Java8/ws/hadoop-tools/target/test-dir>
[INFO] Executed tasks
[INFO] 
[INFO] --- maven-site-plugin:3.4:attach-descriptor (attach-descriptor) @ hadoop-tools ---
[INFO] 
[INFO] --- maven-enforcer-plugin:1.3.1:enforce (depcheck) @ hadoop-tools ---
[INFO] 
[INFO] --- maven-install-plugin:2.5.1:install (default-install) @ hadoop-tools ---
[INFO] Installing <https://builds.apache.org/job/Hadoop-Hdfs-trunk-Java8/ws/hadoop-tools/pom.xml>
to /home/jenkins/.m2/repository/org/apache/hadoop/hadoop-tools/3.0.0-SNAPSHOT/hadoop-tools-3.0.0-SNAPSHOT.pom
[INFO]                                                                         
[INFO] ------------------------------------------------------------------------
[INFO] Building Apache Hadoop Distribution 3.0.0-SNAPSHOT
[INFO] ------------------------------------------------------------------------
[INFO] 
[INFO] --- maven-clean-plugin:2.5:clean (default-clean) @ hadoop-dist ---
[INFO] 
[INFO] --- maven-antrun-plugin:1.7:run (create-testdirs) @ hadoop-dist ---
[INFO] Executing tasks

main:
    [mkdir] Created dir: <https://builds.apache.org/job/Hadoop-Hdfs-trunk-Java8/ws/hadoop-dist/target/test-dir>
[INFO] Executed tasks
[INFO] 
[INFO] --- maven-resources-plugin:2.6:resources (default-resources) @ hadoop-dist ---
[INFO] Using 'UTF-8' encoding to copy filtered resources.
[INFO] skip non existing resourceDirectory <https://builds.apache.org/job/Hadoop-Hdfs-trunk-Java8/ws/hadoop-dist/src/main/resources>
[INFO] 
[INFO] --- maven-compiler-plugin:3.1:compile (default-compile) @ hadoop-dist ---
[INFO] No sources to compile
[INFO] 
[INFO] --- maven-resources-plugin:2.6:testResources (default-testResources) @ hadoop-dist
---
[INFO] Using 'UTF-8' encoding to copy filtered resources.
[INFO] skip non existing resourceDirectory <https://builds.apache.org/job/Hadoop-Hdfs-trunk-Java8/ws/hadoop-dist/src/test/resources>
[INFO] 
[INFO] --- maven-compiler-plugin:3.1:testCompile (default-testCompile) @ hadoop-dist ---
[INFO] No sources to compile
[INFO] 
[INFO] --- maven-surefire-plugin:2.17:test (default-test) @ hadoop-dist ---
[INFO] Tests are skipped.
[INFO] 
[INFO] --- maven-jar-plugin:2.5:jar (default-jar) @ hadoop-dist ---
[WARNING] JAR will be empty - no content was marked for inclusion!
[INFO] Building jar: <https://builds.apache.org/job/Hadoop-Hdfs-trunk-Java8/ws/hadoop-dist/target/hadoop-dist-3.0.0-SNAPSHOT.jar>
[INFO] 
[INFO] --- maven-site-plugin:3.4:attach-descriptor (attach-descriptor) @ hadoop-dist ---
[INFO] 
[INFO] --- maven-enforcer-plugin:1.3.1:enforce (depcheck) @ hadoop-dist ---
[INFO] 
[INFO] --- maven-install-plugin:2.5.1:install (default-install) @ hadoop-dist ---
[INFO] Installing <https://builds.apache.org/job/Hadoop-Hdfs-trunk-Java8/ws/hadoop-dist/target/hadoop-dist-3.0.0-SNAPSHOT.jar>
to /home/jenkins/.m2/repository/org/apache/hadoop/hadoop-dist/3.0.0-SNAPSHOT/hadoop-dist-3.0.0-SNAPSHOT.jar
[INFO] Installing <https://builds.apache.org/job/Hadoop-Hdfs-trunk-Java8/ws/hadoop-dist/pom.xml>
to /home/jenkins/.m2/repository/org/apache/hadoop/hadoop-dist/3.0.0-SNAPSHOT/hadoop-dist-3.0.0-SNAPSHOT.pom
[INFO] ------------------------------------------------------------------------
[INFO] Reactor Summary:
[INFO] 
[INFO] Apache Hadoop Main ................................ SUCCESS [  0.989 s]
[INFO] Apache Hadoop Build Tools ......................... SUCCESS [  0.523 s]
[INFO] Apache Hadoop Project POM ......................... SUCCESS [  0.784 s]
[INFO] Apache Hadoop Annotations ......................... SUCCESS [  1.491 s]
[INFO] Apache Hadoop Project Dist POM .................... SUCCESS [  0.298 s]
[INFO] Apache Hadoop Assemblies .......................... SUCCESS [  0.115 s]
[INFO] Apache Hadoop Maven Plugins ....................... SUCCESS [  2.062 s]
[INFO] Apache Hadoop MiniKDC ............................. SUCCESS [  1.443 s]
[INFO] Apache Hadoop Auth ................................ SUCCESS [  2.275 s]
[INFO] Apache Hadoop Auth Examples ....................... SUCCESS [  1.154 s]
[INFO] Apache Hadoop Common .............................. SUCCESS [ 33.409 s]
[INFO] Apache Hadoop NFS ................................. SUCCESS [  0.929 s]
[INFO] Apache Hadoop KMS ................................. SUCCESS [  2.789 s]
[INFO] Apache Hadoop Common Project ...................... SUCCESS [  0.040 s]
[INFO] Apache Hadoop HDFS Client ......................... SUCCESS [ 12.819 s]
[INFO] Apache Hadoop HDFS ................................ SUCCESS [ 23.484 s]
[INFO] Apache Hadoop HDFS Native Client .................. SUCCESS [ 14.665 s]
[INFO] Apache Hadoop HttpFS .............................. SUCCESS [ 12.489 s]
[INFO] Apache Hadoop HDFS BookKeeper Journal ............. SUCCESS [  0.859 s]
[INFO] Apache Hadoop HDFS-NFS ............................ SUCCESS [  0.683 s]
[INFO] Apache Hadoop HDFS Project ........................ SUCCESS [  0.024 s]
[INFO] Apache Hadoop YARN ................................ SUCCESS [  0.025 s]
[INFO] Apache Hadoop YARN API ............................ SUCCESS [  6.343 s]
[INFO] Apache Hadoop YARN Common ......................... SUCCESS [  4.905 s]
[INFO] Apache Hadoop YARN Server ......................... SUCCESS [  0.022 s]
[INFO] Apache Hadoop YARN Server Common .................. SUCCESS [  1.540 s]
[INFO] Apache Hadoop YARN NodeManager .................... SUCCESS [  6.650 s]
[INFO] Apache Hadoop YARN Web Proxy ...................... SUCCESS [  0.492 s]
[INFO] Apache Hadoop YARN ApplicationHistoryService ...... SUCCESS [  1.131 s]
[INFO] Apache Hadoop YARN ResourceManager ................ SUCCESS [  6.973 s]
[INFO] Apache Hadoop YARN Server Tests ................... SUCCESS [  0.573 s]
[INFO] Apache Hadoop YARN Client ......................... SUCCESS [  0.922 s]
[INFO] Apache Hadoop YARN SharedCacheManager ............. SUCCESS [  0.447 s]
[INFO] Apache Hadoop YARN Applications ................... SUCCESS [  0.030 s]
[INFO] Apache Hadoop YARN DistributedShell ............... SUCCESS [  0.332 s]
[INFO] Apache Hadoop YARN Unmanaged Am Launcher .......... SUCCESS [  0.193 s]
[INFO] Apache Hadoop YARN Site ........................... SUCCESS [  0.020 s]
[INFO] Apache Hadoop YARN Registry ....................... SUCCESS [  0.636 s]
[INFO] Apache Hadoop YARN Project ........................ SUCCESS [  0.055 s]
[INFO] Apache Hadoop MapReduce Client .................... SUCCESS [  0.054 s]
[INFO] Apache Hadoop MapReduce Core ...................... SUCCESS [  4.281 s]
[INFO] Apache Hadoop MapReduce Common .................... SUCCESS [  2.283 s]
[INFO] Apache Hadoop MapReduce Shuffle ................... SUCCESS [  0.439 s]
[INFO] Apache Hadoop MapReduce App ....................... SUCCESS [  2.227 s]
[INFO] Apache Hadoop MapReduce HistoryServer ............. SUCCESS [  1.094 s]
[INFO] Apache Hadoop MapReduce JobClient ................. SUCCESS [  2.861 s]
[INFO] Apache Hadoop MapReduce HistoryServer Plugins ..... SUCCESS [  0.157 s]
[INFO] Apache Hadoop MapReduce NativeTask ................ SUCCESS [01:41 min]
[INFO] Apache Hadoop MapReduce Examples .................. SUCCESS [  0.858 s]
[INFO] Apache Hadoop MapReduce ........................... SUCCESS [  0.101 s]
[INFO] Apache Hadoop MapReduce Streaming ................. SUCCESS [  0.725 s]
[INFO] Apache Hadoop Distributed Copy .................... SUCCESS [  1.063 s]
[INFO] Apache Hadoop Archives ............................ SUCCESS [  0.275 s]
[INFO] Apache Hadoop Archive Logs ........................ SUCCESS [  0.279 s]
[INFO] Apache Hadoop Rumen ............................... SUCCESS [  0.760 s]
[INFO] Apache Hadoop Gridmix ............................. SUCCESS [  0.818 s]
[INFO] Apache Hadoop Data Join ........................... SUCCESS [  0.274 s]
[INFO] Apache Hadoop Ant Tasks ........................... SUCCESS [  0.126 s]
[INFO] Apache Hadoop Extras .............................. SUCCESS [  0.331 s]
[INFO] Apache Hadoop Pipes ............................... SUCCESS [  8.352 s]
[INFO] Apache Hadoop OpenStack support ................... SUCCESS [  0.343 s]
[INFO] Apache Hadoop Amazon Web Services support ......... SUCCESS [  0.295 s]
[INFO] Apache Hadoop Azure support ....................... SUCCESS [  0.725 s]
[INFO] Apache Hadoop Client .............................. SUCCESS [  0.512 s]
[INFO] Apache Hadoop Mini-Cluster ........................ SUCCESS [  0.089 s]
[INFO] Apache Hadoop Scheduler Load Simulator ............ SUCCESS [  0.945 s]
[INFO] Apache Hadoop Tools Dist .......................... SUCCESS [  0.229 s]
[INFO] Apache Hadoop Kafka Library support ............... SUCCESS [  0.168 s]
[INFO] Apache Hadoop Tools ............................... SUCCESS [  0.017 s]
[INFO] Apache Hadoop Distribution ........................ SUCCESS [  0.050 s]
[INFO] ------------------------------------------------------------------------
[INFO] BUILD SUCCESS
[INFO] ------------------------------------------------------------------------
[INFO] Total time: 04:38 min
[INFO] Finished at: 2015-10-10T03:30:20+00:00
[INFO] Final Memory: 246M/1105M
[INFO] ------------------------------------------------------------------------
+ cd hadoop-hdfs-project
+ /home/jenkins/tools/maven/latest/bin/mvn clean verify checkstyle:checkstyle findbugs:findbugs
-Drequire.test.libhadoop -Pdist -Pnative -Dtar -Pdocs -fae
Java HotSpot(TM) 64-Bit Server VM warning: ignoring option MaxPermSize=768m; support was removed
in 8.0
[INFO] Scanning for projects...
[INFO] ------------------------------------------------------------------------
[INFO] Reactor Build Order:
[INFO] 
[INFO] Apache Hadoop HDFS Client
[INFO] Apache Hadoop HDFS
[INFO] Apache Hadoop HDFS Native Client
[INFO] Apache Hadoop HttpFS
[INFO] Apache Hadoop HDFS BookKeeper Journal
[INFO] Apache Hadoop HDFS-NFS
[INFO] Apache Hadoop HDFS Project
[INFO] 
[INFO] Using the builder org.apache.maven.lifecycle.internal.builder.singlethreaded.SingleThreadedBuilder
with a thread count of 1
[INFO]                                                                         
[INFO] ------------------------------------------------------------------------
[INFO] Building Apache Hadoop HDFS Client 3.0.0-SNAPSHOT
[INFO] ------------------------------------------------------------------------
Downloading: https://repository.apache.org/content/repositories/snapshots/com/google/re2j/re2j/${re2j.version}/re2j-${re2j.version}.pom

Downloading: http://repository.jboss.org/nexus/content/groups/public/com/google/re2j/re2j/${re2j.version}/re2j-${re2j.version}.pom

Downloading: http://repo.maven.apache.org/maven2/com/google/re2j/re2j/${re2j.version}/re2j-${re2j.version}.pom

[INFO]                                                                         
[INFO] ------------------------------------------------------------------------
[INFO] Skipping Apache Hadoop HDFS
[INFO] This project has been banned from the build due to previous failures.
[INFO] ------------------------------------------------------------------------
[INFO]                                                                         
[INFO] ------------------------------------------------------------------------
[INFO] Skipping Apache Hadoop HDFS Native Client
[INFO] This project has been banned from the build due to previous failures.
[INFO] ------------------------------------------------------------------------
[INFO]                                                                         
[INFO] ------------------------------------------------------------------------
[INFO] Skipping Apache Hadoop HttpFS
[INFO] This project has been banned from the build due to previous failures.
[INFO] ------------------------------------------------------------------------
[INFO]                                                                         
[INFO] ------------------------------------------------------------------------
[INFO] Skipping Apache Hadoop HDFS BookKeeper Journal
[INFO] This project has been banned from the build due to previous failures.
[INFO] ------------------------------------------------------------------------
[INFO]                                                                         
[INFO] ------------------------------------------------------------------------
[INFO] Skipping Apache Hadoop HDFS-NFS
[INFO] This project has been banned from the build due to previous failures.
[INFO] ------------------------------------------------------------------------
[INFO]                                                                         
[INFO] ------------------------------------------------------------------------
[INFO] Building Apache Hadoop HDFS Project 3.0.0-SNAPSHOT
[INFO] ------------------------------------------------------------------------
[INFO] 
[INFO] --- maven-clean-plugin:2.5:clean (default-clean) @ hadoop-hdfs-project ---
[INFO] Deleting <https://builds.apache.org/job/Hadoop-Hdfs-trunk-Java8/ws/hadoop-hdfs-project/target>
[INFO] 
[INFO] --- maven-antrun-plugin:1.7:run (create-testdirs) @ hadoop-hdfs-project ---
[INFO] Executing tasks

main:
    [mkdir] Created dir: <https://builds.apache.org/job/Hadoop-Hdfs-trunk-Java8/ws/hadoop-hdfs-project/target/test-dir>
[INFO] Executed tasks
[INFO] 
[INFO] --- maven-source-plugin:2.3:jar-no-fork (hadoop-java-sources) @ hadoop-hdfs-project
---
[INFO] 
[INFO] --- maven-source-plugin:2.3:test-jar-no-fork (hadoop-java-sources) @ hadoop-hdfs-project
---
[INFO] 
[INFO] --- maven-enforcer-plugin:1.3.1:enforce (dist-enforce) @ hadoop-hdfs-project ---
[INFO] 
[INFO] --- maven-site-plugin:3.4:attach-descriptor (attach-descriptor) @ hadoop-hdfs-project
---
[INFO] 
[INFO] --- maven-javadoc-plugin:2.8.1:jar (module-javadocs) @ hadoop-hdfs-project ---
[INFO] Not executing Javadoc as the project is not a Java classpath-capable package
[INFO] 
[INFO] --- maven-enforcer-plugin:1.3.1:enforce (depcheck) @ hadoop-hdfs-project ---
[INFO] 
[INFO] --- maven-checkstyle-plugin:2.15:checkstyle (default-cli) @ hadoop-hdfs-project ---
[INFO] 
[INFO] --- findbugs-maven-plugin:3.0.0:findbugs (default-cli) @ hadoop-hdfs-project ---
[INFO] ------------------------------------------------------------------------
[INFO] Reactor Summary:
[INFO] 
[INFO] Apache Hadoop HDFS Client ......................... FAILURE [  0.755 s]
[INFO] Apache Hadoop HDFS ................................ SKIPPED
[INFO] Apache Hadoop HDFS Native Client .................. SKIPPED
[INFO] Apache Hadoop HttpFS .............................. SKIPPED
[INFO] Apache Hadoop HDFS BookKeeper Journal ............. SKIPPED
[INFO] Apache Hadoop HDFS-NFS ............................ SKIPPED
[INFO] Apache Hadoop HDFS Project ........................ SUCCESS [  2.994 s]
[INFO] ------------------------------------------------------------------------
[INFO] BUILD FAILURE
[INFO] ------------------------------------------------------------------------
[INFO] Total time: 4.842 s
[INFO] Finished at: 2015-10-10T03:30:29+00:00
[INFO] Final Memory: 37M/126M
[INFO] ------------------------------------------------------------------------
[ERROR] Failed to execute goal on project hadoop-hdfs-client: Could not resolve dependencies
for project org.apache.hadoop:hadoop-hdfs-client:jar:3.0.0-SNAPSHOT: Failed to collect dependencies
at org.apache.hadoop:hadoop-common:jar:3.0.0-SNAPSHOT -> com.google.re2j:re2j:jar:${re2j.version}:
Failed to read artifact descriptor for com.google.re2j:re2j:jar:${re2j.version}: Could not
transfer artifact com.google.re2j:re2j:pom:${re2j.version} from/to apache.snapshots.https
(https://repository.apache.org/content/repositories/snapshots): Illegal character in path
at index 83: https://repository.apache.org/content/repositories/snapshots/com/google/re2j/re2j/${re2j.version}/re2j-${re2j.version}.pom
-> [Help 1]
[ERROR] 
[ERROR] To see the full stack trace of the errors, re-run Maven with the -e switch.
[ERROR] Re-run Maven using the -X switch to enable full debug logging.
[ERROR] 
[ERROR] For more information about the errors and possible solutions, please read the following
articles:
[ERROR] [Help 1] http://cwiki.apache.org/confluence/display/MAVEN/DependencyResolutionException
Build step 'Execute shell' marked build as failure
Archiving artifacts
Recording test results
ERROR: Publisher 'Publish JUnit test result report' failed: No test report files were found.
Configuration error?
Updating YARN-4140

Mime
View raw message