hadoop-hdfs-dev mailing list archives

Site index · List index
Message view « Date » · « Thread »
Top « Date » · « Thread »
From Apache Jenkins Server <jenk...@builds.apache.org>
Subject Build failed in Jenkins: Hadoop-Hdfs-trunk #2465
Date Fri, 23 Oct 2015 01:15:04 GMT
See <https://builds.apache.org/job/Hadoop-Hdfs-trunk/2465/changes>

Changes:

[zhz] HDFS-9280. Document NFS gateway export point parameter. Contributed by

[cnauroth] HADOOP-12334. Change Mode Of Copy Operation of HBase WAL Archiving to

[zxu] YARN-4256. YARN fair scheduler vcores with decimal values. Contributed

[junping_du] YARN-4243. Add retry on establishing Zookeeper conenction in

[cnauroth] HADOOP-12484. Single File Rename Throws Incorrectly In Potential Race

[ozawa] Revert HADOOP-9692.

[ozawa] HADOOP-9692. Improving log message when SequenceFile reader throws

[cnauroth] HDFS-9286. HttpFs does not parse ACL syntax correctly for operation

------------------------------------------
[...truncated 6319 lines...]
Tests run: 12, Failures: 0, Errors: 0, Skipped: 0, Time elapsed: 50.79 sec - in org.apache.hadoop.hdfs.server.datanode.TestDataNodeHotSwapVolumes
Running org.apache.hadoop.hdfs.server.datanode.TestDataNodeInitStorage
Tests run: 1, Failures: 0, Errors: 0, Skipped: 0, Time elapsed: 3.848 sec - in org.apache.hadoop.hdfs.server.datanode.TestDataNodeInitStorage
Running org.apache.hadoop.hdfs.server.datanode.TestDataNodeMetricsLogger
Tests run: 4, Failures: 0, Errors: 0, Skipped: 0, Time elapsed: 4.842 sec - in org.apache.hadoop.hdfs.server.datanode.TestDataNodeMetricsLogger
Running org.apache.hadoop.hdfs.server.datanode.TestDiskError
Tests run: 4, Failures: 0, Errors: 0, Skipped: 0, Time elapsed: 15.385 sec - in org.apache.hadoop.hdfs.server.datanode.TestDiskError
Running org.apache.hadoop.hdfs.server.datanode.TestDeleteBlockPool
Tests run: 2, Failures: 0, Errors: 0, Skipped: 0, Time elapsed: 12.437 sec - in org.apache.hadoop.hdfs.server.datanode.TestDeleteBlockPool
Running org.apache.hadoop.hdfs.server.datanode.TestBpServiceActorScheduler
Tests run: 7, Failures: 0, Errors: 0, Skipped: 0, Time elapsed: 0.462 sec - in org.apache.hadoop.hdfs.server.datanode.TestBpServiceActorScheduler
Running org.apache.hadoop.hdfs.server.datanode.TestDataNodeVolumeFailureToleration
Tests run: 4, Failures: 0, Errors: 0, Skipped: 0, Time elapsed: 36.356 sec - in org.apache.hadoop.hdfs.server.datanode.TestDataNodeVolumeFailureToleration
Running org.apache.hadoop.hdfs.server.datanode.TestDataNodeVolumeFailure
Tests run: 6, Failures: 0, Errors: 0, Skipped: 0, Time elapsed: 25.468 sec - in org.apache.hadoop.hdfs.server.datanode.TestDataNodeVolumeFailure
Running org.apache.hadoop.hdfs.server.datanode.TestFsDatasetCache
Tests run: 8, Failures: 0, Errors: 0, Skipped: 0, Time elapsed: 95.245 sec - in org.apache.hadoop.hdfs.server.datanode.TestFsDatasetCache
Running org.apache.hadoop.hdfs.server.datanode.TestDataNodeUUID
Tests run: 1, Failures: 0, Errors: 0, Skipped: 0, Time elapsed: 1.976 sec - in org.apache.hadoop.hdfs.server.datanode.TestDataNodeUUID
Running org.apache.hadoop.hdfs.server.datanode.TestBPOfferService
Tests run: 9, Failures: 0, Errors: 0, Skipped: 0, Time elapsed: 34.936 sec - in org.apache.hadoop.hdfs.server.datanode.TestBPOfferService
Running org.apache.hadoop.hdfs.server.datanode.fsdataset.impl.TestFsVolumeList
Tests run: 3, Failures: 0, Errors: 0, Skipped: 0, Time elapsed: 1.014 sec - in org.apache.hadoop.hdfs.server.datanode.fsdataset.impl.TestFsVolumeList
Running org.apache.hadoop.hdfs.server.datanode.fsdataset.impl.TestScrLazyPersistFiles
Tests run: 8, Failures: 0, Errors: 0, Skipped: 0, Time elapsed: 23.581 sec - in org.apache.hadoop.hdfs.server.datanode.fsdataset.impl.TestScrLazyPersistFiles
Running org.apache.hadoop.hdfs.server.datanode.fsdataset.impl.TestLazyPersistReplicaRecovery
Tests run: 2, Failures: 0, Errors: 0, Skipped: 0, Time elapsed: 19.041 sec - in org.apache.hadoop.hdfs.server.datanode.fsdataset.impl.TestLazyPersistReplicaRecovery
Running org.apache.hadoop.hdfs.server.datanode.fsdataset.impl.TestSpaceReservation
Tests run: 8, Failures: 0, Errors: 0, Skipped: 0, Time elapsed: 79.828 sec - in org.apache.hadoop.hdfs.server.datanode.fsdataset.impl.TestSpaceReservation
Running org.apache.hadoop.hdfs.server.datanode.fsdataset.impl.TestReplicaMap
Tests run: 3, Failures: 0, Errors: 0, Skipped: 0, Time elapsed: 0.095 sec - in org.apache.hadoop.hdfs.server.datanode.fsdataset.impl.TestReplicaMap
Running org.apache.hadoop.hdfs.server.datanode.fsdataset.impl.TestLazyPersistFiles
Tests run: 7, Failures: 0, Errors: 0, Skipped: 0, Time elapsed: 112.687 sec - in org.apache.hadoop.hdfs.server.datanode.fsdataset.impl.TestLazyPersistFiles
Running org.apache.hadoop.hdfs.server.datanode.fsdataset.impl.TestWriteToReplica
Tests run: 5, Failures: 0, Errors: 0, Skipped: 0, Time elapsed: 7.794 sec - in org.apache.hadoop.hdfs.server.datanode.fsdataset.impl.TestWriteToReplica
Running org.apache.hadoop.hdfs.server.datanode.fsdataset.impl.TestLazyPersistPolicy
Tests run: 4, Failures: 0, Errors: 0, Skipped: 0, Time elapsed: 10.678 sec - in org.apache.hadoop.hdfs.server.datanode.fsdataset.impl.TestLazyPersistPolicy
Running org.apache.hadoop.hdfs.server.datanode.fsdataset.impl.TestLazyPersistReplicaPlacement
Tests run: 7, Failures: 0, Errors: 0, Skipped: 0, Time elapsed: 26.825 sec - in org.apache.hadoop.hdfs.server.datanode.fsdataset.impl.TestLazyPersistReplicaPlacement
Running org.apache.hadoop.hdfs.server.datanode.fsdataset.impl.TestDatanodeRestart
Tests run: 1, Failures: 0, Errors: 0, Skipped: 0, Time elapsed: 8.732 sec - in org.apache.hadoop.hdfs.server.datanode.fsdataset.impl.TestDatanodeRestart
Running org.apache.hadoop.hdfs.server.datanode.fsdataset.impl.TestInterDatanodeProtocol
Tests run: 5, Failures: 0, Errors: 0, Skipped: 0, Time elapsed: 7.883 sec - in org.apache.hadoop.hdfs.server.datanode.fsdataset.impl.TestInterDatanodeProtocol
Running org.apache.hadoop.hdfs.server.datanode.fsdataset.impl.TestLazyPersistLockedMemory
Tests run: 6, Failures: 0, Errors: 0, Skipped: 0, Time elapsed: 18.957 sec - in org.apache.hadoop.hdfs.server.datanode.fsdataset.impl.TestLazyPersistLockedMemory
Running org.apache.hadoop.hdfs.server.datanode.fsdataset.impl.TestFsDatasetImpl
Tests run: 7, Failures: 0, Errors: 0, Skipped: 0, Time elapsed: 6.81 sec - in org.apache.hadoop.hdfs.server.datanode.fsdataset.impl.TestFsDatasetImpl
Running org.apache.hadoop.hdfs.server.datanode.fsdataset.impl.TestLazyWriter
Tests run: 7, Failures: 0, Errors: 0, Skipped: 0, Time elapsed: 103.525 sec - in org.apache.hadoop.hdfs.server.datanode.fsdataset.impl.TestLazyWriter
Running org.apache.hadoop.hdfs.server.datanode.fsdataset.TestRoundRobinVolumeChoosingPolicy
Tests run: 2, Failures: 0, Errors: 0, Skipped: 0, Time elapsed: 0.375 sec - in org.apache.hadoop.hdfs.server.datanode.fsdataset.TestRoundRobinVolumeChoosingPolicy
Running org.apache.hadoop.hdfs.server.datanode.fsdataset.TestAvailableSpaceVolumeChoosingPolicy
Tests run: 11, Failures: 0, Errors: 0, Skipped: 0, Time elapsed: 9.883 sec - in org.apache.hadoop.hdfs.server.datanode.fsdataset.TestAvailableSpaceVolumeChoosingPolicy
Running org.apache.hadoop.hdfs.server.datanode.TestDataNodeECN
Tests run: 1, Failures: 0, Errors: 0, Skipped: 0, Time elapsed: 4.146 sec - in org.apache.hadoop.hdfs.server.datanode.TestDataNodeECN
Running org.apache.hadoop.hdfs.server.datanode.TestBlockHasMultipleReplicasOnSameDN
Tests run: 1, Failures: 0, Errors: 0, Skipped: 0, Time elapsed: 4.505 sec - in org.apache.hadoop.hdfs.server.datanode.TestBlockHasMultipleReplicasOnSameDN
Running org.apache.hadoop.hdfs.server.datanode.extdataset.TestExternalDataset
Tests run: 4, Failures: 0, Errors: 0, Skipped: 0, Time elapsed: 0.144 sec - in org.apache.hadoop.hdfs.server.datanode.extdataset.TestExternalDataset
Running org.apache.hadoop.hdfs.server.datanode.TestDataNodeMetrics
Tests run: 7, Failures: 0, Errors: 0, Skipped: 0, Time elapsed: 42.162 sec - in org.apache.hadoop.hdfs.server.datanode.TestDataNodeMetrics
Running org.apache.hadoop.hdfs.server.datanode.TestTriggerBlockReport
Tests run: 2, Failures: 0, Errors: 0, Skipped: 0, Time elapsed: 5.627 sec - in org.apache.hadoop.hdfs.server.datanode.TestTriggerBlockReport
Running org.apache.hadoop.hdfs.server.datanode.TestIncrementalBrVariations
Tests run: 4, Failures: 0, Errors: 0, Skipped: 0, Time elapsed: 12.217 sec - in org.apache.hadoop.hdfs.server.datanode.TestIncrementalBrVariations
Running org.apache.hadoop.hdfs.server.datanode.TestSimulatedFSDataset
Tests run: 9, Failures: 0, Errors: 0, Skipped: 0, Time elapsed: 1.263 sec - in org.apache.hadoop.hdfs.server.datanode.TestSimulatedFSDataset
Running org.apache.hadoop.hdfs.server.datanode.TestHSync
Tests run: 5, Failures: 0, Errors: 0, Skipped: 0, Time elapsed: 9.349 sec - in org.apache.hadoop.hdfs.server.datanode.TestHSync
Running org.apache.hadoop.hdfs.server.datanode.TestDataNodeRollingUpgrade
Tests run: 6, Failures: 0, Errors: 0, Skipped: 0, Time elapsed: 118.961 sec - in org.apache.hadoop.hdfs.server.datanode.TestDataNodeRollingUpgrade
Running org.apache.hadoop.hdfs.server.datanode.TestIncrementalBlockReports
Tests run: 3, Failures: 0, Errors: 0, Skipped: 0, Time elapsed: 13.962 sec - in org.apache.hadoop.hdfs.server.datanode.TestIncrementalBlockReports
Running org.apache.hadoop.hdfs.server.datanode.TestDnRespectsBlockReportSplitThreshold
Tests run: 3, Failures: 0, Errors: 0, Skipped: 0, Time elapsed: 6.483 sec - in org.apache.hadoop.hdfs.server.datanode.TestDnRespectsBlockReportSplitThreshold
Running org.apache.hadoop.hdfs.server.datanode.TestDataNodeVolumeFailureReporting
Tests run: 4, Failures: 0, Errors: 0, Skipped: 0, Time elapsed: 75.669 sec - in org.apache.hadoop.hdfs.server.datanode.TestDataNodeVolumeFailureReporting
Running org.apache.hadoop.hdfs.server.datanode.TestDataNodeMXBean
Tests run: 1, Failures: 0, Errors: 0, Skipped: 0, Time elapsed: 4.071 sec - in org.apache.hadoop.hdfs.server.datanode.TestDataNodeMXBean
Running org.apache.hadoop.hdfs.server.namenode.TestNameNodeRespectsBindHostKeys
Tests run: 4, Failures: 0, Errors: 0, Skipped: 0, Time elapsed: 7.888 sec - in org.apache.hadoop.hdfs.server.namenode.TestNameNodeRespectsBindHostKeys
Running org.apache.hadoop.hdfs.server.namenode.TestFileJournalManager
Tests run: 14, Failures: 0, Errors: 0, Skipped: 0, Time elapsed: 2.643 sec - in org.apache.hadoop.hdfs.server.namenode.TestFileJournalManager
Running org.apache.hadoop.hdfs.server.namenode.TestProcessCorruptBlocks
Tests run: 4, Failures: 0, Errors: 0, Skipped: 0, Time elapsed: 23.263 sec - in org.apache.hadoop.hdfs.server.namenode.TestProcessCorruptBlocks
Running org.apache.hadoop.hdfs.server.namenode.TestAddOverReplicatedStripedBlocks
Tests run: 4, Failures: 0, Errors: 0, Skipped: 0, Time elapsed: 41.821 sec - in org.apache.hadoop.hdfs.server.namenode.TestAddOverReplicatedStripedBlocks
Running org.apache.hadoop.hdfs.server.namenode.TestRecoverStripedBlocks
Tests run: 3, Failures: 0, Errors: 0, Skipped: 0, Time elapsed: 11.873 sec - in org.apache.hadoop.hdfs.server.namenode.TestRecoverStripedBlocks
Running org.apache.hadoop.hdfs.server.namenode.TestHostsFiles
Tests run: 2, Failures: 0, Errors: 0, Skipped: 0, Time elapsed: 11.688 sec - in org.apache.hadoop.hdfs.server.namenode.TestHostsFiles
Running org.apache.hadoop.hdfs.server.namenode.TestMetaSave
Tests run: 3, Failures: 0, Errors: 0, Skipped: 0, Time elapsed: 34.932 sec - in org.apache.hadoop.hdfs.server.namenode.TestMetaSave
Running org.apache.hadoop.hdfs.server.namenode.TestAllowFormat
Tests run: 2, Failures: 0, Errors: 0, Skipped: 0, Time elapsed: 4.102 sec - in org.apache.hadoop.hdfs.server.namenode.TestAllowFormat
Running org.apache.hadoop.hdfs.server.namenode.web.resources.TestWebHdfsDataLocality
Tests run: 3, Failures: 0, Errors: 0, Skipped: 0, Time elapsed: 7.692 sec - in org.apache.hadoop.hdfs.server.namenode.web.resources.TestWebHdfsDataLocality
Running org.apache.hadoop.hdfs.server.namenode.TestNameNodeAcl
Tests run: 64, Failures: 0, Errors: 0, Skipped: 0, Time elapsed: 22.836 sec - in org.apache.hadoop.hdfs.server.namenode.TestNameNodeAcl
Running org.apache.hadoop.hdfs.server.namenode.TestXAttrConfigFlag
Tests run: 5, Failures: 0, Errors: 0, Skipped: 0, Time elapsed: 9.356 sec - in org.apache.hadoop.hdfs.server.namenode.TestXAttrConfigFlag
Running org.apache.hadoop.hdfs.server.namenode.TestQuotaWithStripedBlocks
Tests run: 1, Failures: 0, Errors: 0, Skipped: 0, Time elapsed: 5.578 sec - in org.apache.hadoop.hdfs.server.namenode.TestQuotaWithStripedBlocks
Running org.apache.hadoop.hdfs.server.namenode.TestNameNodeRecovery
Tests run: 11, Failures: 0, Errors: 0, Skipped: 0, Time elapsed: 16.776 sec - in org.apache.hadoop.hdfs.server.namenode.TestNameNodeRecovery
Running org.apache.hadoop.hdfs.server.namenode.TestNameNodeRpcServer
Tests run: 1, Failures: 0, Errors: 0, Skipped: 0, Time elapsed: 3.998 sec - in org.apache.hadoop.hdfs.server.namenode.TestNameNodeRpcServer
Running org.apache.hadoop.hdfs.server.namenode.TestFileContextAcl
Tests run: 64, Failures: 0, Errors: 0, Skipped: 0, Time elapsed: 22.854 sec - in org.apache.hadoop.hdfs.server.namenode.TestFileContextAcl
Running org.apache.hadoop.hdfs.server.namenode.TestFsckWithMultipleNameNodes
Tests run: 1, Failures: 0, Errors: 0, Skipped: 0, Time elapsed: 5.798 sec - in org.apache.hadoop.hdfs.server.namenode.TestFsckWithMultipleNameNodes
Running org.apache.hadoop.hdfs.server.namenode.TestMalformedURLs
Tests run: 1, Failures: 0, Errors: 0, Skipped: 0, Time elapsed: 4.045 sec - in org.apache.hadoop.hdfs.server.namenode.TestMalformedURLs
Running org.apache.hadoop.hdfs.server.namenode.TestNameNodeHttpServer
Tests run: 3, Failures: 0, Errors: 0, Skipped: 0, Time elapsed: 2.646 sec - in org.apache.hadoop.hdfs.server.namenode.TestNameNodeHttpServer
Running org.apache.hadoop.hdfs.server.namenode.TestNameNodeOptionParsing
Tests run: 2, Failures: 0, Errors: 0, Skipped: 0, Time elapsed: 0.326 sec - in org.apache.hadoop.hdfs.server.namenode.TestNameNodeOptionParsing
Running org.apache.hadoop.hdfs.server.namenode.TestLeaseManager
Tests run: 3, Failures: 0, Errors: 0, Skipped: 0, Time elapsed: 0.676 sec - in org.apache.hadoop.hdfs.server.namenode.TestLeaseManager
Running org.apache.hadoop.hdfs.server.namenode.TestDeduplicationMap
Tests run: 1, Failures: 0, Errors: 0, Skipped: 0, Time elapsed: 0.092 sec - in org.apache.hadoop.hdfs.server.namenode.TestDeduplicationMap
Running org.apache.hadoop.hdfs.server.namenode.TestSnapshotPathINodes
Tests run: 6, Failures: 0, Errors: 0, Skipped: 0, Time elapsed: 5.413 sec - in org.apache.hadoop.hdfs.server.namenode.TestSnapshotPathINodes
Running org.apache.hadoop.hdfs.server.namenode.TestPathComponents
Tests run: 1, Failures: 0, Errors: 0, Skipped: 0, Time elapsed: 0.246 sec - in org.apache.hadoop.hdfs.server.namenode.TestPathComponents
Running org.apache.hadoop.hdfs.server.namenode.TestINodeFile
Tests run: 26, Failures: 0, Errors: 0, Skipped: 0, Time elapsed: 42.762 sec - in org.apache.hadoop.hdfs.server.namenode.TestINodeFile
Running org.apache.hadoop.hdfs.server.namenode.ha.TestPipelinesFailover
Tests run: 8, Failures: 0, Errors: 0, Skipped: 0, Time elapsed: 97.243 sec - in org.apache.hadoop.hdfs.server.namenode.ha.TestPipelinesFailover
Running org.apache.hadoop.hdfs.server.namenode.ha.TestBootstrapStandbyWithQJM
Tests run: 5, Failures: 0, Errors: 0, Skipped: 0, Time elapsed: 16.455 sec - in org.apache.hadoop.hdfs.server.namenode.ha.TestBootstrapStandbyWithQJM
Running org.apache.hadoop.hdfs.server.namenode.ha.TestEditLogsDuringFailover
Tests run: 3, Failures: 0, Errors: 0, Skipped: 0, Time elapsed: 6.877 sec - in org.apache.hadoop.hdfs.server.namenode.ha.TestEditLogsDuringFailover
Running org.apache.hadoop.hdfs.server.namenode.ha.TestBootstrapStandby
Tests run: 5, Failures: 0, Errors: 0, Skipped: 0, Time elapsed: 10.017 sec - in org.apache.hadoop.hdfs.server.namenode.ha.TestBootstrapStandby
Running org.apache.hadoop.hdfs.server.namenode.ha.TestDFSUpgradeWithHA
Tests run: 9, Failures: 0, Errors: 0, Skipped: 0, Time elapsed: 20.424 sec - in org.apache.hadoop.hdfs.server.namenode.ha.TestDFSUpgradeWithHA
Running org.apache.hadoop.hdfs.server.namenode.ha.TestLossyRetryInvocationHandler
Tests run: 1, Failures: 0, Errors: 0, Skipped: 0, Time elapsed: 4.203 sec - in org.apache.hadoop.hdfs.server.namenode.ha.TestLossyRetryInvocationHandler
Running org.apache.hadoop.hdfs.server.namenode.ha.TestPendingCorruptDnMessages
Tests run: 1, Failures: 0, Errors: 0, Skipped: 0, Time elapsed: 13.696 sec - in org.apache.hadoop.hdfs.server.namenode.ha.TestPendingCorruptDnMessages
Running org.apache.hadoop.hdfs.server.namenode.ha.TestStandbyIsHot
Tests run: 2, Failures: 0, Errors: 0, Skipped: 0, Time elapsed: 17.363 sec - in org.apache.hadoop.hdfs.server.namenode.ha.TestStandbyIsHot
Running org.apache.hadoop.hdfs.server.namenode.ha.TestQuotasWithHA
Tests run: 1, Failures: 0, Errors: 0, Skipped: 0, Time elapsed: 7.675 sec - in org.apache.hadoop.hdfs.server.namenode.ha.TestQuotasWithHA
Running org.apache.hadoop.hdfs.server.namenode.ha.TestHASafeMode
Tests run: 18, Failures: 0, Errors: 0, Skipped: 0, Time elapsed: 76.631 sec - in org.apache.hadoop.hdfs.server.namenode.ha.TestHASafeMode
Running org.apache.hadoop.hdfs.server.namenode.ha.TestXAttrsWithHA

Results :

Tests in error: 
  TestDFSRemove.testRemove:60 » NoClassDefFound org/apache/hadoop/util/PlatformN...
  TestParallelShortCircuitReadUnCached.teardownCluster:78->TestParallelReadUtil.teardownCluster:393
» NoClassDefFound
  TestDelegationToken.testDTManagerInSafeMode:250 » NoClassDefFound org/apache/h...

Tests run: 2113, Failures: 0, Errors: 3, Skipped: 7

[INFO]                                                                         
[INFO] ------------------------------------------------------------------------
[INFO] Skipping Apache Hadoop HDFS Native Client
[INFO] This project has been banned from the build due to previous failures.
[INFO] ------------------------------------------------------------------------
[INFO]                                                                         
[INFO] ------------------------------------------------------------------------
[INFO] Skipping Apache Hadoop HttpFS
[INFO] This project has been banned from the build due to previous failures.
[INFO] ------------------------------------------------------------------------
[INFO]                                                                         
[INFO] ------------------------------------------------------------------------
[INFO] Skipping Apache Hadoop HDFS BookKeeper Journal
[INFO] This project has been banned from the build due to previous failures.
[INFO] ------------------------------------------------------------------------
[INFO]                                                                         
[INFO] ------------------------------------------------------------------------
[INFO] Skipping Apache Hadoop HDFS-NFS
[INFO] This project has been banned from the build due to previous failures.
[INFO] ------------------------------------------------------------------------
[INFO]                                                                         
[INFO] ------------------------------------------------------------------------
[INFO] Building Apache Hadoop HDFS Project 3.0.0-SNAPSHOT
[INFO] ------------------------------------------------------------------------
[INFO] 
[INFO] --- maven-clean-plugin:2.5:clean (default-clean) @ hadoop-hdfs-project ---
[INFO] Deleting <https://builds.apache.org/job/Hadoop-Hdfs-trunk/ws/hadoop-hdfs-project/target>
[INFO] 
[INFO] --- maven-antrun-plugin:1.7:run (create-testdirs) @ hadoop-hdfs-project ---
[INFO] Executing tasks

main:
    [mkdir] Created dir: <https://builds.apache.org/job/Hadoop-Hdfs-trunk/ws/hadoop-hdfs-project/target/test-dir>
[INFO] Executed tasks
[INFO] 
[INFO] --- maven-source-plugin:2.3:jar-no-fork (hadoop-java-sources) @ hadoop-hdfs-project
---
[INFO] 
[INFO] --- maven-source-plugin:2.3:test-jar-no-fork (hadoop-java-sources) @ hadoop-hdfs-project
---
[INFO] 
[INFO] --- maven-enforcer-plugin:1.3.1:enforce (dist-enforce) @ hadoop-hdfs-project ---
[INFO] 
[INFO] --- maven-site-plugin:3.4:attach-descriptor (attach-descriptor) @ hadoop-hdfs-project
---
[INFO] 
[INFO] --- maven-javadoc-plugin:2.8.1:jar (module-javadocs) @ hadoop-hdfs-project ---
[INFO] Skipping javadoc generation
[INFO] 
[INFO] --- maven-enforcer-plugin:1.3.1:enforce (depcheck) @ hadoop-hdfs-project ---
[INFO] 
[INFO] --- maven-checkstyle-plugin:2.15:checkstyle (default-cli) @ hadoop-hdfs-project ---
[INFO] 
[INFO] --- findbugs-maven-plugin:3.0.0:findbugs (default-cli) @ hadoop-hdfs-project ---
[INFO] ------------------------------------------------------------------------
[INFO] Reactor Summary:
[INFO] 
[INFO] Apache Hadoop HDFS Client ......................... SUCCESS [04:15 min]
[INFO] Apache Hadoop HDFS ................................ FAILURE [  01:55 h]
[INFO] Apache Hadoop HDFS Native Client .................. SKIPPED
[INFO] Apache Hadoop HttpFS .............................. SKIPPED
[INFO] Apache Hadoop HDFS BookKeeper Journal ............. SKIPPED
[INFO] Apache Hadoop HDFS-NFS ............................ SKIPPED
[INFO] Apache Hadoop HDFS Project ........................ SUCCESS [  0.072 s]
[INFO] ------------------------------------------------------------------------
[INFO] BUILD FAILURE
[INFO] ------------------------------------------------------------------------
[INFO] Total time: 02:00 h
[INFO] Finished at: 2015-10-23T01:15:48+00:00
[INFO] Final Memory: 69M/747M
[INFO] ------------------------------------------------------------------------
Tests run: 1, Failures: 0, Errors: 0, Skipped: 0, Time elapsed: 5.542 sec - in org.apache.hadoop.hdfs.server.namenode.ha.TestXAttrsWithHA
[ERROR] Failed to execute goal org.apache.maven.plugins:maven-surefire-plugin:2.17:test (default-test)
on project hadoop-hdfs: ExecutionException: java.lang.RuntimeException: The forked VM terminated
without properly saying goodbye. VM crash or System.exit called?
[ERROR] Command was /bin/sh -c cd <https://builds.apache.org/job/Hadoop-Hdfs-trunk/ws/hadoop-hdfs-project/hadoop-hdfs>
&& /home/jenkins/tools/java/jdk1.7.0_55/jre/bin/java -Xmx2048m -XX:MaxPermSize=768m
-XX:+HeapDumpOnOutOfMemoryError -jar <https://builds.apache.org/job/Hadoop-Hdfs-trunk/ws/hadoop-hdfs-project/hadoop-hdfs/target/surefire/surefirebooter4698782267969820148.jar>
<https://builds.apache.org/job/Hadoop-Hdfs-trunk/ws/hadoop-hdfs-project/hadoop-hdfs/target/surefire/surefire6626235237154062767tmp>
<https://builds.apache.org/job/Hadoop-Hdfs-trunk/ws/hadoop-hdfs-project/hadoop-hdfs/target/surefire/surefire_1524129412043568039738tmp>
[ERROR] -> [Help 1]
[ERROR] 
[ERROR] To see the full stack trace of the errors, re-run Maven with the -e switch.
[ERROR] Re-run Maven using the -X switch to enable full debug logging.
[ERROR] 
[ERROR] For more information about the errors and possible solutions, please read the following
articles:
[ERROR] [Help 1] http://cwiki.apache.org/confluence/display/MAVEN/MojoFailureException
[ERROR] 
[ERROR] After correcting the problems, you can resume the build with the command
[ERROR]   mvn <goals> -rf :hadoop-hdfs
Build step 'Execute shell' marked build as failure
Archiving artifacts
Recording test results
Updating HDFS-9280
Updating HADOOP-9692
Updating HADOOP-12484
Updating HADOOP-12334
Updating YARN-4243
Updating YARN-4256
Updating HDFS-9286

Mime
View raw message