hadoop-hdfs-dev mailing list archives

Site index · List index
Message view « Date » · « Thread »
Top « Date » · « Thread »
From Apache Jenkins Server <jenk...@builds.apache.org>
Subject Hadoop-Hdfs-trunk - Build # 2492 - Still Failing
Date Fri, 30 Oct 2015 13:14:05 GMT
See https://builds.apache.org/job/Hadoop-Hdfs-trunk/2492/

###################################################################################
########################## LAST 60 LINES OF THE CONSOLE ###########################
[...truncated 6430 lines...]
    [mkdir] Created dir: /home/jenkins/jenkins-slave/workspace/Hadoop-Hdfs-trunk/hadoop-hdfs-project/target/test-dir
[INFO] Executed tasks
[INFO] 
[INFO] --- maven-source-plugin:2.3:jar-no-fork (hadoop-java-sources) @ hadoop-hdfs-project
---
[INFO] 
[INFO] --- maven-source-plugin:2.3:test-jar-no-fork (hadoop-java-sources) @ hadoop-hdfs-project
---
[INFO] 
[INFO] --- maven-enforcer-plugin:1.3.1:enforce (dist-enforce) @ hadoop-hdfs-project ---
[INFO] 
[INFO] --- maven-site-plugin:3.4:attach-descriptor (attach-descriptor) @ hadoop-hdfs-project
---
[INFO] 
[INFO] --- maven-javadoc-plugin:2.8.1:jar (module-javadocs) @ hadoop-hdfs-project ---
[INFO] Skipping javadoc generation
[INFO] 
[INFO] --- maven-enforcer-plugin:1.3.1:enforce (depcheck) @ hadoop-hdfs-project ---
[INFO] 
[INFO] --- maven-checkstyle-plugin:2.15:checkstyle (default-cli) @ hadoop-hdfs-project ---
[INFO] 
[INFO] --- findbugs-maven-plugin:3.0.0:findbugs (default-cli) @ hadoop-hdfs-project ---
[INFO] ------------------------------------------------------------------------
[INFO] Reactor Summary:
[INFO] 
[INFO] Apache Hadoop HDFS Client ......................... SUCCESS [04:04 min]
[INFO] Apache Hadoop HDFS ................................ FAILURE [  03:52 h]
[INFO] Apache Hadoop HDFS Native Client .................. SKIPPED
[INFO] Apache Hadoop HttpFS .............................. SKIPPED
[INFO] Apache Hadoop HDFS BookKeeper Journal ............. SKIPPED
[INFO] Apache Hadoop HDFS-NFS ............................ SKIPPED
[INFO] Apache Hadoop HDFS Project ........................ SUCCESS [  0.059 s]
[INFO] ------------------------------------------------------------------------
[INFO] BUILD FAILURE
[INFO] ------------------------------------------------------------------------
[INFO] Total time: 03:56 h
[INFO] Finished at: 2015-10-30T13:13:42+00:00
[INFO] Final Memory: 57M/798M
[INFO] ------------------------------------------------------------------------
[ERROR] Failed to execute goal org.apache.maven.plugins:maven-surefire-plugin:2.17:test (default-test)
on project hadoop-hdfs: There are test failures.
[ERROR] 
[ERROR] Please refer to /home/jenkins/jenkins-slave/workspace/Hadoop-Hdfs-trunk/hadoop-hdfs-project/hadoop-hdfs/target/surefire-reports
for the individual test results.
[ERROR] -> [Help 1]
[ERROR] 
[ERROR] To see the full stack trace of the errors, re-run Maven with the -e switch.
[ERROR] Re-run Maven using the -X switch to enable full debug logging.
[ERROR] 
[ERROR] For more information about the errors and possible solutions, please read the following
articles:
[ERROR] [Help 1] http://cwiki.apache.org/confluence/display/MAVEN/MojoFailureException
[ERROR] 
[ERROR] After correcting the problems, you can resume the build with the command
[ERROR]   mvn <goals> -rf :hadoop-hdfs
Build step 'Execute shell' marked build as failure
Archiving artifacts
Recording test results
Updating YARN-4320
Updating YARN-3580
Updating HDFS-9323
Updating YARN-4312
Sending e-mails to: hdfs-dev@hadoop.apache.org
Email was triggered for: Failure - Any
Sending email for trigger: Failure - Any



###################################################################################
############################## FAILED TESTS (if any) ##############################
6 tests failed.
FAILED:  org.apache.hadoop.hdfs.server.datanode.TestDataNodeInitStorage.testDataNodeInitStorage

Error Message:
org/apache/hadoop/util/Tool

Stack Trace:
java.lang.NoClassDefFoundError: org/apache/hadoop/util/Tool
	at java.net.URLClassLoader$1.run(URLClassLoader.java:366)
	at java.net.URLClassLoader$1.run(URLClassLoader.java:355)
	at java.security.AccessController.doPrivileged(Native Method)
	at java.net.URLClassLoader.findClass(URLClassLoader.java:354)
	at java.lang.ClassLoader.loadClass(ClassLoader.java:425)
	at sun.misc.Launcher$AppClassLoader.loadClass(Launcher.java:308)
	at java.lang.ClassLoader.loadClass(ClassLoader.java:358)
	at org.apache.hadoop.hdfs.MiniDFSCluster$Builder.build(MiniDFSCluster.java:439)
	at org.apache.hadoop.hdfs.server.datanode.TestDataNodeInitStorage.testDataNodeInitStorage(TestDataNodeInitStorage.java:82)


FAILED:  org.apache.hadoop.hdfs.server.datanode.TestDirectoryScanner.testThrottling

Error Message:
Throttle is too permissive

Stack Trace:
java.lang.AssertionError: Throttle is too permissive
	at org.junit.Assert.fail(Assert.java:88)
	at org.junit.Assert.assertTrue(Assert.java:41)
	at org.apache.hadoop.hdfs.server.datanode.TestDirectoryScanner.testThrottling(TestDirectoryScanner.java:613)


FAILED:  org.apache.hadoop.hdfs.server.namenode.snapshot.TestOpenFilesWithSnapshot.testWithCheckpoint

Error Message:
Timed out waiting for Mini HDFS Cluster to start

Stack Trace:
java.io.IOException: Timed out waiting for Mini HDFS Cluster to start
	at org.apache.hadoop.hdfs.MiniDFSCluster.waitClusterUp(MiniDFSCluster.java:1343)
	at org.apache.hadoop.hdfs.MiniDFSCluster.restartNameNode(MiniDFSCluster.java:2019)
	at org.apache.hadoop.hdfs.MiniDFSCluster.restartNameNode(MiniDFSCluster.java:1989)
	at org.apache.hadoop.hdfs.server.namenode.snapshot.TestOpenFilesWithSnapshot.testWithCheckpoint(TestOpenFilesWithSnapshot.java:92)


FAILED:  org.apache.hadoop.hdfs.server.namenode.snapshot.TestOpenFilesWithSnapshot.testOpenFilesWithRename

Error Message:
Timed out waiting for Mini HDFS Cluster to start

Stack Trace:
java.io.IOException: Timed out waiting for Mini HDFS Cluster to start
	at org.apache.hadoop.hdfs.MiniDFSCluster.waitClusterUp(MiniDFSCluster.java:1343)
	at org.apache.hadoop.hdfs.MiniDFSCluster.restartNameNode(MiniDFSCluster.java:2019)
	at org.apache.hadoop.hdfs.MiniDFSCluster.restartNameNode(MiniDFSCluster.java:1989)
	at org.apache.hadoop.hdfs.server.namenode.snapshot.TestOpenFilesWithSnapshot.testOpenFilesWithRename(TestOpenFilesWithSnapshot.java:208)


FAILED:  org.apache.hadoop.hdfs.server.blockmanagement.TestNodeCount.testNodeCount

Error Message:
Timeout: excess replica count not equal to 2 for block blk_1073741825_1001 after 20000 msec.
 Last counts: live = 2, excess = 0, corrupt = 0

Stack Trace:
java.util.concurrent.TimeoutException: Timeout: excess replica count not equal to 2 for block
blk_1073741825_1001 after 20000 msec.  Last counts: live = 2, excess = 0, corrupt = 0
	at org.apache.hadoop.hdfs.server.blockmanagement.TestNodeCount.checkTimeout(TestNodeCount.java:152)
	at org.apache.hadoop.hdfs.server.blockmanagement.TestNodeCount.checkTimeout(TestNodeCount.java:146)
	at org.apache.hadoop.hdfs.server.blockmanagement.TestNodeCount.testNodeCount(TestNodeCount.java:130)


FAILED:  org.apache.hadoop.hdfs.server.namenode.TestFileTruncate.testTruncateWithDataNodesRestartImmediately

Error Message:
inode should complete in ~30000 ms.
Expected: is <true>
     but: was <false>

Stack Trace:
java.lang.AssertionError: inode should complete in ~30000 ms.
Expected: is <true>
     but: was <false>
	at org.hamcrest.MatcherAssert.assertThat(MatcherAssert.java:20)
	at org.junit.Assert.assertThat(Assert.java:865)
	at org.apache.hadoop.hdfs.server.namenode.TestFileTruncate.checkBlockRecovery(TestFileTruncate.java:1192)
	at org.apache.hadoop.hdfs.server.namenode.TestFileTruncate.checkBlockRecovery(TestFileTruncate.java:1176)
	at org.apache.hadoop.hdfs.server.namenode.TestFileTruncate.checkBlockRecovery(TestFileTruncate.java:1171)
	at org.apache.hadoop.hdfs.server.namenode.TestFileTruncate.testTruncateWithDataNodesRestartImmediately(TestFileTruncate.java:798)



Mime
  • Unnamed multipart/mixed (inline, None, 0 bytes)
View raw message