hadoop-hdfs-dev mailing list archives

Site index · List index
Message view « Date » · « Thread »
Top « Date » · « Thread »
From Apache Jenkins Server <jenk...@builds.apache.org>
Subject Build failed in Jenkins: Hadoop-Hdfs-trunk #2490
Date Fri, 30 Oct 2015 02:45:26 GMT
See <https://builds.apache.org/job/Hadoop-Hdfs-trunk/2490/changes>

Changes:

[jlowe] MAPREDUCE-6515. Update Application priority in AM side from AM-RM

[zhz] HDFS-9229. Expose size of NameNode directory as a metric. Contributed by

[wang] HDFS-9332. Fix Precondition failures from NameNodeEditLogRoller while

[jlowe] Update CHANGES.txt to reflect commit of MR-6273 to branch-2.7

[Arun Suresh] YARN-4310. FairScheduler: Log skipping reservation messages at DEBUG

[jeagles] YARN-4183. Enabling generic application history forces every job to get

------------------------------------------
[...truncated 12483 lines...]
[INFO] --- maven-checkstyle-plugin:2.15:checkstyle (default-cli) @ hadoop-hdfs-bkjournal ---
[INFO] There are 613 errors reported by Checkstyle 6.6 with checkstyle/checkstyle.xml ruleset.
[WARNING] Unable to locate Source XRef to link to - DISABLED
[INFO] 
[INFO] --- findbugs-maven-plugin:3.0.0:findbugs (default-cli) @ hadoop-hdfs-bkjournal ---
[INFO] Fork Value is true
[INFO] Done FindBugs Analysis....
[INFO]                                                                         
[INFO] ------------------------------------------------------------------------
[INFO] Building Apache Hadoop HDFS-NFS 3.0.0-SNAPSHOT
[INFO] ------------------------------------------------------------------------
Downloading: https://repository.apache.org/content/repositories/snapshots/org/apache/hadoop/hadoop-nfs/3.0.0-SNAPSHOT/maven-metadata.xml
786/786 B      
            
Downloaded: https://repository.apache.org/content/repositories/snapshots/org/apache/hadoop/hadoop-nfs/3.0.0-SNAPSHOT/maven-metadata.xml
(786 B at 2.9 KB/sec)
Downloading: https://repository.apache.org/content/repositories/snapshots/org/apache/hadoop/hadoop-nfs/3.0.0-SNAPSHOT/hadoop-nfs-3.0.0-20151030.004056-4152.pom
4/5 KB      
5/5 KB   
         
Downloaded: https://repository.apache.org/content/repositories/snapshots/org/apache/hadoop/hadoop-nfs/3.0.0-SNAPSHOT/hadoop-nfs-3.0.0-20151030.004056-4152.pom
(5 KB at 47.1 KB/sec)
Downloading: https://repository.apache.org/content/repositories/snapshots/org/apache/hadoop/hadoop-nfs/3.0.0-SNAPSHOT/hadoop-nfs-3.0.0-20151030.004056-4152.jar
4/156 KB   
8/156 KB   
8/156 KB   
12/156 KB   
14/156 KB   
16/156 KB   
20/156 KB   
22/156 KB   
24/156 KB   
28/156 KB   
30/156 KB   
32/156 KB   
36/156 KB   
38/156 KB   
40/156 KB   
44/156 KB   
45/156 KB   
48/156 KB   
52/156 KB   
53/156 KB   
56/156 KB   
60/156 KB   
61/156 KB   
64/156 KB   
68/156 KB   
69/156 KB   
72/156 KB   
76/156 KB   
77/156 KB   
80/156 KB   
84/156 KB   
85/156 KB   
88/156 KB   
92/156 KB   
96/156 KB   
96/156 KB   
100/156 KB   
104/156 KB   
104/156 KB   
108/156 KB   
112/156 KB   
112/156 KB   
116/156 KB   
120/156 KB   
120/156 KB   
124/156 KB   
128/156 KB   
128/156 KB   
131/156 KB   
135/156 KB   
136/156 KB   
139/156 KB   
143/156 KB   
144/156 KB   
147/156 KB   
151/156 KB   
152/156 KB   
155/156 KB   
156/156 KB   
             
Downloaded: https://repository.apache.org/content/repositories/snapshots/org/apache/hadoop/hadoop-nfs/3.0.0-SNAPSHOT/hadoop-nfs-3.0.0-20151030.004056-4152.jar
(156 KB at 448.8 KB/sec)
[INFO] 
[INFO] --- maven-clean-plugin:2.5:clean (default-clean) @ hadoop-hdfs-nfs ---
[INFO] Deleting <https://builds.apache.org/job/Hadoop-Hdfs-trunk/ws/hadoop-hdfs-project/hadoop-hdfs-nfs/target>
[INFO] 
[INFO] --- maven-antrun-plugin:1.7:run (create-testdirs) @ hadoop-hdfs-nfs ---
[INFO] Executing tasks

main:
    [mkdir] Created dir: <https://builds.apache.org/job/Hadoop-Hdfs-trunk/ws/hadoop-hdfs-project/hadoop-hdfs-nfs/target/test-dir>
[INFO] Executed tasks
[INFO] 
[INFO] --- maven-resources-plugin:2.6:resources (default-resources) @ hadoop-hdfs-nfs ---
[INFO] Using 'UTF-8' encoding to copy filtered resources.
[INFO] skip non existing resourceDirectory <https://builds.apache.org/job/Hadoop-Hdfs-trunk/ws/hadoop-hdfs-project/hadoop-hdfs-nfs/src/main/resources>
[INFO] 
[INFO] --- maven-compiler-plugin:3.1:compile (default-compile) @ hadoop-hdfs-nfs ---
[INFO] Changes detected - recompiling the module!
[INFO] Compiling 17 source files to <https://builds.apache.org/job/Hadoop-Hdfs-trunk/ws/hadoop-hdfs-project/hadoop-hdfs-nfs/target/classes>
[INFO] 
[INFO] --- maven-resources-plugin:2.6:testResources (default-testResources) @ hadoop-hdfs-nfs
---
[INFO] Using 'UTF-8' encoding to copy filtered resources.
[INFO] Copying 1 resource
[INFO] 
[INFO] --- maven-compiler-plugin:3.1:testCompile (default-testCompile) @ hadoop-hdfs-nfs ---
[INFO] Changes detected - recompiling the module!
[INFO] Compiling 13 source files to <https://builds.apache.org/job/Hadoop-Hdfs-trunk/ws/hadoop-hdfs-project/hadoop-hdfs-nfs/target/test-classes>
[INFO] 
[INFO] --- maven-surefire-plugin:2.17:test (default-test) @ hadoop-hdfs-nfs ---
[INFO] Surefire report directory: <https://builds.apache.org/job/Hadoop-Hdfs-trunk/ws/hadoop-hdfs-project/hadoop-hdfs-nfs/target/surefire-reports>

-------------------------------------------------------
 T E S T S
-------------------------------------------------------

-------------------------------------------------------
 T E S T S
-------------------------------------------------------
Running org.apache.hadoop.hdfs.nfs.nfs3.TestReaddir
Tests run: 2, Failures: 0, Errors: 0, Skipped: 0, Time elapsed: 6.759 sec - in org.apache.hadoop.hdfs.nfs.nfs3.TestReaddir
Running org.apache.hadoop.hdfs.nfs.nfs3.TestExportsTable
Tests run: 1, Failures: 0, Errors: 0, Skipped: 0, Time elapsed: 6.357 sec - in org.apache.hadoop.hdfs.nfs.nfs3.TestExportsTable
Running org.apache.hadoop.hdfs.nfs.nfs3.TestWrites
Tests run: 10, Failures: 0, Errors: 0, Skipped: 0, Time elapsed: 23.89 sec - in org.apache.hadoop.hdfs.nfs.nfs3.TestWrites
Running org.apache.hadoop.hdfs.nfs.nfs3.TestClientAccessPrivilege
Tests run: 1, Failures: 0, Errors: 0, Skipped: 0, Time elapsed: 6.516 sec - in org.apache.hadoop.hdfs.nfs.nfs3.TestClientAccessPrivilege
Running org.apache.hadoop.hdfs.nfs.nfs3.TestNfs3Utils
Tests run: 1, Failures: 0, Errors: 0, Skipped: 0, Time elapsed: 0.348 sec - in org.apache.hadoop.hdfs.nfs.nfs3.TestNfs3Utils
Running org.apache.hadoop.hdfs.nfs.nfs3.TestRpcProgramNfs3
Tests run: 22, Failures: 0, Errors: 0, Skipped: 0, Time elapsed: 10.273 sec - in org.apache.hadoop.hdfs.nfs.nfs3.TestRpcProgramNfs3
Running org.apache.hadoop.hdfs.nfs.nfs3.TestDFSClientCache
Tests run: 3, Failures: 0, Errors: 0, Skipped: 0, Time elapsed: 1.827 sec - in org.apache.hadoop.hdfs.nfs.nfs3.TestDFSClientCache
Running org.apache.hadoop.hdfs.nfs.nfs3.TestOffsetRange
Tests run: 5, Failures: 0, Errors: 0, Skipped: 0, Time elapsed: 0.096 sec - in org.apache.hadoop.hdfs.nfs.nfs3.TestOffsetRange
Running org.apache.hadoop.hdfs.nfs.nfs3.TestOpenFileCtxCache
Tests run: 2, Failures: 0, Errors: 0, Skipped: 0, Time elapsed: 32.589 sec - in org.apache.hadoop.hdfs.nfs.nfs3.TestOpenFileCtxCache
Running org.apache.hadoop.hdfs.nfs.nfs3.TestNfs3HttpServer
Tests run: 1, Failures: 0, Errors: 0, Skipped: 0, Time elapsed: 6.831 sec - in org.apache.hadoop.hdfs.nfs.nfs3.TestNfs3HttpServer
Running org.apache.hadoop.hdfs.nfs.TestMountd
Tests run: 1, Failures: 0, Errors: 0, Skipped: 0, Time elapsed: 6.193 sec - in org.apache.hadoop.hdfs.nfs.TestMountd

Results :

Tests run: 49, Failures: 0, Errors: 0, Skipped: 0

[INFO] 
[INFO] --- maven-jar-plugin:2.5:jar (default-jar) @ hadoop-hdfs-nfs ---
[INFO] Building jar: <https://builds.apache.org/job/Hadoop-Hdfs-trunk/ws/hadoop-hdfs-project/hadoop-hdfs-nfs/target/hadoop-hdfs-nfs-3.0.0-SNAPSHOT.jar>
[INFO] 
[INFO] --- maven-source-plugin:2.3:jar-no-fork (hadoop-java-sources) @ hadoop-hdfs-nfs ---
[INFO] Building jar: <https://builds.apache.org/job/Hadoop-Hdfs-trunk/ws/hadoop-hdfs-project/hadoop-hdfs-nfs/target/hadoop-hdfs-nfs-3.0.0-SNAPSHOT-sources.jar>
[INFO] 
[INFO] --- maven-source-plugin:2.3:test-jar-no-fork (hadoop-java-sources) @ hadoop-hdfs-nfs
---
[INFO] Building jar: <https://builds.apache.org/job/Hadoop-Hdfs-trunk/ws/hadoop-hdfs-project/hadoop-hdfs-nfs/target/hadoop-hdfs-nfs-3.0.0-SNAPSHOT-test-sources.jar>
[INFO] 
[INFO] --- maven-enforcer-plugin:1.3.1:enforce (dist-enforce) @ hadoop-hdfs-nfs ---
[INFO] 
[INFO] --- maven-site-plugin:3.4:attach-descriptor (attach-descriptor) @ hadoop-hdfs-nfs ---
[INFO] 
[INFO] --- maven-javadoc-plugin:2.8.1:jar (module-javadocs) @ hadoop-hdfs-nfs ---
[INFO] Skipping javadoc generation
[INFO] 
[INFO] --- maven-assembly-plugin:2.4:single (dist) @ hadoop-hdfs-nfs ---
[INFO] Reading assembly descriptor: ../../hadoop-assemblies/src/main/resources/assemblies/hadoop-hdfs-nfs-dist.xml
[WARNING] The following patterns were never triggered in this artifact exclusion filter:
o  'org.apache.hadoop:hadoop-common'
o  'org.slf4j:slf4j-api'
o  'org.slf4j:slf4j-log4j12'
o  'org.hsqldb:hsqldb'

[INFO] Copying files to <https://builds.apache.org/job/Hadoop-Hdfs-trunk/ws/hadoop-hdfs-project/hadoop-hdfs-nfs/target/hadoop-hdfs-nfs-3.0.0-SNAPSHOT>
[INFO] 
[INFO] --- maven-enforcer-plugin:1.3.1:enforce (depcheck) @ hadoop-hdfs-nfs ---
[INFO] 
[INFO] --- maven-checkstyle-plugin:2.15:checkstyle (default-cli) @ hadoop-hdfs-nfs ---
[INFO] There are 169 errors reported by Checkstyle 6.6 with checkstyle/checkstyle.xml ruleset.
[WARNING] Unable to locate Source XRef to link to - DISABLED
[INFO] 
[INFO] --- findbugs-maven-plugin:3.0.0:findbugs (default-cli) @ hadoop-hdfs-nfs ---
[INFO] Fork Value is true
     [java] Warnings generated: 2
[INFO] Done FindBugs Analysis....
[INFO]                                                                         
[INFO] ------------------------------------------------------------------------
[INFO] Building Apache Hadoop HDFS Project 3.0.0-SNAPSHOT
[INFO] ------------------------------------------------------------------------
[INFO] 
[INFO] --- maven-clean-plugin:2.5:clean (default-clean) @ hadoop-hdfs-project ---
[INFO] Deleting <https://builds.apache.org/job/Hadoop-Hdfs-trunk/ws/hadoop-hdfs-project/target>
[INFO] 
[INFO] --- maven-antrun-plugin:1.7:run (create-testdirs) @ hadoop-hdfs-project ---
[INFO] Executing tasks

main:
    [mkdir] Created dir: <https://builds.apache.org/job/Hadoop-Hdfs-trunk/ws/hadoop-hdfs-project/target/test-dir>
[INFO] Executed tasks
[INFO] 
[INFO] --- maven-source-plugin:2.3:jar-no-fork (hadoop-java-sources) @ hadoop-hdfs-project
---
[INFO] 
[INFO] --- maven-source-plugin:2.3:test-jar-no-fork (hadoop-java-sources) @ hadoop-hdfs-project
---
[INFO] 
[INFO] --- maven-enforcer-plugin:1.3.1:enforce (dist-enforce) @ hadoop-hdfs-project ---
[INFO] 
[INFO] --- maven-site-plugin:3.4:attach-descriptor (attach-descriptor) @ hadoop-hdfs-project
---
[INFO] 
[INFO] --- maven-javadoc-plugin:2.8.1:jar (module-javadocs) @ hadoop-hdfs-project ---
[INFO] Skipping javadoc generation
[INFO] 
[INFO] --- maven-enforcer-plugin:1.3.1:enforce (depcheck) @ hadoop-hdfs-project ---
[INFO] 
[INFO] --- maven-checkstyle-plugin:2.15:checkstyle (default-cli) @ hadoop-hdfs-project ---
[INFO] 
[INFO] --- findbugs-maven-plugin:3.0.0:findbugs (default-cli) @ hadoop-hdfs-project ---
[INFO] ------------------------------------------------------------------------
[INFO] Reactor Summary:
[INFO] 
[INFO] Apache Hadoop HDFS Client ......................... SUCCESS [04:15 min]
[INFO] Apache Hadoop HDFS ................................ SUCCESS [  04:21 h]
[INFO] Apache Hadoop HDFS Native Client .................. SUCCESS [ 43.208 s]
[INFO] Apache Hadoop HttpFS .............................. FAILURE [04:43 min]
[INFO] Apache Hadoop HDFS BookKeeper Journal ............. SUCCESS [07:30 min]
[INFO] Apache Hadoop HDFS-NFS ............................ SUCCESS [02:07 min]
[INFO] Apache Hadoop HDFS Project ........................ SUCCESS [  0.051 s]
[INFO] ------------------------------------------------------------------------
[INFO] BUILD FAILURE
[INFO] ------------------------------------------------------------------------
[INFO] Total time: 04:41 h
[INFO] Finished at: 2015-10-30T02:44:47+00:00
[INFO] Final Memory: 98M/1344M
[INFO] ------------------------------------------------------------------------
[ERROR] Failed to execute goal org.apache.maven.plugins:maven-enforcer-plugin:1.3.1:enforce
(depcheck) on project hadoop-hdfs-httpfs: Some Enforcer rules have failed. Look above for
specific messages explaining why the rule failed. -> [Help 1]
[ERROR] 
[ERROR] To see the full stack trace of the errors, re-run Maven with the -e switch.
[ERROR] Re-run Maven using the -X switch to enable full debug logging.
[ERROR] 
[ERROR] For more information about the errors and possible solutions, please read the following
articles:
[ERROR] [Help 1] http://cwiki.apache.org/confluence/display/MAVEN/MojoExecutionException
[ERROR] 
[ERROR] After correcting the problems, you can resume the build with the command
[ERROR]   mvn <goals> -rf :hadoop-hdfs-httpfs
Build step 'Execute shell' marked build as failure
Archiving artifacts
Recording test results
Updating YARN-4310
Updating MAPREDUCE-6515
Updating HDFS-9229
Updating YARN-4183
Updating HDFS-9332

Mime
View raw message