hadoop-hdfs-dev mailing list archives

Site index · List index
Message view « Date » · « Thread »
Top « Date » · « Thread »
From Apache Jenkins Server <jenk...@builds.apache.org>
Subject Build failed in Jenkins: Hadoop-Hdfs-trunk-Java8 #446
Date Fri, 02 Oct 2015 20:13:11 GMT
See <https://builds.apache.org/job/Hadoop-Hdfs-trunk-Java8/446/changes>

Changes:

[jing9] HDFS-9185. Fix null tracer in ErasureCodingWorker. Contributed by Rakesh

[jghoman] HDFS-9191. Typo in Hdfs.java. NoSuchElementException is misspelled.

[lei] HDFS-9015. Refactor TestReplicationPolicy to test different block

[yzhang] HDFS-9100. HDFS Balancer does not respect

------------------------------------------
[...truncated 32775 lines...]
  TestDecommission.teardown:125->cleanupFile:225 NullPointer
  TestDecommission.setup:102 » NoClassDefFound org/apache/htrace/Trace
  TestDecommission.teardown:125->cleanupFile:225 NullPointer
  TestDecommission.setup:102 » NoClassDefFound org/apache/htrace/Trace
  TestDecommission.teardown:125->cleanupFile:225 NullPointer
  TestDecommission.setup:102 » NoClassDefFound org/apache/htrace/Trace
  TestDecommission.teardown:125->cleanupFile:225 NullPointer
  TestDecommission.setup:102 » NoClassDefFound org/apache/htrace/Trace
  TestDecommission.teardown:125->cleanupFile:225 NullPointer
  TestDecommission.setup:102 » NoClassDefFound org/apache/htrace/Trace
  TestDecommission.teardown:125->cleanupFile:225 NullPointer
  TestDecommission.setup:102 » NoClassDefFound org/apache/htrace/Trace
  TestDecommission.teardown:125->cleanupFile:225 NullPointer
  TestDecommission.setup:102 » NoClassDefFound org/apache/htrace/Trace
  TestDecommission.teardown:125->cleanupFile:225 NullPointer
  TestDecommission.setup:102 » NoClassDefFound org/apache/htrace/Trace
  TestDecommission.teardown:125->cleanupFile:225 NullPointer
  TestDecommission.setup:102 » NoClassDefFound org/apache/htrace/Trace
  TestDecommission.teardown:125->cleanupFile:225 NullPointer
  TestDecommission.setup:102 » NoClassDefFound org/apache/htrace/Trace
  TestDecommission.teardown:125->cleanupFile:225 NullPointer
  TestDFSUtil.testGetPassword:890 » NoClassDefFound org/apache/htrace/Trace
  TestGetBlocks.testReadSelectNonStaleDatanode:94 » NoSuchMethod org.apache.hado...
  TestGetBlocks.testGetBlocks:183 » NoSuchMethod org.apache.hadoop.util.Shutdown...
  TestMultiThreadedHflush.testHflushWhileClosing:154 » NoSuchMethod org.apache.h...
  TestMultiThreadedHflush.testMultipleHflushersRepl1:117->doTestMultipleHflushers:129 »
NoSuchMethod
  TestMultiThreadedHflush.testMultipleHflushersRepl3:122->doTestMultipleHflushers:129 »
NoSuchMethod
  TestStripedBlockUtil.<init>:88 » NoClassDefFound org/apache/hadoop/io/erasurec...
  TestStripedBlockUtil.<init>:88 NoClassDefFound Could not initialize class org....
  TestStripedBlockUtil.<init>:88 NoClassDefFound Could not initialize class org....
  TestLease.testLeaseAfterRename:166 » NoSuchMethod org.apache.hadoop.util.Shutd...
  TestLease.testFactory:369->createDFSClientAs:394 » NoClassDefFound org/apache/...
  TestLease.testLeaseAfterRenameAndRecreate:263 » NoSuchMethod org.apache.hadoop...
  TestLease.testLease:301 » NoSuchMethod org.apache.hadoop.util.ShutdownHookMana...
  TestLease.testLeaseAbort:78 » NoSuchMethod org.apache.hadoop.util.ShutdownHook...
  TestInjectionForSimulatedStorage.testInjection:130 » NoSuchMethod org.apache.h...
  TestHFlush.hSyncUpdateLength_00:108 » NoSuchMethod org.apache.hadoop.util.Shut...
  TestHFlush.hSyncUpdateLength_01:194->doTheJob:309 » NoSuchMethod org.apache.ha...
  TestHFlush.hSyncUpdateLength_02:237->doTheJob:309 » NoSuchMethod org.apache.ha...
  TestHFlush.hSyncUpdateLength_03:271->doTheJob:309 » NoSuchMethod org.apache.ha...
  TestHFlush.hFlush_01:58->doTheJob:309 » NoSuchMethod org.apache.hadoop.util.Sh...
  TestHFlush.hFlush_02:77->doTheJob:309 » NoSuchMethod org.apache.hadoop.util.Sh...
  TestHFlush.hFlush_03:96->doTheJob:309 » NoSuchMethod org.apache.hadoop.util.Sh...
  TestHFlush.hSyncEndBlock_00:137 » NoSuchMethod org.apache.hadoop.util.Shutdown...
  TestHFlush.hSyncEndBlock_01:205->doTheJob:309 » NoSuchMethod org.apache.hadoop...
  TestHFlush.hSyncEndBlock_02:250->doTheJob:309 » NoSuchMethod org.apache.hadoop...
  TestHFlush.hSyncEndBlock_03:284->doTheJob:309 » NoSuchMethod org.apache.hadoop...
  TestHFlush.hSyncEndBlockAndUpdateLength:217->doTheJob:309 » NoSuchMethod org.a...
  TestHFlush.testHFlushInterrupted:446 » NoSuchMethod org.apache.hadoop.util.Shu...
  TestHFlush.testPipelineHeartbeat:396 » NoSuchMethod org.apache.hadoop.util.Shu...
  TestErasureCodingPolicies.setupCluster:52 » NoSuchMethod org.apache.hadoop.uti...
  TestErasureCodingPolicies.shutdownCluster:60 NullPointer
  TestErasureCodingPolicies.setupCluster:52 » NoSuchMethod org.apache.hadoop.uti...
  TestErasureCodingPolicies.shutdownCluster:60 NullPointer
  TestErasureCodingPolicies.setupCluster:52 » NoSuchMethod org.apache.hadoop.uti...
  TestErasureCodingPolicies.shutdownCluster:60 NullPointer
  TestErasureCodingPolicies.setupCluster:52 » NoSuchMethod org.apache.hadoop.uti...
  TestErasureCodingPolicies.shutdownCluster:60 NullPointer
  TestErasureCodingPolicies.setupCluster:52 » NoSuchMethod org.apache.hadoop.uti...
  TestErasureCodingPolicies.shutdownCluster:60 NullPointer
  TestErasureCodingPolicies.setupCluster:52 » NoSuchMethod org.apache.hadoop.uti...
  TestErasureCodingPolicies.shutdownCluster:60 NullPointer
  TestErasureCodingPolicies.setupCluster:52 » NoSuchMethod org.apache.hadoop.uti...
  TestErasureCodingPolicies.shutdownCluster:60 NullPointer
  TestRemoteBlockReader>TestBlockReaderBase.setup:58 » NoSuchMethod org.apache.h...
  TestRemoteBlockReader>TestBlockReaderBase.shutdown:71 » NullPointer
  TestHdfsAdmin.setUpCluster:43 » NoSuchMethod org.apache.hadoop.util.ShutdownHo...
  TestHdfsAdmin.setUpCluster:43 » NoSuchMethod org.apache.hadoop.util.ShutdownHo...
  TestDistributedFileSystem.testDFSSeekExceptions:360 » NoSuchMethod org.apache....
  TestDistributedFileSystem.testGetServerDefaults:1006 » NoSuchMethod org.apache...
  TestDistributedFileSystem.testDFSClientPeerWriteTimeout:1024 » NoSuchMethod or...
  TestDistributedFileSystem.testDFSClientPeerReadTimeout:979 » NoSuchMethod org....
  TestDistributedFileSystem.testDFSClose:159 » NoSuchMethod org.apache.hadoop.ut...
  TestDistributedFileSystem.testStatistics:560 » NoSuchMethod org.apache.hadoop....
  TestDistributedFileSystem.testListFiles:952 » NoSuchMethod org.apache.hadoop.u...
  TestDistributedFileSystem.testAllWithDualPort:794->testFileSystemCloseAll:132 » NoSuchMethod
  TestDistributedFileSystem.testDFSClient:401 » NoSuchMethod org.apache.hadoop.u...
  TestDistributedFileSystem.testFileSystemCloseAll:132 » NoSuchMethod org.apache...
  TestDistributedFileSystem.testFileChecksum:663 » NoSuchMethod org.apache.hadoo...
  TestDistributedFileSystem.testLocatedFileStatusStorageIdsTypes:823 » NoSuchMethod
  TestDistributedFileSystem.testEmptyDelegationToken:118 » NoSuchMethod org.apac...
  TestDistributedFileSystem.testAllWithNoXmlDefaults:810->testFileSystemCloseAll:132 »
NoSuchMethod
  TestDistributedFileSystem.testCreateWithCustomChecksum:892 » NoSuchMethod org....
  TestDistributedFileSystem.testFileCloseStatus:932 » NoSuchMethod org.apache.ha...
  TestRollingUpgradeRollback.testRollbackCommand:97 » NoSuchMethod org.apache.ha...
  TestRollingUpgradeRollback.testRollbackWithQJM:155 » NoSuchMethod org.apache.h...
  TestRollingUpgradeRollback.testRollbackWithHAQJM:210 » NoSuchMethod org.apache...
  TestRollingUpgrade.testFinalizeWithMultipleNN:426->testFinalize:436 » NoSuchMethod
  TestRollingUpgrade.testCheckpointWithMultipleNN:565->testCheckpoint:577 » NoSuchMethod
  TestRollingUpgrade.testDFSAdminRollingUpgradeCommands:86 » NoSuchMethod org.ap...
  TestRollingUpgrade.testCheckpoint:560->testCheckpoint:577 » NoSuchMethod org.a...
  TestRollingUpgrade.testQuery:483->testQuery:495 » NoSuchMethod org.apache.hado...
  TestRollingUpgrade.testRollingUpgradeWithQJM:170 » NoSuchMethod org.apache.had...
  TestRollingUpgrade.testDFSAdminDatanodeUpgradeControlCommands:394 » NoSuchMethod
  TestRollingUpgrade.testFinalize:421->testFinalize:436 » NoSuchMethod org.apach...
  TestRollingUpgrade.testRollback:308 » NoSuchMethod org.apache.hadoop.util.Shut...
  TestRollingUpgrade.testQueryWithMultipleNN:488->testQuery:495 » NoSuchMethod o...
  TestRollingUpgrade.testQueryAfterRestart:537 » NoSuchMethod org.apache.hadoop....
  TestRollingUpgrade.testCheckpointWithSNN:651 » NoSuchMethod org.apache.hadoop....
  TestDatanodeDeath.testComplex:419->complexTest:292 » NoSuchMethod org.apache.h...
  TestDatanodeDeath.testSimple0:410->simpleTest:350 » NoSuchMethod org.apache.ha...
  TestDatanodeDeath.testSimple1:413->simpleTest:350 » NoSuchMethod org.apache.ha...
  TestDatanodeDeath.testSimple2:416->simpleTest:350 » NoSuchMethod org.apache.ha...
  TestCrcCorruption.testCorruptionDuringWrt:95 » NoSuchMethod org.apache.hadoop....
  TestCrcCorruption.testCrcCorruption:295->thistest:159 » NoSuchMethod org.apach...
  TestCrcCorruption.testEntirelyCorruptFileThreeNodes:330->doTestEntirelyCorruptFile:341
» NoSuchMethod
  TestCrcCorruption.testEntirelyCorruptFileOneNode:317->doTestEntirelyCorruptFile:341 »
NoSuchMethod
  TestFsShellPermission.testDelete:245 » NoSuchMethod org.apache.hadoop.util.Shu...
  TestSaslDataTransfer.testServerSaslNoClientSasl:120->startCluster:196 » NoSuchMethod
  TestSaslDataTransfer.testClientAndServerDoNotHaveCommonQop:106->startCluster:196 » NoSuchMethod
  TestSaslDataTransfer.testAuthentication:77->startCluster:196 » NoSuchMethod or...
  TestSaslDataTransfer.testPrivacy:97->startCluster:196 » NoSuchMethod org.apach...
  TestSaslDataTransfer.testNoSaslAndSecurePortsIgnored:164->startCluster:196 » NoSuchMethod
  TestSaslDataTransfer.testIntegrity:87->startCluster:196 » NoSuchMethod org.apa...
  TestDFSAddressConfig.testDFSAddressConfig:52 » NoSuchMethod org.apache.hadoop....
  TestParallelUnixDomainRead.setupCluster:46->TestParallelReadUtil.setupCluster:70 » NoSuchMethod
  TestParallelUnixDomainRead.teardownCluster:58->TestParallelReadUtil.teardownCluster:393
» NullPointer
  TestReplication.testReplication:273->runReplication:225 » NoSuchMethod org.apa...
  TestReplication.testPendingReplicationRetry:342 » NoSuchMethod org.apache.hado...
  TestReplication.testReplicationWhenBlockCorruption:498 » NoSuchMethod org.apac...
  TestReplication.testBadBlockReportOnTransferMissingBlockFile:211->testBadBlockReportOnTransfer:154
» NoSuchMethod
  TestReplication.testBadBlockReportOnTransfer:202->testBadBlockReportOnTransfer:154 »
NoSuchMethod
  TestReplication.testReplicationSimulatedStorag:267->runReplication:225 » NoSuchMethod
  TestReplication.testReplicateLenMismatchedBlock:429 » NoSuchMethod org.apache....
  TestRead.testEOFWithBlockReaderLocal:64 » NoSuchMethod org.apache.hadoop.util....
  TestRead.testEOFWithRemoteBlockReader:79 » NoSuchMethod org.apache.hadoop.util...
  TestRead.testReadReservedPath:95 » NoSuchMethod org.apache.hadoop.util.Shutdow...
  TestPipelines.startUpCluster:63 » NoSuchMethod org.apache.hadoop.util.Shutdown...
  TestDFSStripedOutputStreamWithFailure.testAddBlockWhenNoSufficientDataBlockNumOfNodes:200->setup:140
» NoSuchMethod
  TestDFSStripedOutputStreamWithFailure.testAddBlockWhenNoSufficientParityNumOfNodes:237->setup:140
» NoSuchMethod
  TestDFSStripedOutputStreamWithFailure.testBlockTokenExpired:183->setup:140 » NoSuchMethod
  TestDFSStripedOutputStreamWithFailure.testMultipleDatanodeFailure56:169->runTestWithMultipleFailure:284->setup:140
» NoSuchMethod
  TestParallelShortCircuitReadNoChecksum.setupCluster:47->TestParallelReadUtil.setupCluster:70
» NoSuchMethod
  TestParallelShortCircuitReadNoChecksum.teardownCluster:59->TestParallelReadUtil.teardownCluster:393
» NullPointer
  TestParallelShortCircuitRead.setupCluster:47->TestParallelReadUtil.setupCluster:70 »
NoSuchMethod
  TestParallelShortCircuitRead.teardownCluster:59->TestParallelReadUtil.teardownCluster:393
» NullPointer
  TestHDFSTrash.setUp:40 » NoSuchMethod org.apache.hadoop.util.ShutdownHookManag...
  TestFileAppend.testSimpleFlush:123 » NoSuchMethod org.apache.hadoop.util.Shutd...
  TestFileAppend.testFailedAppendBlockRejection:416 » NoSuchMethod org.apache.ha...
  TestFileAppend.testAppendAfterSoftLimit:329 » NoSuchMethod org.apache.hadoop.u...
  TestFileAppend.testMultiAppend2:469 » NoSuchMethod org.apache.hadoop.util.Shut...
  TestFileAppend.testAppendCorruptedBlock:541 » NoSuchMethod org.apache.hadoop.u...
  TestFileAppend.testComplexFlush:179 » NoSuchMethod org.apache.hadoop.util.Shut...
  TestFileAppend.testFileNotFound »  Unexpected exception, expected<java.io.File...
  TestFileAppend.testAppend2Twice:283 » NoSuchMethod org.apache.hadoop.util.Shut...
  TestFileAppend.testAppend2AfterSoftLimit:369 » NoSuchMethod org.apache.hadoop....
  TestFileAppend.testAppendTwice:244 » NoSuchMethod org.apache.hadoop.util.Shutd...
  TestDFSRemove.testRemove:60 » NoSuchMethod org.apache.hadoop.util.ShutdownHook...
  TestDFSRollback.testRollback:141 » NoClassDefFound org/apache/hadoop/io/erasur...
  TestReadWhileWriting.pipeline_02_03:62 » NoSuchMethod org.apache.hadoop.util.S...
  TestConnCache.testReadFromOneDN:96 » NoSuchMethod org.apache.hadoop.util.Shutd...
  TestPersistBlocks.testEarlierVersionEditLog:343 » NoSuchMethod org.apache.hado...
  TestPersistBlocks.testRestartDfsWithAbandonedBlock:163 » NoSuchMethod org.apac...
  TestPersistBlocks.testRestartWithAppend:273 » NoSuchMethod org.apache.hadoop.u...
  TestPersistBlocks.testRestartWithPartialBlockHflushed:224 » NoSuchMethod org.a...
  TestPersistBlocks.TestRestartDfsWithFlush:80->testRestartDfs:104 » NoSuchMethod
  TestSetrepDecreasing.testSetrepDecreasing:27 » NoSuchMethod org.apache.hadoop....
  TestDatanodeLayoutUpgrade.testUpgradeToIdBasedLayout:45 » NoSuchMethod org.apa...
  TestFileCorruption.testArrayOutOfBoundsException:130 » NoSuchMethod org.apache...
  TestFileCorruption.testLocalFileCorruption:102 » NoClassDefFound org/apache/ht...
  TestFileCorruption.testFileCorruption:73 » NoSuchMethod org.apache.hadoop.util...
  TestDFSStartupVersions.testVersions:242 » NoClassDefFound org/apache/hadoop/io...
  TestWriteConfigurationToDFS.testWriteConf:39 » NoSuchMethod org.apache.hadoop....
  TestListFilesInDFS.testSetUp:42 » NoSuchMethod org.apache.hadoop.util.Shutdown...
  TestListFilesInDFS.testShutdown:49 NullPointer

Tests run: 3623, Failures: 28, Errors: 1850, Skipped: 15

[INFO]                                                                         
[INFO] ------------------------------------------------------------------------
[INFO] Skipping Apache Hadoop HttpFS
[INFO] This project has been banned from the build due to previous failures.
[INFO] ------------------------------------------------------------------------
[INFO]                                                                         
[INFO] ------------------------------------------------------------------------
[INFO] Skipping Apache Hadoop HDFS BookKeeper Journal
[INFO] This project has been banned from the build due to previous failures.
[INFO] ------------------------------------------------------------------------
[INFO]                                                                         
[INFO] ------------------------------------------------------------------------
[INFO] Skipping Apache Hadoop HDFS-NFS
[INFO] This project has been banned from the build due to previous failures.
[INFO] ------------------------------------------------------------------------
[INFO]                                                                         
[INFO] ------------------------------------------------------------------------
[INFO] Building Apache Hadoop HDFS Project 3.0.0-SNAPSHOT
[INFO] ------------------------------------------------------------------------
[INFO] 
[INFO] --- maven-clean-plugin:2.5:clean (default-clean) @ hadoop-hdfs-project ---
[INFO] Deleting <https://builds.apache.org/job/Hadoop-Hdfs-trunk-Java8/ws/hadoop-hdfs-project/target>
[INFO] 
[INFO] --- maven-antrun-plugin:1.7:run (create-testdirs) @ hadoop-hdfs-project ---
[INFO] Executing tasks

main:
    [mkdir] Created dir: <https://builds.apache.org/job/Hadoop-Hdfs-trunk-Java8/ws/hadoop-hdfs-project/target/test-dir>
[INFO] Executed tasks
[INFO] 
[INFO] --- maven-source-plugin:2.3:jar-no-fork (hadoop-java-sources) @ hadoop-hdfs-project
---
[INFO] 
[INFO] --- maven-source-plugin:2.3:test-jar-no-fork (hadoop-java-sources) @ hadoop-hdfs-project
---
[INFO] 
[INFO] --- maven-enforcer-plugin:1.3.1:enforce (dist-enforce) @ hadoop-hdfs-project ---
[INFO] 
[INFO] --- maven-site-plugin:3.4:attach-descriptor (attach-descriptor) @ hadoop-hdfs-project
---
[INFO] 
[INFO] --- maven-javadoc-plugin:2.8.1:jar (module-javadocs) @ hadoop-hdfs-project ---
[INFO] Not executing Javadoc as the project is not a Java classpath-capable package
[INFO] 
[INFO] --- maven-enforcer-plugin:1.3.1:enforce (depcheck) @ hadoop-hdfs-project ---
[INFO] 
[INFO] --- maven-checkstyle-plugin:2.15:checkstyle (default-cli) @ hadoop-hdfs-project ---
[INFO] 
[INFO] --- findbugs-maven-plugin:3.0.0:findbugs (default-cli) @ hadoop-hdfs-project ---
[INFO] ------------------------------------------------------------------------
[INFO] Reactor Summary:
[INFO] 
[INFO] Apache Hadoop HDFS Client ......................... SUCCESS [03:42 min]
[INFO] Apache Hadoop HDFS ................................ FAILURE [48:34 min]
[INFO] Apache Hadoop HttpFS .............................. SKIPPED
[INFO] Apache Hadoop HDFS BookKeeper Journal ............. SKIPPED
[INFO] Apache Hadoop HDFS-NFS ............................ SKIPPED
[INFO] Apache Hadoop HDFS Project ........................ SUCCESS [  0.051 s]
[INFO] ------------------------------------------------------------------------
[INFO] BUILD FAILURE
[INFO] ------------------------------------------------------------------------
[INFO] Total time: 52:18 min
[INFO] Finished at: 2015-10-02T20:13:24+00:00
[INFO] Final Memory: 75M/963M
[INFO] ------------------------------------------------------------------------
[ERROR] Failed to execute goal org.apache.maven.plugins:maven-surefire-plugin:2.17:test (default-test)
on project hadoop-hdfs: ExecutionException: java.lang.RuntimeException: The forked VM terminated
without properly saying goodbye. VM crash or System.exit called?
[ERROR] Command was /bin/sh -c cd <https://builds.apache.org/job/Hadoop-Hdfs-trunk-Java8/ws/hadoop-hdfs-project/hadoop-hdfs>
&& /home/jenkins/tools/java/jdk1.8.0/jre/bin/java -Xmx2048m -XX:MaxPermSize=768m -XX:+HeapDumpOnOutOfMemoryError
-jar <https://builds.apache.org/job/Hadoop-Hdfs-trunk-Java8/ws/hadoop-hdfs-project/hadoop-hdfs/target/surefire/surefirebooter8134372324044985668.jar>
<https://builds.apache.org/job/Hadoop-Hdfs-trunk-Java8/ws/hadoop-hdfs-project/hadoop-hdfs/target/surefire/surefire2127287417778644682tmp>
<https://builds.apache.org/job/Hadoop-Hdfs-trunk-Java8/ws/hadoop-hdfs-project/hadoop-hdfs/target/surefire/surefire_108349941836171043571tmp>
[ERROR] -> [Help 1]
[ERROR] 
[ERROR] To see the full stack trace of the errors, re-run Maven with the -e switch.
[ERROR] Re-run Maven using the -X switch to enable full debug logging.
[ERROR] 
[ERROR] For more information about the errors and possible solutions, please read the following
articles:
[ERROR] [Help 1] http://cwiki.apache.org/confluence/display/MAVEN/MojoFailureException
[ERROR] 
[ERROR] After correcting the problems, you can resume the build with the command
[ERROR]   mvn <goals> -rf :hadoop-hdfs
Build step 'Execute shell' marked build as failure
Archiving artifacts
Recording test results
Updating HDFS-9100
Updating HDFS-9191
Updating HDFS-9185
Updating HDFS-9015

Mime
View raw message