hadoop-hdfs-dev mailing list archives

Site index · List index
Message view « Date » · « Thread »
Top « Date » · « Thread »
From Apache Jenkins Server <jenk...@builds.apache.org>
Subject Build failed in Jenkins: Hadoop-Hdfs-trunk #2489
Date Thu, 29 Oct 2015 20:43:21 GMT
See <https://builds.apache.org/job/Hadoop-Hdfs-trunk/2489/changes>

Changes:

[jlowe] YARN-2902. Killing a container that is localizing can orphan resources

------------------------------------------
[...truncated 6150 lines...]
Tests run: 4, Failures: 0, Errors: 0, Skipped: 0, Time elapsed: 17.028 sec - in org.apache.hadoop.hdfs.TestParallelShortCircuitLegacyRead
Running org.apache.hadoop.hdfs.TestClose
Tests run: 1, Failures: 0, Errors: 0, Skipped: 0, Time elapsed: 5.279 sec - in org.apache.hadoop.hdfs.TestClose
Running org.apache.hadoop.hdfs.TestRecoverStripedFile
Tests run: 13, Failures: 0, Errors: 0, Skipped: 0, Time elapsed: 93.867 sec - in org.apache.hadoop.hdfs.TestRecoverStripedFile
Running org.apache.hadoop.hdfs.TestDFSMkdirs
Tests run: 3, Failures: 0, Errors: 0, Skipped: 0, Time elapsed: 7.992 sec - in org.apache.hadoop.hdfs.TestDFSMkdirs
Running org.apache.hadoop.hdfs.TestFileCreationEmpty
Tests run: 1, Failures: 0, Errors: 0, Skipped: 0, Time elapsed: 10.15 sec - in org.apache.hadoop.hdfs.TestFileCreationEmpty
Running org.apache.hadoop.hdfs.TestWriteRead
Tests run: 3, Failures: 0, Errors: 0, Skipped: 0, Time elapsed: 28.946 sec - in org.apache.hadoop.hdfs.TestWriteRead
Running org.apache.hadoop.hdfs.TestMiniDFSCluster
Tests run: 7, Failures: 0, Errors: 0, Skipped: 0, Time elapsed: 16.087 sec - in org.apache.hadoop.hdfs.TestMiniDFSCluster
Running org.apache.hadoop.hdfs.TestDFSFinalize
Tests run: 1, Failures: 0, Errors: 0, Skipped: 0, Time elapsed: 18.801 sec - in org.apache.hadoop.hdfs.TestDFSFinalize
Running org.apache.hadoop.hdfs.TestHDFSFileSystemContract
Tests run: 44, Failures: 0, Errors: 0, Skipped: 0, Time elapsed: 79.817 sec - in org.apache.hadoop.hdfs.TestHDFSFileSystemContract
Running org.apache.hadoop.hdfs.TestEncryptionZones
Tests run: 19, Failures: 0, Errors: 0, Skipped: 0, Time elapsed: 50.104 sec - in org.apache.hadoop.hdfs.TestEncryptionZones
Running org.apache.hadoop.hdfs.TestRollingUpgradeDowngrade
Tests run: 2, Failures: 0, Errors: 0, Skipped: 0, Time elapsed: 9.776 sec - in org.apache.hadoop.hdfs.TestRollingUpgradeDowngrade
Running org.apache.hadoop.hdfs.TestParallelShortCircuitReadUnCached
Tests run: 4, Failures: 0, Errors: 0, Skipped: 0, Time elapsed: 34.325 sec - in org.apache.hadoop.hdfs.TestParallelShortCircuitReadUnCached
Running org.apache.hadoop.hdfs.TestClientProtocolForPipelineRecovery
Tests run: 5, Failures: 0, Errors: 0, Skipped: 0, Time elapsed: 41.796 sec - in org.apache.hadoop.hdfs.TestClientProtocolForPipelineRecovery
Running org.apache.hadoop.hdfs.TestEncryptionZonesWithHA
Tests run: 1, Failures: 0, Errors: 0, Skipped: 0, Time elapsed: 7.102 sec - in org.apache.hadoop.hdfs.TestEncryptionZonesWithHA
Running org.apache.hadoop.hdfs.TestWriteBlockGetsBlockLengthHint
Tests run: 1, Failures: 0, Errors: 0, Skipped: 0, Time elapsed: 4.731 sec - in org.apache.hadoop.hdfs.TestWriteBlockGetsBlockLengthHint
Running org.apache.hadoop.hdfs.TestDFSUpgrade
Tests run: 2, Failures: 0, Errors: 0, Skipped: 0, Time elapsed: 18.619 sec - in org.apache.hadoop.hdfs.TestDFSUpgrade
Running org.apache.hadoop.hdfs.TestSnapshotCommands
Tests run: 6, Failures: 0, Errors: 0, Skipped: 0, Time elapsed: 5.253 sec - in org.apache.hadoop.hdfs.TestSnapshotCommands
Running org.apache.hadoop.hdfs.TestDataTransferProtocol
Tests run: 4, Failures: 0, Errors: 0, Skipped: 0, Time elapsed: 7.335 sec - in org.apache.hadoop.hdfs.TestDataTransferProtocol
Running org.apache.hadoop.hdfs.TestFileCreation
Tests run: 23, Failures: 0, Errors: 0, Skipped: 0, Time elapsed: 99.441 sec - in org.apache.hadoop.hdfs.TestFileCreation
Running org.apache.hadoop.hdfs.TestDFSInotifyEventInputStream
Tests run: 5, Failures: 0, Errors: 0, Skipped: 0, Time elapsed: 21.264 sec - in org.apache.hadoop.hdfs.TestDFSInotifyEventInputStream
Running org.apache.hadoop.hdfs.TestDFSUpgradeFromImage
Tests run: 8, Failures: 0, Errors: 0, Skipped: 0, Time elapsed: 16.074 sec - in org.apache.hadoop.hdfs.TestDFSUpgradeFromImage
Running org.apache.hadoop.hdfs.TestEncryptionZonesWithKMS
Tests run: 20, Failures: 0, Errors: 0, Skipped: 0, Time elapsed: 65.916 sec - in org.apache.hadoop.hdfs.TestEncryptionZonesWithKMS
Running org.apache.hadoop.hdfs.TestDecommission
Tests run: 18, Failures: 0, Errors: 0, Skipped: 1, Time elapsed: 153.937 sec - in org.apache.hadoop.hdfs.TestDecommission
Running org.apache.hadoop.hdfs.TestDFSUtil
Tests run: 31, Failures: 0, Errors: 0, Skipped: 0, Time elapsed: 3.002 sec - in org.apache.hadoop.hdfs.TestDFSUtil
Running org.apache.hadoop.hdfs.TestGetBlocks
Tests run: 3, Failures: 0, Errors: 0, Skipped: 0, Time elapsed: 47.561 sec - in org.apache.hadoop.hdfs.TestGetBlocks
Running org.apache.hadoop.hdfs.TestMultiThreadedHflush
Tests run: 3, Failures: 0, Errors: 0, Skipped: 0, Time elapsed: 11.552 sec - in org.apache.hadoop.hdfs.TestMultiThreadedHflush
Running org.apache.hadoop.hdfs.util.TestCyclicIteration
Tests run: 1, Failures: 0, Errors: 0, Skipped: 0, Time elapsed: 0.089 sec - in org.apache.hadoop.hdfs.util.TestCyclicIteration
Running org.apache.hadoop.hdfs.util.TestBestEffortLongFile
Tests run: 2, Failures: 0, Errors: 0, Skipped: 0, Time elapsed: 0.271 sec - in org.apache.hadoop.hdfs.util.TestBestEffortLongFile
Running org.apache.hadoop.hdfs.util.TestDiff
Tests run: 1, Failures: 0, Errors: 0, Skipped: 0, Time elapsed: 3.332 sec - in org.apache.hadoop.hdfs.util.TestDiff
Running org.apache.hadoop.hdfs.util.TestStripedBlockUtil
Tests run: 3, Failures: 0, Errors: 0, Skipped: 0, Time elapsed: 4.367 sec - in org.apache.hadoop.hdfs.util.TestStripedBlockUtil
Running org.apache.hadoop.hdfs.util.TestXMLUtils
Tests run: 6, Failures: 0, Errors: 0, Skipped: 0, Time elapsed: 0.087 sec - in org.apache.hadoop.hdfs.util.TestXMLUtils
Running org.apache.hadoop.hdfs.util.TestLightWeightHashSet
Tests run: 14, Failures: 0, Errors: 0, Skipped: 0, Time elapsed: 0.234 sec - in org.apache.hadoop.hdfs.util.TestLightWeightHashSet
Running org.apache.hadoop.hdfs.util.TestMD5FileUtils
Tests run: 5, Failures: 0, Errors: 0, Skipped: 0, Time elapsed: 0.398 sec - in org.apache.hadoop.hdfs.util.TestMD5FileUtils
Running org.apache.hadoop.hdfs.util.TestLightWeightLinkedSet
Tests run: 17, Failures: 0, Errors: 0, Skipped: 0, Time elapsed: 0.252 sec - in org.apache.hadoop.hdfs.util.TestLightWeightLinkedSet
Running org.apache.hadoop.hdfs.util.TestAtomicFileOutputStream
Tests run: 4, Failures: 0, Errors: 0, Skipped: 1, Time elapsed: 0.352 sec - in org.apache.hadoop.hdfs.util.TestAtomicFileOutputStream
Running org.apache.hadoop.hdfs.TestLease
Tests run: 5, Failures: 0, Errors: 0, Skipped: 0, Time elapsed: 11.726 sec - in org.apache.hadoop.hdfs.TestLease
Running org.apache.hadoop.hdfs.TestInjectionForSimulatedStorage
Tests run: 1, Failures: 0, Errors: 0, Skipped: 0, Time elapsed: 15.876 sec - in org.apache.hadoop.hdfs.TestInjectionForSimulatedStorage
Running org.apache.hadoop.hdfs.TestHFlush
Tests run: 14, Failures: 0, Errors: 0, Skipped: 0, Time elapsed: 42.037 sec - in org.apache.hadoop.hdfs.TestHFlush
Running org.apache.hadoop.hdfs.TestErasureCodingPolicies
Tests run: 7, Failures: 0, Errors: 0, Skipped: 0, Time elapsed: 13.156 sec - in org.apache.hadoop.hdfs.TestErasureCodingPolicies
Running org.apache.hadoop.hdfs.TestRemoteBlockReader
Tests run: 1, Failures: 0, Errors: 0, Skipped: 0, Time elapsed: 5.67 sec - in org.apache.hadoop.hdfs.TestRemoteBlockReader
Running org.apache.hadoop.hdfs.TestHdfsAdmin
Tests run: 2, Failures: 0, Errors: 0, Skipped: 0, Time elapsed: 4.97 sec - in org.apache.hadoop.hdfs.TestHdfsAdmin
Running org.apache.hadoop.hdfs.TestDistributedFileSystem
Tests run: 18, Failures: 0, Errors: 0, Skipped: 0, Time elapsed: 58.525 sec - in org.apache.hadoop.hdfs.TestDistributedFileSystem
Running org.apache.hadoop.hdfs.TestRollingUpgradeRollback
Tests run: 3, Failures: 0, Errors: 0, Skipped: 0, Time elapsed: 13.117 sec - in org.apache.hadoop.hdfs.TestRollingUpgradeRollback
Running org.apache.hadoop.hdfs.TestRollingUpgrade
Tests run: 12, Failures: 0, Errors: 0, Skipped: 0, Time elapsed: 128.579 sec - in org.apache.hadoop.hdfs.TestRollingUpgrade
Running org.apache.hadoop.hdfs.TestDatanodeDeath
Tests run: 4, Failures: 0, Errors: 0, Skipped: 0, Time elapsed: 74.534 sec - in org.apache.hadoop.hdfs.TestDatanodeDeath
Running org.apache.hadoop.hdfs.TestCrcCorruption
Tests run: 4, Failures: 0, Errors: 0, Skipped: 0, Time elapsed: 20.115 sec - in org.apache.hadoop.hdfs.TestCrcCorruption
Running org.apache.hadoop.hdfs.TestFsShellPermission
Tests run: 1, Failures: 0, Errors: 0, Skipped: 0, Time elapsed: 5.546 sec - in org.apache.hadoop.hdfs.TestFsShellPermission
Running org.apache.hadoop.hdfs.protocol.TestLocatedBlock
Tests run: 1, Failures: 0, Errors: 0, Skipped: 0, Time elapsed: 0.271 sec - in org.apache.hadoop.hdfs.protocol.TestLocatedBlock
Running org.apache.hadoop.hdfs.protocol.TestLayoutVersion
Tests run: 11, Failures: 0, Errors: 0, Skipped: 0, Time elapsed: 0.306 sec - in org.apache.hadoop.hdfs.protocol.TestLayoutVersion
Running org.apache.hadoop.hdfs.protocol.datatransfer.sasl.TestSaslDataTransfer
Tests run: 8, Failures: 0, Errors: 0, Skipped: 0, Time elapsed: 41 sec - in org.apache.hadoop.hdfs.protocol.datatransfer.sasl.TestSaslDataTransfer
Running org.apache.hadoop.hdfs.protocol.datatransfer.TestPacketReceiver
Tests run: 1, Failures: 0, Errors: 0, Skipped: 0, Time elapsed: 0.457 sec - in org.apache.hadoop.hdfs.protocol.datatransfer.TestPacketReceiver
Running org.apache.hadoop.hdfs.protocol.TestAnnotations
Tests run: 1, Failures: 0, Errors: 0, Skipped: 0, Time elapsed: 0.167 sec - in org.apache.hadoop.hdfs.protocol.TestAnnotations
Running org.apache.hadoop.hdfs.protocol.TestBlockListAsLongs
Tests run: 7, Failures: 0, Errors: 0, Skipped: 0, Time elapsed: 1.07 sec - in org.apache.hadoop.hdfs.protocol.TestBlockListAsLongs
Running org.apache.hadoop.hdfs.TestDFSAddressConfig
Tests run: 1, Failures: 0, Errors: 0, Skipped: 0, Time elapsed: 5.7 sec - in org.apache.hadoop.hdfs.TestDFSAddressConfig
Running org.apache.hadoop.hdfs.TestDFSConfigKeys
Tests run: 1, Failures: 0, Errors: 0, Skipped: 0, Time elapsed: 0.221 sec - in org.apache.hadoop.hdfs.TestDFSConfigKeys
Running org.apache.hadoop.hdfs.TestParallelUnixDomainRead
Tests run: 4, Failures: 0, Errors: 0, Skipped: 0, Time elapsed: 39.517 sec - in org.apache.hadoop.hdfs.TestParallelUnixDomainRead
Running org.apache.hadoop.hdfs.TestReplication
Tests run: 9, Failures: 0, Errors: 0, Skipped: 0, Time elapsed: 56.224 sec - in org.apache.hadoop.hdfs.TestReplication
Running org.apache.hadoop.hdfs.TestRead
Tests run: 3, Failures: 0, Errors: 0, Skipped: 0, Time elapsed: 8.577 sec - in org.apache.hadoop.hdfs.TestRead
Running org.apache.hadoop.hdfs.TestPipelines
Tests run: 1, Failures: 0, Errors: 0, Skipped: 0, Time elapsed: 6.38 sec - in org.apache.hadoop.hdfs.TestPipelines
Running org.apache.hadoop.hdfs.TestDFSStripedOutputStreamWithFailure
Tests run: 6, Failures: 0, Errors: 0, Skipped: 0, Time elapsed: 191.741 sec - in org.apache.hadoop.hdfs.TestDFSStripedOutputStreamWithFailure
Running org.apache.hadoop.hdfs.TestDeprecatedKeys
Tests run: 1, Failures: 0, Errors: 0, Skipped: 0, Time elapsed: 0.575 sec - in org.apache.hadoop.hdfs.TestDeprecatedKeys
Running org.apache.hadoop.hdfs.TestAclsEndToEnd
Tests run: 4, Failures: 0, Errors: 0, Skipped: 0, Time elapsed: 15.67 sec - in org.apache.hadoop.hdfs.TestAclsEndToEnd
Running org.apache.hadoop.hdfs.TestParallelShortCircuitReadNoChecksum
Tests run: 4, Failures: 0, Errors: 0, Skipped: 0, Time elapsed: 15.31 sec - in org.apache.hadoop.hdfs.TestParallelShortCircuitReadNoChecksum
Running org.apache.hadoop.hdfs.TestParallelShortCircuitRead
Tests run: 4, Failures: 0, Errors: 0, Skipped: 0, Time elapsed: 15.679 sec - in org.apache.hadoop.hdfs.TestParallelShortCircuitRead
Running org.apache.hadoop.hdfs.TestHDFSTrash
Tests run: 2, Failures: 0, Errors: 0, Skipped: 0, Time elapsed: 6.661 sec - in org.apache.hadoop.hdfs.TestHDFSTrash
Running org.apache.hadoop.hdfs.TestFileAppend
Tests run: 10, Failures: 0, Errors: 0, Skipped: 0, Time elapsed: 29.123 sec - in org.apache.hadoop.hdfs.TestFileAppend
Running org.apache.hadoop.hdfs.TestDFSRemove
Tests run: 1, Failures: 0, Errors: 0, Skipped: 0, Time elapsed: 16.592 sec - in org.apache.hadoop.hdfs.TestDFSRemove
Running org.apache.hadoop.hdfs.TestDFSRollback
Tests run: 1, Failures: 0, Errors: 0, Skipped: 0, Time elapsed: 17.808 sec - in org.apache.hadoop.hdfs.TestDFSRollback
Running org.apache.hadoop.hdfs.TestReadWhileWriting
Tests run: 1, Failures: 0, Errors: 0, Skipped: 0, Time elapsed: 7.731 sec - in org.apache.hadoop.hdfs.TestReadWhileWriting
Running org.apache.hadoop.hdfs.TestConnCache
Tests run: 1, Failures: 0, Errors: 0, Skipped: 0, Time elapsed: 4.893 sec - in org.apache.hadoop.hdfs.TestConnCache
Running org.apache.hadoop.hdfs.TestPersistBlocks
Tests run: 5, Failures: 0, Errors: 0, Skipped: 0, Time elapsed: 27.513 sec - in org.apache.hadoop.hdfs.TestPersistBlocks
Running org.apache.hadoop.hdfs.TestSetrepDecreasing
Tests run: 1, Failures: 0, Errors: 0, Skipped: 0, Time elapsed: 17.857 sec - in org.apache.hadoop.hdfs.TestSetrepDecreasing
Running org.apache.hadoop.hdfs.TestDatanodeLayoutUpgrade
Tests run: 1, Failures: 0, Errors: 0, Skipped: 0, Time elapsed: 7.472 sec - in org.apache.hadoop.hdfs.TestDatanodeLayoutUpgrade
Running org.apache.hadoop.hdfs.TestFileCorruption
Tests run: 3, Failures: 0, Errors: 0, Skipped: 0, Time elapsed: 9.765 sec - in org.apache.hadoop.hdfs.TestFileCorruption
Running org.apache.hadoop.hdfs.TestDFSStartupVersions
Tests run: 1, Failures: 0, Errors: 0, Skipped: 0, Time elapsed: 14.05 sec - in org.apache.hadoop.hdfs.TestDFSStartupVersions
Running org.apache.hadoop.hdfs.TestWriteConfigurationToDFS
Tests run: 1, Failures: 0, Errors: 0, Skipped: 0, Time elapsed: 6.163 sec - in org.apache.hadoop.hdfs.TestWriteConfigurationToDFS
Running org.apache.hadoop.hdfs.TestListFilesInDFS
Tests run: 2, Failures: 0, Errors: 0, Skipped: 0, Time elapsed: 5.513 sec - in org.apache.hadoop.hdfs.TestListFilesInDFS

Results :

Failed tests: 
  TestDirectoryScanner.testThrottling:613 Throttle is too permissive

Tests in error: 
  TestNodeCount.testNodeCount:130->checkTimeout:146->checkTimeout:152 Timeout Ti...

Tests run: 3865, Failures: 1, Errors: 1, Skipped: 17

[INFO]                                                                         
[INFO] ------------------------------------------------------------------------
[INFO] Skipping Apache Hadoop HDFS Native Client
[INFO] This project has been banned from the build due to previous failures.
[INFO] ------------------------------------------------------------------------
[INFO]                                                                         
[INFO] ------------------------------------------------------------------------
[INFO] Skipping Apache Hadoop HttpFS
[INFO] This project has been banned from the build due to previous failures.
[INFO] ------------------------------------------------------------------------
[INFO]                                                                         
[INFO] ------------------------------------------------------------------------
[INFO] Skipping Apache Hadoop HDFS BookKeeper Journal
[INFO] This project has been banned from the build due to previous failures.
[INFO] ------------------------------------------------------------------------
[INFO]                                                                         
[INFO] ------------------------------------------------------------------------
[INFO] Skipping Apache Hadoop HDFS-NFS
[INFO] This project has been banned from the build due to previous failures.
[INFO] ------------------------------------------------------------------------
[INFO]                                                                         
[INFO] ------------------------------------------------------------------------
[INFO] Building Apache Hadoop HDFS Project 3.0.0-SNAPSHOT
[INFO] ------------------------------------------------------------------------
[INFO] 
[INFO] --- maven-clean-plugin:2.5:clean (default-clean) @ hadoop-hdfs-project ---
[INFO] Deleting <https://builds.apache.org/job/Hadoop-Hdfs-trunk/ws/hadoop-hdfs-project/target>
[INFO] 
[INFO] --- maven-antrun-plugin:1.7:run (create-testdirs) @ hadoop-hdfs-project ---
[INFO] Executing tasks

main:
    [mkdir] Created dir: <https://builds.apache.org/job/Hadoop-Hdfs-trunk/ws/hadoop-hdfs-project/target/test-dir>
[INFO] Executed tasks
[INFO] 
[INFO] --- maven-source-plugin:2.3:jar-no-fork (hadoop-java-sources) @ hadoop-hdfs-project
---
[INFO] 
[INFO] --- maven-source-plugin:2.3:test-jar-no-fork (hadoop-java-sources) @ hadoop-hdfs-project
---
[INFO] 
[INFO] --- maven-enforcer-plugin:1.3.1:enforce (dist-enforce) @ hadoop-hdfs-project ---
[INFO] 
[INFO] --- maven-site-plugin:3.4:attach-descriptor (attach-descriptor) @ hadoop-hdfs-project
---
[INFO] 
[INFO] --- maven-javadoc-plugin:2.8.1:jar (module-javadocs) @ hadoop-hdfs-project ---
[INFO] Skipping javadoc generation
[INFO] 
[INFO] --- maven-enforcer-plugin:1.3.1:enforce (depcheck) @ hadoop-hdfs-project ---
[INFO] 
[INFO] --- maven-checkstyle-plugin:2.15:checkstyle (default-cli) @ hadoop-hdfs-project ---
[INFO] 
[INFO] --- findbugs-maven-plugin:3.0.0:findbugs (default-cli) @ hadoop-hdfs-project ---
[INFO] ------------------------------------------------------------------------
[INFO] Reactor Summary:
[INFO] 
[INFO] Apache Hadoop HDFS Client ......................... SUCCESS [03:56 min]
[INFO] Apache Hadoop HDFS ................................ FAILURE [  03:50 h]
[INFO] Apache Hadoop HDFS Native Client .................. SKIPPED
[INFO] Apache Hadoop HttpFS .............................. SKIPPED
[INFO] Apache Hadoop HDFS BookKeeper Journal ............. SKIPPED
[INFO] Apache Hadoop HDFS-NFS ............................ SKIPPED
[INFO] Apache Hadoop HDFS Project ........................ SUCCESS [  0.063 s]
[INFO] ------------------------------------------------------------------------
[INFO] BUILD FAILURE
[INFO] ------------------------------------------------------------------------
[INFO] Total time: 03:54 h
[INFO] Finished at: 2015-10-29T20:43:00+00:00
[INFO] Final Memory: 55M/756M
[INFO] ------------------------------------------------------------------------
[ERROR] Failed to execute goal org.apache.maven.plugins:maven-surefire-plugin:2.17:test (default-test)
on project hadoop-hdfs: There are test failures.
[ERROR] 
[ERROR] Please refer to <https://builds.apache.org/job/Hadoop-Hdfs-trunk/ws/hadoop-hdfs-project/hadoop-hdfs/target/surefire-reports>
for the individual test results.
[ERROR] -> [Help 1]
[ERROR] 
[ERROR] To see the full stack trace of the errors, re-run Maven with the -e switch.
[ERROR] Re-run Maven using the -X switch to enable full debug logging.
[ERROR] 
[ERROR] For more information about the errors and possible solutions, please read the following
articles:
[ERROR] [Help 1] http://cwiki.apache.org/confluence/display/MAVEN/MojoFailureException
[ERROR] 
[ERROR] After correcting the problems, you can resume the build with the command
[ERROR]   mvn <goals> -rf :hadoop-hdfs
Build step 'Execute shell' marked build as failure
Archiving artifacts
Recording test results
Updating YARN-2902

Mime
View raw message