hadoop-hdfs-dev mailing list archives

Site index · List index
Message view « Date » · « Thread »
Top « Date » · « Thread »
From Apache Jenkins Server <jenk...@builds.apache.org>
Subject Hadoop-Hdfs-trunk-Java8 - Build # 495 - Still Failing
Date Wed, 14 Oct 2015 17:36:31 GMT
See https://builds.apache.org/job/Hadoop-Hdfs-trunk-Java8/495/

###################################################################################
########################## LAST 60 LINES OF THE CONSOLE ###########################
[...truncated 7609 lines...]
[INFO] Executing tasks

main:
    [mkdir] Created dir: /home/jenkins/jenkins-slave/workspace/Hadoop-Hdfs-trunk-Java8/hadoop-hdfs-project/target/test-dir
[INFO] Executed tasks
[INFO] 
[INFO] --- maven-source-plugin:2.3:jar-no-fork (hadoop-java-sources) @ hadoop-hdfs-project
---
[INFO] 
[INFO] --- maven-source-plugin:2.3:test-jar-no-fork (hadoop-java-sources) @ hadoop-hdfs-project
---
[INFO] 
[INFO] --- maven-enforcer-plugin:1.3.1:enforce (dist-enforce) @ hadoop-hdfs-project ---
[INFO] 
[INFO] --- maven-site-plugin:3.4:attach-descriptor (attach-descriptor) @ hadoop-hdfs-project
---
[INFO] 
[INFO] --- maven-javadoc-plugin:2.8.1:jar (module-javadocs) @ hadoop-hdfs-project ---
[INFO] Not executing Javadoc as the project is not a Java classpath-capable package
[INFO] 
[INFO] --- maven-enforcer-plugin:1.3.1:enforce (depcheck) @ hadoop-hdfs-project ---
[INFO] 
[INFO] --- maven-checkstyle-plugin:2.15:checkstyle (default-cli) @ hadoop-hdfs-project ---
[INFO] 
[INFO] --- findbugs-maven-plugin:3.0.0:findbugs (default-cli) @ hadoop-hdfs-project ---
[INFO] ------------------------------------------------------------------------
[INFO] Reactor Summary:
[INFO] 
[INFO] Apache Hadoop HDFS Client ......................... SUCCESS [03:37 min]
[INFO] Apache Hadoop HDFS ................................ FAILURE [  03:48 h]
[INFO] Apache Hadoop HDFS Native Client .................. SKIPPED
[INFO] Apache Hadoop HttpFS .............................. SKIPPED
[INFO] Apache Hadoop HDFS BookKeeper Journal ............. SKIPPED
[INFO] Apache Hadoop HDFS-NFS ............................ SKIPPED
[INFO] Apache Hadoop HDFS Project ........................ SUCCESS [  0.055 s]
[INFO] ------------------------------------------------------------------------
[INFO] BUILD FAILURE
[INFO] ------------------------------------------------------------------------
[INFO] Total time: 03:52 h
[INFO] Finished at: 2015-10-14T17:37:01+00:00
[INFO] Final Memory: 55M/417M
[INFO] ------------------------------------------------------------------------
[ERROR] Failed to execute goal org.apache.maven.plugins:maven-surefire-plugin:2.17:test (default-test)
on project hadoop-hdfs: There are test failures.
[ERROR] 
[ERROR] Please refer to /home/jenkins/jenkins-slave/workspace/Hadoop-Hdfs-trunk-Java8/hadoop-hdfs-project/hadoop-hdfs/target/surefire-reports
for the individual test results.
[ERROR] -> [Help 1]
[ERROR] 
[ERROR] To see the full stack trace of the errors, re-run Maven with the -e switch.
[ERROR] Re-run Maven using the -X switch to enable full debug logging.
[ERROR] 
[ERROR] For more information about the errors and possible solutions, please read the following
articles:
[ERROR] [Help 1] http://cwiki.apache.org/confluence/display/MAVEN/MojoFailureException
[ERROR] 
[ERROR] After correcting the problems, you can resume the build with the command
[ERROR]   mvn <goals> -rf :hadoop-hdfs
Build step 'Execute shell' marked build as failure
Archiving artifacts
Recording test results
Updating YARN-4250
Sending e-mails to: hdfs-dev@hadoop.apache.org
Email was triggered for: Failure - Any
Sending email for trigger: Failure - Any



###################################################################################
############################## FAILED TESTS (if any) ##############################
11 tests failed.
FAILED:  org.apache.hadoop.hdfs.TestDistributedFileSystem.testLocatedFileStatusStorageIdsTypes

Error Message:
Unexpected num storage ids expected:<2> but was:<1>

Stack Trace:
java.lang.AssertionError: Unexpected num storage ids expected:<2> but was:<1>
	at org.junit.Assert.fail(Assert.java:88)
	at org.junit.Assert.failNotEquals(Assert.java:743)
	at org.junit.Assert.assertEquals(Assert.java:118)
	at org.junit.Assert.assertEquals(Assert.java:555)
	at org.apache.hadoop.hdfs.TestDistributedFileSystem.testLocatedFileStatusStorageIdsTypes(TestDistributedFileSystem.java:855)


FAILED:  org.apache.hadoop.hdfs.server.mover.TestStorageMover.testMigrateFileToArchival

Error Message:
org/apache/hadoop/util/IntrusiveCollection$IntrusiveIterator

Stack Trace:
java.lang.NoClassDefFoundError: org/apache/hadoop/util/IntrusiveCollection$IntrusiveIterator
	at org.apache.hadoop.util.IntrusiveCollection.iterator(IntrusiveCollection.java:213)
	at org.apache.hadoop.util.IntrusiveCollection.clear(IntrusiveCollection.java:368)
	at org.apache.hadoop.hdfs.server.blockmanagement.DatanodeManager.clearPendingCachingCommands(DatanodeManager.java:1570)
	at org.apache.hadoop.hdfs.server.namenode.FSNamesystem.stopActiveServices(FSNamesystem.java:1218)
	at org.apache.hadoop.hdfs.server.namenode.FSNamesystem.close(FSNamesystem.java:1578)
	at org.apache.hadoop.hdfs.server.namenode.NameNode.stopCommonServices(NameNode.java:723)
	at org.apache.hadoop.hdfs.server.namenode.NameNode.stop(NameNode.java:893)
	at org.apache.hadoop.hdfs.MiniDFSCluster.shutdown(MiniDFSCluster.java:1892)
	at org.apache.hadoop.hdfs.MiniDFSCluster.shutdown(MiniDFSCluster.java:1861)
	at org.apache.hadoop.hdfs.MiniDFSCluster.shutdown(MiniDFSCluster.java:1854)
	at org.apache.hadoop.hdfs.server.mover.TestStorageMover$MigrationTest.shutdownCluster(TestStorageMover.java:233)
	at org.apache.hadoop.hdfs.server.mover.TestStorageMover$MigrationTest.runBasicTest(TestStorageMover.java:225)
	at org.apache.hadoop.hdfs.server.mover.TestStorageMover$MigrationTest.access$600(TestStorageMover.java:186)
	at org.apache.hadoop.hdfs.server.mover.TestStorageMover.testMigrateFileToArchival(TestStorageMover.java:482)


FAILED:  org.apache.hadoop.hdfs.server.mover.TestStorageMover.testMoveSpecificPaths

Error Message:
Test resulted in an unexpected exit

Stack Trace:
java.lang.AssertionError: Test resulted in an unexpected exit
	at org.apache.hadoop.hdfs.MiniDFSCluster.shutdown(MiniDFSCluster.java:1874)
	at org.apache.hadoop.hdfs.MiniDFSCluster.shutdown(MiniDFSCluster.java:1861)
	at org.apache.hadoop.hdfs.MiniDFSCluster.shutdown(MiniDFSCluster.java:1854)
	at org.apache.hadoop.hdfs.server.mover.TestStorageMover$MigrationTest.shutdownCluster(TestStorageMover.java:233)
	at org.apache.hadoop.hdfs.server.mover.TestStorageMover.testMoveSpecificPaths(TestStorageMover.java:526)


FAILED:  org.apache.hadoop.hdfs.server.mover.TestStorageMover.testNoSpaceArchive

Error Message:
org/apache/hadoop/util/IntrusiveCollection$IntrusiveIterator

Stack Trace:
java.lang.NoClassDefFoundError: org/apache/hadoop/util/IntrusiveCollection$IntrusiveIterator
	at org.apache.hadoop.util.IntrusiveCollection.iterator(IntrusiveCollection.java:213)
	at org.apache.hadoop.util.IntrusiveCollection.clear(IntrusiveCollection.java:368)
	at org.apache.hadoop.hdfs.server.blockmanagement.DatanodeManager.clearPendingCachingCommands(DatanodeManager.java:1570)
	at org.apache.hadoop.hdfs.server.namenode.FSNamesystem.stopActiveServices(FSNamesystem.java:1218)
	at org.apache.hadoop.hdfs.server.namenode.FSNamesystem.close(FSNamesystem.java:1578)
	at org.apache.hadoop.hdfs.server.namenode.NameNode.stopCommonServices(NameNode.java:723)
	at org.apache.hadoop.hdfs.server.namenode.NameNode.stop(NameNode.java:893)
	at org.apache.hadoop.hdfs.MiniDFSCluster.shutdown(MiniDFSCluster.java:1892)
	at org.apache.hadoop.hdfs.MiniDFSCluster.shutdown(MiniDFSCluster.java:1861)
	at org.apache.hadoop.hdfs.MiniDFSCluster.shutdown(MiniDFSCluster.java:1854)
	at org.apache.hadoop.hdfs.server.mover.TestStorageMover$MigrationTest.shutdownCluster(TestStorageMover.java:233)
	at org.apache.hadoop.hdfs.server.mover.TestStorageMover.testNoSpaceArchive(TestStorageMover.java:759)


FAILED:  org.apache.hadoop.hdfs.server.mover.TestStorageMover.testNoSpaceDisk

Error Message:
Test resulted in an unexpected exit

Stack Trace:
java.lang.AssertionError: Test resulted in an unexpected exit
	at org.apache.hadoop.hdfs.MiniDFSCluster.shutdown(MiniDFSCluster.java:1874)
	at org.apache.hadoop.hdfs.MiniDFSCluster.shutdown(MiniDFSCluster.java:1861)
	at org.apache.hadoop.hdfs.MiniDFSCluster.shutdown(MiniDFSCluster.java:1854)
	at org.apache.hadoop.hdfs.server.mover.TestStorageMover$MigrationTest.shutdownCluster(TestStorageMover.java:233)
	at org.apache.hadoop.hdfs.server.mover.TestStorageMover.testNoSpaceDisk(TestStorageMover.java:700)


FAILED:  org.apache.hadoop.hdfs.server.mover.TestStorageMover.testMigrateOpenFileToArchival

Error Message:
org/apache/hadoop/util/IntrusiveCollection$IntrusiveIterator

Stack Trace:
java.lang.NoClassDefFoundError: org/apache/hadoop/util/IntrusiveCollection$IntrusiveIterator
	at org.apache.hadoop.util.IntrusiveCollection.iterator(IntrusiveCollection.java:213)
	at org.apache.hadoop.util.IntrusiveCollection.clear(IntrusiveCollection.java:368)
	at org.apache.hadoop.hdfs.server.blockmanagement.DatanodeManager.clearPendingCachingCommands(DatanodeManager.java:1570)
	at org.apache.hadoop.hdfs.server.namenode.FSNamesystem.stopActiveServices(FSNamesystem.java:1218)
	at org.apache.hadoop.hdfs.server.namenode.FSNamesystem.close(FSNamesystem.java:1578)
	at org.apache.hadoop.hdfs.server.namenode.NameNode.stopCommonServices(NameNode.java:723)
	at org.apache.hadoop.hdfs.server.namenode.NameNode.stop(NameNode.java:893)
	at org.apache.hadoop.hdfs.MiniDFSCluster.shutdown(MiniDFSCluster.java:1892)
	at org.apache.hadoop.hdfs.MiniDFSCluster.shutdown(MiniDFSCluster.java:1861)
	at org.apache.hadoop.hdfs.MiniDFSCluster.shutdown(MiniDFSCluster.java:1854)
	at org.apache.hadoop.hdfs.server.mover.TestStorageMover$MigrationTest.shutdownCluster(TestStorageMover.java:233)
	at org.apache.hadoop.hdfs.server.mover.TestStorageMover.testMigrateOpenFileToArchival(TestStorageMover.java:589)


FAILED:  org.apache.hadoop.hdfs.server.mover.TestStorageMover.testHotWarmColdDirs

Error Message:
Test resulted in an unexpected exit

Stack Trace:
java.lang.AssertionError: Test resulted in an unexpected exit
	at org.apache.hadoop.hdfs.MiniDFSCluster.shutdown(MiniDFSCluster.java:1874)
	at org.apache.hadoop.hdfs.MiniDFSCluster.shutdown(MiniDFSCluster.java:1861)
	at org.apache.hadoop.hdfs.MiniDFSCluster.shutdown(MiniDFSCluster.java:1854)
	at org.apache.hadoop.hdfs.server.mover.TestStorageMover$MigrationTest.shutdownCluster(TestStorageMover.java:233)
	at org.apache.hadoop.hdfs.server.mover.TestStorageMover.testHotWarmColdDirs(TestStorageMover.java:611)


FAILED:  org.apache.hadoop.hdfs.server.namenode.TestEditLogRace.testEditLogRolling

Error Message:
org/apache/hadoop/util/ShutdownHookManager

Stack Trace:
java.lang.NoClassDefFoundError: org/apache/hadoop/util/ShutdownHookManager
	at java.net.URLClassLoader$1.run(URLClassLoader.java:372)
	at java.net.URLClassLoader$1.run(URLClassLoader.java:361)
	at java.security.AccessController.doPrivileged(Native Method)
	at java.net.URLClassLoader.findClass(URLClassLoader.java:360)
	at java.lang.ClassLoader.loadClass(ClassLoader.java:424)
	at sun.misc.Launcher$AppClassLoader.loadClass(Launcher.java:308)
	at java.lang.ClassLoader.loadClass(ClassLoader.java:357)
	at org.apache.hadoop.hdfs.MiniDFSCluster.shutdown(MiniDFSCluster.java:1897)
	at org.apache.hadoop.hdfs.MiniDFSCluster.shutdown(MiniDFSCluster.java:1861)
	at org.apache.hadoop.hdfs.MiniDFSCluster.shutdown(MiniDFSCluster.java:1854)
	at org.apache.hadoop.hdfs.MiniDFSCluster.initMiniDFSCluster(MiniDFSCluster.java:852)
	at org.apache.hadoop.hdfs.MiniDFSCluster.<init>(MiniDFSCluster.java:480)
	at org.apache.hadoop.hdfs.MiniDFSCluster$Builder.build(MiniDFSCluster.java:439)
	at org.apache.hadoop.hdfs.server.namenode.TestEditLogRace.testEditLogRolling(TestEditLogRace.java:184)


FAILED:  org.apache.hadoop.hdfs.server.namenode.TestEditLogRace.testSaveImageWhileSyncInProgress

Error Message:
java.lang.reflect.InvocationTargetException

Stack Trace:
java.lang.RuntimeException: java.lang.reflect.InvocationTargetException
	at java.net.URLClassLoader$1.run(URLClassLoader.java:372)
	at java.net.URLClassLoader$1.run(URLClassLoader.java:361)
	at java.security.AccessController.doPrivileged(Native Method)
	at java.net.URLClassLoader.findClass(URLClassLoader.java:360)
	at java.lang.ClassLoader.loadClass(ClassLoader.java:424)
	at sun.misc.Launcher$AppClassLoader.loadClass(Launcher.java:308)
	at java.lang.ClassLoader.loadClass(ClassLoader.java:357)
	at org.apache.hadoop.net.ScriptBasedMapping.<init>(ScriptBasedMapping.java:88)
	at sun.reflect.NativeConstructorAccessorImpl.newInstance0(Native Method)
	at sun.reflect.NativeConstructorAccessorImpl.newInstance(NativeConstructorAccessorImpl.java:62)
	at sun.reflect.DelegatingConstructorAccessorImpl.newInstance(DelegatingConstructorAccessorImpl.java:45)
	at java.lang.reflect.Constructor.newInstance(Constructor.java:408)
	at org.apache.hadoop.util.ReflectionUtils.newInstance(ReflectionUtils.java:132)
	at org.apache.hadoop.hdfs.server.blockmanagement.DatanodeManager.<init>(DatanodeManager.java:209)
	at org.apache.hadoop.hdfs.server.blockmanagement.BlockManager.<init>(BlockManager.java:301)
	at org.apache.hadoop.hdfs.server.namenode.FSNamesystem.<init>(FSNamesystem.java:736)
	at org.apache.hadoop.hdfs.server.namenode.FSNamesystem.<init>(FSNamesystem.java:696)
	at org.apache.hadoop.hdfs.server.namenode.NameNode.format(NameNode.java:1005)
	at org.apache.hadoop.hdfs.server.namenode.NameNode.format(NameNode.java:366)
	at org.apache.hadoop.hdfs.DFSTestUtil.formatNameNode(DFSTestUtil.java:228)
	at org.apache.hadoop.hdfs.server.namenode.TestEditLogRace.testSaveImageWhileSyncInProgress(TestEditLogRace.java:355)


FAILED:  org.apache.hadoop.hdfs.server.namenode.TestEditLogRace.testSaveRightBeforeSync

Error Message:
java.lang.reflect.InvocationTargetException

Stack Trace:
java.lang.RuntimeException: java.lang.reflect.InvocationTargetException
	at org.apache.hadoop.net.ScriptBasedMapping.<init>(ScriptBasedMapping.java:88)
	at sun.reflect.NativeConstructorAccessorImpl.newInstance0(Native Method)
	at sun.reflect.NativeConstructorAccessorImpl.newInstance(NativeConstructorAccessorImpl.java:62)
	at sun.reflect.DelegatingConstructorAccessorImpl.newInstance(DelegatingConstructorAccessorImpl.java:45)
	at java.lang.reflect.Constructor.newInstance(Constructor.java:408)
	at org.apache.hadoop.util.ReflectionUtils.newInstance(ReflectionUtils.java:132)
	at org.apache.hadoop.hdfs.server.blockmanagement.DatanodeManager.<init>(DatanodeManager.java:209)
	at org.apache.hadoop.hdfs.server.blockmanagement.BlockManager.<init>(BlockManager.java:301)
	at org.apache.hadoop.hdfs.server.namenode.FSNamesystem.<init>(FSNamesystem.java:736)
	at org.apache.hadoop.hdfs.server.namenode.FSNamesystem.<init>(FSNamesystem.java:696)
	at org.apache.hadoop.hdfs.server.namenode.NameNode.format(NameNode.java:1005)
	at org.apache.hadoop.hdfs.server.namenode.NameNode.format(NameNode.java:366)
	at org.apache.hadoop.hdfs.DFSTestUtil.formatNameNode(DFSTestUtil.java:228)
	at org.apache.hadoop.hdfs.server.namenode.TestEditLogRace.testSaveRightBeforeSync(TestEditLogRace.java:455)


FAILED:  org.apache.hadoop.hdfs.server.namenode.TestEditLogRace.testSaveNamespace

Error Message:
org/apache/hadoop/util/ShutdownHookManager

Stack Trace:
java.lang.NoClassDefFoundError: org/apache/hadoop/util/ShutdownHookManager
	at org.apache.hadoop.hdfs.MiniDFSCluster.shutdown(MiniDFSCluster.java:1897)
	at org.apache.hadoop.hdfs.MiniDFSCluster.shutdown(MiniDFSCluster.java:1861)
	at org.apache.hadoop.hdfs.MiniDFSCluster.shutdown(MiniDFSCluster.java:1854)
	at org.apache.hadoop.hdfs.MiniDFSCluster.initMiniDFSCluster(MiniDFSCluster.java:852)
	at org.apache.hadoop.hdfs.MiniDFSCluster.<init>(MiniDFSCluster.java:480)
	at org.apache.hadoop.hdfs.MiniDFSCluster$Builder.build(MiniDFSCluster.java:439)
	at org.apache.hadoop.hdfs.server.namenode.TestEditLogRace.testSaveNamespace(TestEditLogRace.java:265)



Mime
  • Unnamed multipart/mixed (inline, None, 0 bytes)
View raw message