hadoop-hdfs-dev mailing list archives

Site index · List index
Message view « Date » · « Thread »
Top « Date » · « Thread »
From Apache Jenkins Server <jenk...@builds.apache.org>
Subject Hadoop-Hdfs-trunk - Build # 2434 - Still Failing
Date Wed, 14 Oct 2015 23:10:30 GMT
See https://builds.apache.org/job/Hadoop-Hdfs-trunk/2434/

###################################################################################
########################## LAST 60 LINES OF THE CONSOLE ###########################
[...truncated 6714 lines...]

main:
    [mkdir] Created dir: /home/jenkins/jenkins-slave/workspace/Hadoop-Hdfs-trunk/hadoop-hdfs-project/target/test-dir
[INFO] Executed tasks
[INFO] 
[INFO] --- maven-source-plugin:2.3:jar-no-fork (hadoop-java-sources) @ hadoop-hdfs-project
---
[INFO] 
[INFO] --- maven-source-plugin:2.3:test-jar-no-fork (hadoop-java-sources) @ hadoop-hdfs-project
---
[INFO] 
[INFO] --- maven-enforcer-plugin:1.3.1:enforce (dist-enforce) @ hadoop-hdfs-project ---
[INFO] 
[INFO] --- maven-site-plugin:3.4:attach-descriptor (attach-descriptor) @ hadoop-hdfs-project
---
[INFO] 
[INFO] --- maven-javadoc-plugin:2.8.1:jar (module-javadocs) @ hadoop-hdfs-project ---
[INFO] Skipping javadoc generation
[INFO] 
[INFO] --- maven-enforcer-plugin:1.3.1:enforce (depcheck) @ hadoop-hdfs-project ---
[INFO] 
[INFO] --- maven-checkstyle-plugin:2.15:checkstyle (default-cli) @ hadoop-hdfs-project ---
[INFO] 
[INFO] --- findbugs-maven-plugin:3.0.0:findbugs (default-cli) @ hadoop-hdfs-project ---
[INFO] ------------------------------------------------------------------------
[INFO] Reactor Summary:
[INFO] 
[INFO] Apache Hadoop HDFS Client ......................... SUCCESS [04:07 min]
[INFO] Apache Hadoop HDFS ................................ FAILURE [  02:13 h]
[INFO] Apache Hadoop HDFS Native Client .................. SKIPPED
[INFO] Apache Hadoop HttpFS .............................. SKIPPED
[INFO] Apache Hadoop HDFS BookKeeper Journal ............. SKIPPED
[INFO] Apache Hadoop HDFS-NFS ............................ SKIPPED
[INFO] Apache Hadoop HDFS Project ........................ SUCCESS [  0.068 s]
[INFO] ------------------------------------------------------------------------
[INFO] BUILD FAILURE
[INFO] ------------------------------------------------------------------------
[INFO] Total time: 02:17 h
[INFO] Finished at: 2015-10-14T23:11:00+00:00
[INFO] Final Memory: 70M/884M
[INFO] ------------------------------------------------------------------------
[ERROR] Failed to execute goal org.apache.maven.plugins:maven-surefire-plugin:2.17:test (default-test)
on project hadoop-hdfs: ExecutionException: java.lang.RuntimeException: The forked VM terminated
without properly saying goodbye. VM crash or System.exit called?
[ERROR] Command was /bin/sh -c cd /home/jenkins/jenkins-slave/workspace/Hadoop-Hdfs-trunk/hadoop-hdfs-project/hadoop-hdfs
&& /home/jenkins/tools/java/jdk1.7.0_55/jre/bin/java -Xmx2048m -XX:MaxPermSize=768m
-XX:+HeapDumpOnOutOfMemoryError -jar /home/jenkins/jenkins-slave/workspace/Hadoop-Hdfs-trunk/hadoop-hdfs-project/hadoop-hdfs/target/surefire/surefirebooter156013183083185896.jar
/home/jenkins/jenkins-slave/workspace/Hadoop-Hdfs-trunk/hadoop-hdfs-project/hadoop-hdfs/target/surefire/surefire6795706767581367156tmp
/home/jenkins/jenkins-slave/workspace/Hadoop-Hdfs-trunk/hadoop-hdfs-project/hadoop-hdfs/target/surefire/surefire_2235428557335086727282tmp
[ERROR] -> [Help 1]
[ERROR] 
[ERROR] To see the full stack trace of the errors, re-run Maven with the -e switch.
[ERROR] Re-run Maven using the -X switch to enable full debug logging.
[ERROR] 
[ERROR] For more information about the errors and possible solutions, please read the following
articles:
[ERROR] [Help 1] http://cwiki.apache.org/confluence/display/MAVEN/MojoFailureException
[ERROR] 
[ERROR] After correcting the problems, you can resume the build with the command
[ERROR]   mvn <goals> -rf :hadoop-hdfs
Build step 'Execute shell' marked build as failure
Archiving artifacts
Recording test results
Updating HADOOP-12364
Updating HDFS-9238
Updating HADOOP-12478
Sending e-mails to: hdfs-dev@hadoop.apache.org
Email was triggered for: Failure - Any
Sending email for trigger: Failure - Any



###################################################################################
############################## FAILED TESTS (if any) ##############################
8 tests failed.
FAILED:  org.apache.hadoop.hdfs.server.namenode.TestFSNamesystem.testFSLockLongHoldingReport

Error Message:
org.apache.hadoop.test.GenericTestUtils$LogCapturer.clearOutput()V

Stack Trace:
java.lang.NoSuchMethodError: org.apache.hadoop.test.GenericTestUtils$LogCapturer.clearOutput()V
	at org.apache.hadoop.hdfs.server.namenode.TestFSNamesystem.testFSLockLongHoldingReport(TestFSNamesystem.java:298)


FAILED:  org.apache.hadoop.hdfs.server.namenode.TestSecurityTokenEditLog.testEditLog

Error Message:
org/apache/hadoop/security/authentication/server/AuthenticationFilter

Stack Trace:
java.lang.NoClassDefFoundError: org/apache/hadoop/security/authentication/server/AuthenticationFilter
	at java.net.URLClassLoader$1.run(URLClassLoader.java:366)
	at java.net.URLClassLoader$1.run(URLClassLoader.java:355)
	at java.security.AccessController.doPrivileged(Native Method)
	at java.net.URLClassLoader.findClass(URLClassLoader.java:354)
	at java.lang.ClassLoader.loadClass(ClassLoader.java:425)
	at sun.misc.Launcher$AppClassLoader.loadClass(Launcher.java:308)
	at java.lang.ClassLoader.loadClass(ClassLoader.java:358)
	at org.apache.hadoop.http.HttpServer2.constructSecretProvider(HttpServer2.java:447)
	at org.apache.hadoop.http.HttpServer2.<init>(HttpServer2.java:339)
	at org.apache.hadoop.http.HttpServer2.<init>(HttpServer2.java:114)
	at org.apache.hadoop.http.HttpServer2$Builder.build(HttpServer2.java:290)
	at org.apache.hadoop.hdfs.server.namenode.NameNodeHttpServer.start(NameNodeHttpServer.java:126)
	at org.apache.hadoop.hdfs.server.namenode.NameNode.startHttpServer(NameNode.java:771)
	at org.apache.hadoop.hdfs.server.namenode.NameNode.initialize(NameNode.java:625)
	at org.apache.hadoop.hdfs.server.namenode.NameNode.<init>(NameNode.java:833)
	at org.apache.hadoop.hdfs.server.namenode.NameNode.<init>(NameNode.java:812)
	at org.apache.hadoop.hdfs.server.namenode.NameNode.createNameNode(NameNode.java:1505)
	at org.apache.hadoop.hdfs.MiniDFSCluster.createNameNode(MiniDFSCluster.java:1248)
	at org.apache.hadoop.hdfs.MiniDFSCluster.configureNameService(MiniDFSCluster.java:1017)
	at org.apache.hadoop.hdfs.MiniDFSCluster.createNameNodesAndSetConf(MiniDFSCluster.java:889)
	at org.apache.hadoop.hdfs.MiniDFSCluster.initMiniDFSCluster(MiniDFSCluster.java:821)
	at org.apache.hadoop.hdfs.MiniDFSCluster.<init>(MiniDFSCluster.java:480)
	at org.apache.hadoop.hdfs.MiniDFSCluster$Builder.build(MiniDFSCluster.java:439)
	at org.apache.hadoop.hdfs.server.namenode.TestSecurityTokenEditLog.testEditLog(TestSecurityTokenEditLog.java:111)


FAILED:  org.apache.hadoop.hdfs.server.namenode.ha.TestStandbyCheckpoints.testCheckpointCancellationDuringUpload

Error Message:
Expected non-empty /home/jenkins/jenkins-slave/workspace/Hadoop-Hdfs-trunk/hadoop-hdfs-project/hadoop-hdfs/target/test/data/dfs/name-0-5/current/fsimage_0000000000000000104

Stack Trace:
java.lang.AssertionError: Expected non-empty /home/jenkins/jenkins-slave/workspace/Hadoop-Hdfs-trunk/hadoop-hdfs-project/hadoop-hdfs/target/test/data/dfs/name-0-5/current/fsimage_0000000000000000104
	at org.junit.Assert.fail(Assert.java:88)
	at org.junit.Assert.assertTrue(Assert.java:41)
	at org.apache.hadoop.hdfs.server.namenode.FSImageTestUtil.assertNNHasCheckpoints(FSImageTestUtil.java:470)
	at org.apache.hadoop.hdfs.server.namenode.ha.HATestUtil.waitForCheckpoint(HATestUtil.java:235)
	at org.apache.hadoop.hdfs.server.namenode.ha.TestStandbyCheckpoints.testCheckpointCancellationDuringUpload(TestStandbyCheckpoints.java:317)


FAILED:  org.apache.hadoop.fs.TestGlobPaths.pTestCurlyBracket

Error Message:
error parsing regexp: Unclosed group at pos 10: `myuser}{bc`

Stack Trace:
com.google.re2j.PatternSyntaxException: error parsing regexp: Unclosed group at pos 10: `myuser}{bc`
	at org.apache.hadoop.fs.GlobPattern.error(GlobPattern.java:168)
	at org.apache.hadoop.fs.GlobPattern.set(GlobPattern.java:154)
	at org.apache.hadoop.fs.GlobPattern.<init>(GlobPattern.java:42)
	at org.apache.hadoop.fs.GlobFilter.init(GlobFilter.java:67)
	at org.apache.hadoop.fs.GlobFilter.<init>(GlobFilter.java:50)
	at org.apache.hadoop.fs.Globber.doGlob(Globber.java:209)
	at org.apache.hadoop.fs.Globber.glob(Globber.java:148)
	at org.apache.hadoop.fs.FileSystem.globStatus(FileSystem.java:1664)
	at org.apache.hadoop.fs.TestGlobPaths.prepareTesting(TestGlobPaths.java:758)
	at org.apache.hadoop.fs.TestGlobPaths.pTestCurlyBracket(TestGlobPaths.java:724)


FAILED:  org.apache.hadoop.hdfs.TestLeaseRecovery2.testHardLeaseRecoveryWithRenameAfterNameNodeRestart

Error Message:
org.apache.hadoop.util.ExitUtil$ExitException: Could not sync enough journals to persistent
storage due to No journals available to flush. Unsynced transactions: 1
 at org.apache.hadoop.util.ExitUtil.terminate(ExitUtil.java:126)
 at org.apache.hadoop.hdfs.server.namenode.FSEditLog.logSync(FSEditLog.java:637)
 at org.apache.hadoop.hdfs.server.namenode.FSEditLog.endCurrentLogSegment(FSEditLog.java:1316)
 at org.apache.hadoop.hdfs.server.namenode.FSEditLog.close(FSEditLog.java:362)
 at org.apache.hadoop.hdfs.server.namenode.FSNamesystem.stopActiveServices(FSNamesystem.java:1207)
 at org.apache.hadoop.hdfs.server.namenode.NameNode$NameNodeHAContext.stopActiveServices(NameNode.java:1740)
 at org.apache.hadoop.hdfs.server.namenode.ha.ActiveState.exitState(ActiveState.java:70)
 at org.apache.hadoop.hdfs.server.namenode.NameNode.stop(NameNode.java:887)
 at org.apache.hadoop.hdfs.MiniDFSCluster.shutdownNameNode(MiniDFSCluster.java:1938)
 at org.apache.hadoop.hdfs.MiniDFSCluster.restartNameNode(MiniDFSCluster.java:1989)
 at org.apache.hadoop.hdfs.MiniDFSCluster.restartNameNode(MiniDFSCluster.java:1970)
 at org.apache.hadoop.hdfs.TestLeaseRecovery2.hardLeaseRecoveryRestartHelper(TestLeaseRecovery2.java:494)
 at org.apache.hadoop.hdfs.TestLeaseRecovery2.testHardLeaseRecoveryWithRenameAfterNameNodeRestart(TestLeaseRecovery2.java:433)
 at sun.reflect.NativeMethodAccessorImpl.invoke0(Native Method)
 at sun.reflect.NativeMethodAccessorImpl.invoke(NativeMethodAccessorImpl.java:57)
 at sun.reflect.DelegatingMethodAccessorImpl.invoke(DelegatingMethodAccessorImpl.java:43)
 at java.lang.reflect.Method.invoke(Method.java:606)
 at org.junit.runners.model.FrameworkMethod$1.runReflectiveCall(FrameworkMethod.java:47)
 at org.junit.internal.runners.model.ReflectiveCallable.run(ReflectiveCallable.java:12)
 at org.junit.runners.model.FrameworkMethod.invokeExplosively(FrameworkMethod.java:44)
 at org.junit.internal.runners.statements.InvokeMethod.evaluate(InvokeMethod.java:17)
 at org.junit.runners.ParentRunner.runLeaf(ParentRunner.java:271)
 at org.junit.runners.BlockJUnit4ClassRunner.runChild(BlockJUnit4ClassRunner.java:70)
 at org.junit.runners.BlockJUnit4ClassRunner.runChild(BlockJUnit4ClassRunner.java:50)
 at org.junit.runners.ParentRunner$3.run(ParentRunner.java:238)
 at org.junit.runners.ParentRunner$1.schedule(ParentRunner.java:63)
 at org.junit.runners.ParentRunner.runChildren(ParentRunner.java:236)
 at org.junit.runners.ParentRunner.access$000(ParentRunner.java:53)
 at org.junit.runners.ParentRunner$2.evaluate(ParentRunner.java:229)
 at org.junit.internal.runners.statements.RunBefores.evaluate(RunBefores.java:26)
 at org.junit.internal.runners.statements.RunAfters.evaluate(RunAfters.java:27)
 at org.junit.runners.ParentRunner.run(ParentRunner.java:309)
 at org.apache.maven.surefire.junit4.JUnit4Provider.execute(JUnit4Provider.java:264)
 at org.apache.maven.surefire.junit4.JUnit4Provider.executeTestSet(JUnit4Provider.java:153)
 at org.apache.maven.surefire.junit4.JUnit4Provider.invoke(JUnit4Provider.java:124)
 at org.apache.maven.surefire.booter.ForkedBooter.invokeProviderInSameClassLoader(ForkedBooter.java:200)
 at org.apache.maven.surefire.booter.ForkedBooter.runSuitesInProcess(ForkedBooter.java:153)
 at org.apache.maven.surefire.booter.ForkedBooter.main(ForkedBooter.java:103)


Stack Trace:
org.apache.hadoop.util.ExitUtil$ExitException: org.apache.hadoop.util.ExitUtil$ExitException:
Could not sync enough journals to persistent storage due to No journals available to flush.
Unsynced transactions: 1
	at org.apache.hadoop.util.ExitUtil.terminate(ExitUtil.java:126)
	at org.apache.hadoop.hdfs.server.namenode.FSEditLog.logSync(FSEditLog.java:637)
	at org.apache.hadoop.hdfs.server.namenode.FSEditLog.endCurrentLogSegment(FSEditLog.java:1316)
	at org.apache.hadoop.hdfs.server.namenode.FSEditLog.close(FSEditLog.java:362)
	at org.apache.hadoop.hdfs.server.namenode.FSNamesystem.stopActiveServices(FSNamesystem.java:1207)
	at org.apache.hadoop.hdfs.server.namenode.NameNode$NameNodeHAContext.stopActiveServices(NameNode.java:1740)
	at org.apache.hadoop.hdfs.server.namenode.ha.ActiveState.exitState(ActiveState.java:70)
	at org.apache.hadoop.hdfs.server.namenode.NameNode.stop(NameNode.java:887)
	at org.apache.hadoop.hdfs.MiniDFSCluster.shutdownNameNode(MiniDFSCluster.java:1938)
	at org.apache.hadoop.hdfs.MiniDFSCluster.restartNameNode(MiniDFSCluster.java:1989)
	at org.apache.hadoop.hdfs.MiniDFSCluster.restartNameNode(MiniDFSCluster.java:1970)
	at org.apache.hadoop.hdfs.TestLeaseRecovery2.hardLeaseRecoveryRestartHelper(TestLeaseRecovery2.java:494)
	at org.apache.hadoop.hdfs.TestLeaseRecovery2.testHardLeaseRecoveryWithRenameAfterNameNodeRestart(TestLeaseRecovery2.java:433)
	at sun.reflect.NativeMethodAccessorImpl.invoke0(Native Method)
	at sun.reflect.NativeMethodAccessorImpl.invoke(NativeMethodAccessorImpl.java:57)
	at sun.reflect.DelegatingMethodAccessorImpl.invoke(DelegatingMethodAccessorImpl.java:43)
	at java.lang.reflect.Method.invoke(Method.java:606)
	at org.junit.runners.model.FrameworkMethod$1.runReflectiveCall(FrameworkMethod.java:47)
	at org.junit.internal.runners.model.ReflectiveCallable.run(ReflectiveCallable.java:12)
	at org.junit.runners.model.FrameworkMethod.invokeExplosively(FrameworkMethod.java:44)
	at org.junit.internal.runners.statements.InvokeMethod.evaluate(InvokeMethod.java:17)
	at org.junit.runners.ParentRunner.runLeaf(ParentRunner.java:271)
	at org.junit.runners.BlockJUnit4ClassRunner.runChild(BlockJUnit4ClassRunner.java:70)
	at org.junit.runners.BlockJUnit4ClassRunner.runChild(BlockJUnit4ClassRunner.java:50)
	at org.junit.runners.ParentRunner$3.run(ParentRunner.java:238)
	at org.junit.runners.ParentRunner$1.schedule(ParentRunner.java:63)
	at org.junit.runners.ParentRunner.runChildren(ParentRunner.java:236)
	at org.junit.runners.ParentRunner.access$000(ParentRunner.java:53)
	at org.junit.runners.ParentRunner$2.evaluate(ParentRunner.java:229)
	at org.junit.internal.runners.statements.RunBefores.evaluate(RunBefores.java:26)
	at org.junit.internal.runners.statements.RunAfters.evaluate(RunAfters.java:27)
	at org.junit.runners.ParentRunner.run(ParentRunner.java:309)
	at org.apache.maven.surefire.junit4.JUnit4Provider.execute(JUnit4Provider.java:264)
	at org.apache.maven.surefire.junit4.JUnit4Provider.executeTestSet(JUnit4Provider.java:153)
	at org.apache.maven.surefire.junit4.JUnit4Provider.invoke(JUnit4Provider.java:124)
	at org.apache.maven.surefire.booter.ForkedBooter.invokeProviderInSameClassLoader(ForkedBooter.java:200)
	at org.apache.maven.surefire.booter.ForkedBooter.runSuitesInProcess(ForkedBooter.java:153)
	at org.apache.maven.surefire.booter.ForkedBooter.main(ForkedBooter.java:103)

	at org.apache.hadoop.util.ExitUtil.terminate(ExitUtil.java:126)
	at org.apache.hadoop.util.ExitUtil.terminate(ExitUtil.java:170)
	at org.apache.hadoop.hdfs.server.namenode.NameNode.doImmediateShutdown(NameNode.java:1709)
	at org.apache.hadoop.hdfs.server.namenode.NameNode$NameNodeHAContext.stopActiveServices(NameNode.java:1744)
	at org.apache.hadoop.hdfs.server.namenode.ha.ActiveState.exitState(ActiveState.java:70)
	at org.apache.hadoop.hdfs.server.namenode.NameNode.stop(NameNode.java:887)
	at org.apache.hadoop.hdfs.MiniDFSCluster.shutdownNameNode(MiniDFSCluster.java:1938)
	at org.apache.hadoop.hdfs.MiniDFSCluster.restartNameNode(MiniDFSCluster.java:1989)
	at org.apache.hadoop.hdfs.MiniDFSCluster.restartNameNode(MiniDFSCluster.java:1970)
	at org.apache.hadoop.hdfs.TestLeaseRecovery2.hardLeaseRecoveryRestartHelper(TestLeaseRecovery2.java:494)
	at org.apache.hadoop.hdfs.TestLeaseRecovery2.testHardLeaseRecoveryWithRenameAfterNameNodeRestart(TestLeaseRecovery2.java:433)


FAILED:  org.apache.hadoop.hdfs.TestLeaseRecovery2.testLeaseRecoverByAnotherUser

Error Message:
Lease monitor is not running

Stack Trace:
java.lang.IllegalStateException: Lease monitor is not running
	at com.google.common.base.Preconditions.checkState(Preconditions.java:145)
	at org.apache.hadoop.hdfs.server.namenode.LeaseManager.triggerMonitorCheckNow(LeaseManager.java:449)
	at org.apache.hadoop.hdfs.server.namenode.NameNodeAdapter.setLeasePeriod(NameNodeAdapter.java:140)
	at org.apache.hadoop.hdfs.MiniDFSCluster.setLeasePeriod(MiniDFSCluster.java:2610)
	at org.apache.hadoop.hdfs.TestLeaseRecovery2.testLeaseRecoverByAnotherUser(TestLeaseRecovery2.java:159)


FAILED:  org.apache.hadoop.hdfs.TestLeaseRecovery2.testHardLeaseRecovery

Error Message:
End of File Exception between local host is: "asf901.gq1.ygridcore.net/67.195.81.145"; destination
host is: "localhost":52968; : java.io.EOFException; For more details see:  http://wiki.apache.org/hadoop/EOFException

Stack Trace:
java.io.EOFException: End of File Exception between local host is: "asf901.gq1.ygridcore.net/67.195.81.145";
destination host is: "localhost":52968; : java.io.EOFException; For more details see:  http://wiki.apache.org/hadoop/EOFException
	at sun.reflect.NativeConstructorAccessorImpl.newInstance0(Native Method)
	at sun.reflect.NativeConstructorAccessorImpl.newInstance(NativeConstructorAccessorImpl.java:57)
	at sun.reflect.DelegatingConstructorAccessorImpl.newInstance(DelegatingConstructorAccessorImpl.java:45)
	at java.lang.reflect.Constructor.newInstance(Constructor.java:526)
	at org.apache.hadoop.net.NetUtils.wrapWithMessage(NetUtils.java:863)
	at org.apache.hadoop.net.NetUtils.wrapException(NetUtils.java:836)
	at org.apache.hadoop.ipc.Client.call(Client.java:1428)
	at org.apache.hadoop.ipc.Client.call(Client.java:1355)
	at org.apache.hadoop.ipc.ProtobufRpcEngine$Invoker.invoke(ProtobufRpcEngine.java:230)
	at com.sun.proxy.$Proxy21.create(Unknown Source)
	at org.apache.hadoop.hdfs.protocolPB.ClientNamenodeProtocolTranslatorPB.create(ClientNamenodeProtocolTranslatorPB.java:291)
	at sun.reflect.NativeMethodAccessorImpl.invoke0(Native Method)
	at sun.reflect.NativeMethodAccessorImpl.invoke(NativeMethodAccessorImpl.java:57)
	at sun.reflect.DelegatingMethodAccessorImpl.invoke(DelegatingMethodAccessorImpl.java:43)
	at java.lang.reflect.Method.invoke(Method.java:606)
	at org.apache.hadoop.io.retry.RetryInvocationHandler.invokeMethod(RetryInvocationHandler.java:251)
	at org.apache.hadoop.io.retry.RetryInvocationHandler.invoke(RetryInvocationHandler.java:103)
	at com.sun.proxy.$Proxy25.create(Unknown Source)
	at org.apache.hadoop.hdfs.DFSOutputStream.newStreamForCreate(DFSOutputStream.java:242)
	at org.apache.hadoop.hdfs.DFSClient.create(DFSClient.java:1191)
	at org.apache.hadoop.hdfs.DFSClient.create(DFSClient.java:1133)
	at org.apache.hadoop.hdfs.DistributedFileSystem$7.doCall(DistributedFileSystem.java:413)
	at org.apache.hadoop.hdfs.DistributedFileSystem$7.doCall(DistributedFileSystem.java:410)
	at org.apache.hadoop.fs.FileSystemLinkResolver.resolve(FileSystemLinkResolver.java:81)
	at org.apache.hadoop.hdfs.DistributedFileSystem.create(DistributedFileSystem.java:410)
	at org.apache.hadoop.hdfs.DistributedFileSystem.create(DistributedFileSystem.java:353)
	at org.apache.hadoop.fs.FileSystem.create(FileSystem.java:919)
	at org.apache.hadoop.fs.FileSystem.create(FileSystem.java:900)
	at org.apache.hadoop.hdfs.TestLeaseRecovery2.testHardLeaseRecovery(TestLeaseRecovery2.java:276)
Caused by: java.io.EOFException: null
	at java.io.DataInputStream.readInt(DataInputStream.java:392)
	at org.apache.hadoop.ipc.Client$Connection.receiveRpcResponse(Client.java:1082)
	at org.apache.hadoop.ipc.Client$Connection.run(Client.java:977)


FAILED:  org.apache.hadoop.hdfs.TestLeaseRecovery2.org.apache.hadoop.hdfs.TestLeaseRecovery2

Error Message:
Test resulted in an unexpected exit

Stack Trace:
java.lang.AssertionError: Test resulted in an unexpected exit
	at org.apache.hadoop.hdfs.MiniDFSCluster.shutdown(MiniDFSCluster.java:1874)
	at org.apache.hadoop.hdfs.MiniDFSCluster.shutdown(MiniDFSCluster.java:1861)
	at org.apache.hadoop.hdfs.MiniDFSCluster.shutdown(MiniDFSCluster.java:1854)
	at org.apache.hadoop.hdfs.TestLeaseRecovery2.tearDown(TestLeaseRecovery2.java:105)



Mime
  • Unnamed multipart/mixed (inline, None, 0 bytes)
View raw message