hadoop-hdfs-dev mailing list archives

Site index · List index
Message view « Date » · « Thread »
Top « Date » · « Thread »
From Apache Jenkins Server <jenk...@builds.apache.org>
Subject Build failed in Jenkins: Hadoop-Hdfs-trunk #2384
Date Thu, 01 Oct 2015 22:58:20 GMT
See <https://builds.apache.org/job/Hadoop-Hdfs-trunk/2384/changes>

Changes:

[zxu] HADOOP-8437. getLocalPathForWrite should throw IOException for invalid

------------------------------------------
[...truncated 28807 lines...]
  TestWriteReadStripedFile.setup:59 » NoClassDefFound Could not initialize class...
  TestWriteReadStripedFile.setup:59 » NoClassDefFound Could not initialize class...
  TestWriteReadStripedFile.setup:59 » NoClassDefFound Could not initialize class...
  TestWriteReadStripedFile.setup:59 » NoClassDefFound Could not initialize class...
  TestWriteReadStripedFile.setup:59 » NoClassDefFound Could not initialize class...
  TestWriteReadStripedFile.setup:59 » NoClassDefFound Could not initialize class...
  TestWriteReadStripedFile.setup:59 » NoClassDefFound Could not initialize class...
  TestWriteReadStripedFile.setup:59 » NoClassDefFound Could not initialize class...
  TestWriteReadStripedFile.setup:59 » NoClassDefFound Could not initialize class...
  TestWriteReadStripedFile.setup:59 » NoClassDefFound Could not initialize class...
  TestWriteReadStripedFile.setup:59 » NoClassDefFound Could not initialize class...
  TestWriteReadStripedFile.setup:59 » NoClassDefFound Could not initialize class...
  TestWriteReadStripedFile.setup:59 » NoClassDefFound Could not initialize class...
  TestDFSClientExcludedNodes.testExcludedNodes:62 » NoClassDefFound org/apache/h...
  TestDFSClientExcludedNodes.testExcludedNodesForgiveness:94 » NoClassDefFound C...
  TestDatanodeReport.testDatanodeReport:55 » NoClassDefFound org/apache/hadoop/i...
  TestBlockReaderFactory.testShortCircuitCacheTemporaryFailure:230 » NoClassDefFound
  TestBlockReaderFactory.testShortCircuitCacheShutdown:395 » NoClassDefFound Cou...
  TestBlockReaderFactory.testMultipleWaitersOnShortCircuitCache:159 » NoClassDefFound
  TestBlockReaderFactory.testShortCircuitReadFromServerWithoutShm:313 » NoClassDefFound
  TestBlockReaderFactory.testShortCircuitReadFromClientWithoutShm:359 » NoClassDefFound
  TestBlockReaderFactory.testPurgingClosedReplicas:452 » NoClassDefFound Could n...
  TestBlockReaderFactory.testFallbackFromShortCircuitToUnixDomainTraffic:112 » NoClassDefFound
  TestMiniDFSCluster.testDualClusters:89 » NoClassDefFound org/apache/hadoop/io/...
  TestMiniDFSCluster.testClusterSetDatanodeHostname:135 » NoClassDefFound Could ...
  TestMiniDFSCluster.testClusterNoStorageTypeSetForDatanodes:171 » NoClassDefFound
  TestMiniDFSCluster.testIsClusterUpAfterShutdown:114 » NoClassDefFound Could no...
  TestMiniDFSCluster.testClusterSetDatanodeDifferentStorageType:153 » NoClassDefFound
  TestMiniDFSCluster.testClusterWithoutSystemProperties:69 » NoClassDefFound Cou...
  TestBlocksScheduledCounter.testBlocksScheduledCounter:54 » NoClassDefFound org...
  TestDFSStorageStateRecovery.setUp:449 » NoClassDefFound org/apache/hadoop/io/e...
  TestDFSStorageStateRecovery.setUp:449 » NoClassDefFound Could not initialize c...
  TestDFSStorageStateRecovery.setUp:449 » NoClassDefFound Could not initialize c...
  TestSnapshotCommands.clusterSetUp:45 » NoClassDefFound org/apache/hadoop/io/er...
  TestParallelShortCircuitRead.setupCluster:47->TestParallelReadUtil.setupCluster:70 »
NoClassDefFound
  TestParallelShortCircuitRead.teardownCluster:59->TestParallelReadUtil.teardownCluster:393
» NullPointer
  TestDFSPermission.setUp:118 » NoClassDefFound org/apache/hadoop/io/erasurecode...
  TestDFSPermission.setUp:118 » NoClassDefFound Could not initialize class org.a...
  TestDFSPermission.setUp:118 » NoClassDefFound Could not initialize class org.a...
  TestDFSPermission.setUp:118 » NoClassDefFound Could not initialize class org.a...
  TestDFSPermission.setUp:118 » NoClassDefFound Could not initialize class org.a...
  TestDFSPermission.setUp:118 » NoClassDefFound Could not initialize class org.a...
  TestDFSPermission.setUp:118 » NoClassDefFound Could not initialize class org.a...
  TestDFSPermission.setUp:118 » NoClassDefFound Could not initialize class org.a...
  TestParallelRead.setupCluster:37->TestParallelReadUtil.setupCluster:70 » NoClassDefFound
  TestParallelRead.teardownCluster:42->TestParallelReadUtil.teardownCluster:393 » NullPointer
  TestDFSStripedOutputStream.setup:57 » NoClassDefFound org/apache/hadoop/io/era...
  TestDFSStripedOutputStream.setup:57 » NoClassDefFound Could not initialize cla...
  TestDFSStripedOutputStream.setup:57 » NoClassDefFound Could not initialize cla...
  TestDFSStripedOutputStream.setup:57 » NoClassDefFound Could not initialize cla...
  TestDFSStripedOutputStream.setup:57 » NoClassDefFound Could not initialize cla...
  TestDFSStripedOutputStream.setup:57 » NoClassDefFound Could not initialize cla...
  TestDFSStripedOutputStream.setup:57 » NoClassDefFound Could not initialize cla...
  TestDFSStripedOutputStream.setup:57 » NoClassDefFound Could not initialize cla...
  TestDFSStripedOutputStream.setup:57 » NoClassDefFound Could not initialize cla...
  TestDFSStripedOutputStream.setup:57 » NoClassDefFound Could not initialize cla...
  TestDFSStripedOutputStream.setup:57 » NoClassDefFound Could not initialize cla...
  TestDFSStripedOutputStream.setup:57 » NoClassDefFound Could not initialize cla...
  TestDFSStripedOutputStream.setup:57 » NoClassDefFound Could not initialize cla...
  TestDFSStripedOutputStream.setup:57 » NoClassDefFound Could not initialize cla...
  TestRollingUpgradeRollback.testRollbackCommand:97 » NoClassDefFound org/apache...
  TestRollingUpgradeRollback.testRollbackWithQJM:154 » NoSuchMethod org.apache.h...
  TestRollingUpgradeRollback.testRollbackWithHAQJM:210 » NoSuchMethod org.apache...
  TestRollingUpgradeDowngrade.testRejectNewFsImage »  Unexpected exception, expe...
  TestRollingUpgradeDowngrade.testDowngrade »  Unexpected exception, expected<ja...
  TestDFSUtil.testGetPassword:889 » NoClassDefFound org/apache/htrace/Trace
  TestDatanodeStartupFixesLegacyStorageIDs.testUpgradeFrom22via26FixesStorageIDs:125->runLayoutUpgradeTest:70->upgradeAndVerify:103
» NoSuchMethod
  TestDatanodeStartupFixesLegacyStorageIDs.testUpgradeFrom26PreservesStorageIDs:136->runLayoutUpgradeTest:70->upgradeAndVerify:103
» NoSuchMethod
  TestDatanodeStartupFixesLegacyStorageIDs.testUpgradeFrom22FixesStorageIDs:115->runLayoutUpgradeTest:70->upgradeAndVerify:103
» NoSuchMethod
  TestExternalBlockReader.testMisconfiguredExternalBlockReader:53 » NoClassDefFound
  TestExternalBlockReader.testExternalBlockReader:273 » NoClassDefFound Could no...
  TestGetBlocks.testReadSelectNonStaleDatanode:93 » NoClassDefFound org/apache/h...
  TestGetBlocks.testGetBlocks:182 » NoClassDefFound Could not initialize class o...
  TestRead.testEOFWithBlockReaderLocal:63 » NoClassDefFound org/apache/hadoop/io...
  TestRead.testEOFWithRemoteBlockReader:78 » NoClassDefFound Could not initializ...
  TestRead.testReadReservedPath:94 » NoClassDefFound Could not initialize class ...
  TestShortCircuitCache.testUnlinkingReplicasInFileDescriptorCache:547 » NoClassDefFound
  TestShortCircuitCache.testAllocShm:414 » NoClassDefFound Could not initialize ...
  TestShortCircuitCache.testDataXceiverHandlesRequestShortCircuitShmFailure:698 » NoClassDefFound
  TestShortCircuitCache.testShmBasedStaleness:483 » NoClassDefFound Could not in...
  TestShortCircuitCache.testDataXceiverCleansUpSlotsOnFailure:656 » NoClassDefFound
  TestShortCircuitCache.testPreReceiptVerificationDfsClientCanDoScr:765 » NoClassDefFound
  TestShortCircuitLocalRead.testReadFromAnOffset:332->doTestShortCircuitRead:240->doTestShortCircuitReadImpl:270
» NoClassDefFound
  TestShortCircuitLocalRead.testSkipWithVerifyChecksum:397 » NoClassDefFound Cou...
  TestShortCircuitLocalRead.testSmallFileLocalRead:308->doTestShortCircuitRead:240->doTestShortCircuitReadImpl:270
» NoClassDefFound
  TestShortCircuitLocalRead.testLongFile:338->doTestShortCircuitRead:240->doTestShortCircuitReadImpl:270
» NoClassDefFound
  TestShortCircuitLocalRead.testReadWithRemoteBlockReader:582->doTestShortCircuitReadWithRemoteBlockReader:598
» NoClassDefFound
  TestShortCircuitLocalRead.testFileLocalReadNoChecksum:298->doTestShortCircuitRead:240->doTestShortCircuitReadImpl:270
» NoClassDefFound
  TestShortCircuitLocalRead.testLocalReadLegacy:316->doTestShortCircuitReadLegacy:234->doTestShortCircuitReadImpl:270
» NoClassDefFound
  TestShortCircuitLocalRead.testLocalReadFallback:327->doTestShortCircuitReadLegacy:234->doTestShortCircuitReadImpl:270
» NoClassDefFound
  TestShortCircuitLocalRead.testFileLocalReadChecksum:303->doTestShortCircuitRead:240->doTestShortCircuitReadImpl:270
» NoClassDefFound
  TestShortCircuitLocalRead.testHandleTruncatedBlockFile:448 » NoClassDefFound C...
  TestShortCircuitLocalRead.testDeprecatedGetBlockLocalPathInfoRpc:356 » NoClassDefFound
  TestMultiThreadedHflush.testHflushWhileClosing:154 » NoClassDefFound org/apach...
  TestMultiThreadedHflush.testMultipleHflushersRepl1:117->doTestMultipleHflushers:127 »
NoClassDefFound
  TestMultiThreadedHflush.testMultipleHflushersRepl3:122->doTestMultipleHflushers:127 »
NoClassDefFound
  TestSafeModeWithStripedFile.setup:57 » NoClassDefFound org/apache/hadoop/io/er...
  TestSafeModeWithStripedFile.setup:57 » NoClassDefFound Could not initialize cl...
  TestFileLengthOnClusterRestart.testFileLengthWithHSyncAndClusterRestartWithOutDNsRegister:42
» NoClassDefFound
  TestRemoteBlockReader2>TestBlockReaderBase.setup:58 » NoClassDefFound org/apac...
  TestRemoteBlockReader2>TestBlockReaderBase.shutdown:71 » NullPointer
  TestBlockMissingException.testBlockMissingException:58 » NoClassDefFound org/a...
  TestReplication.testReplication:273->runReplication:223 » NoClassDefFound org/...
  TestReplication.testPendingReplicationRetry:342 » NoClassDefFound Could not in...
  TestReplication.testReplicationWhenBlockCorruption:498 » NoClassDefFound Could...
  TestReplication.testBadBlockReportOnTransferMissingBlockFile:211->testBadBlockReportOnTransfer:154
» NoClassDefFound
  TestReplication.testBadBlockReportOnTransfer:202->testBadBlockReportOnTransfer:154 »
NoClassDefFound
  TestReplication.testReplicationSimulatedStorag:267->runReplication:223 » NoClassDefFound
  TestReplication.testReplicateLenMismatchedBlock:429 » NoClassDefFound Could no...
  TestFileAppend.testSimpleFlush:123 » NoClassDefFound org/apache/hadoop/io/eras...
  TestFileAppend.testFailedAppendBlockRejection:415 » NoClassDefFound Could not ...
  TestFileAppend.testAppendAfterSoftLimit:328 » NoClassDefFound Could not initia...
  TestFileAppend.testMultiAppend2:468 » NoClassDefFound Could not initialize cla...
  TestFileAppend.testAppendCorruptedBlock:540 » NoClassDefFound Could not initia...
  TestFileAppend.testComplexFlush:179 » NoClassDefFound Could not initialize cla...
  TestFileAppend.testFileNotFound »  Unexpected exception, expected<java.io.File...
  TestFileAppend.testAppend2Twice:283 » NoClassDefFound Could not initialize cla...
  TestFileAppend.testAppend2AfterSoftLimit:368 » NoClassDefFound Could not initi...
  TestFileAppend.testAppendTwice:244 » NoClassDefFound Could not initialize clas...
  TestDistributedFileSystem.testDFSSeekExceptions:360 » NoClassDefFound org/apac...
  TestDistributedFileSystem.testGetServerDefaults:1006 » NoClassDefFound Could n...
  TestDistributedFileSystem.testDFSClientPeerWriteTimeout:1024 » NoClassDefFound
  TestDistributedFileSystem.testDFSClientPeerReadTimeout:979 » NoClassDefFound C...
  TestDistributedFileSystem.testDFSClose:159 » NoClassDefFound Could not initial...
  TestDistributedFileSystem.testStatistics:560 » NoClassDefFound Could not initi...
  TestDistributedFileSystem.testListFiles:952 » NoClassDefFound Could not initia...
  TestDistributedFileSystem.testAllWithDualPort:794->testFileSystemCloseAll:131 » NoClassDefFound
  TestDistributedFileSystem.testDFSClient:401 » NoClassDefFound Could not initia...
  TestDistributedFileSystem.testFileSystemCloseAll:131 » NoClassDefFound Could n...
  TestDistributedFileSystem.testFileChecksum:662 » NoClassDefFound Could not ini...
  TestDistributedFileSystem.testLocatedFileStatusStorageIdsTypes:822 » NoClassDefFound
  TestDistributedFileSystem.testEmptyDelegationToken:118 » NoClassDefFound Could...
  TestDistributedFileSystem.testAllWithNoXmlDefaults:810->testFileSystemCloseAll:131 »
NoClassDefFound
  TestDistributedFileSystem.testCreateWithCustomChecksum:892 » NoClassDefFound C...
  TestDistributedFileSystem.testFileCloseStatus:932 » NoClassDefFound Could not ...
  TestClientBlockVerification.setupCluster:49 » NoClassDefFound org/apache/hadoo...
  TestClientBlockVerification.teardownCluster:122 NullPointer
  TestReservedRawPaths.setup:75 » NoClassDefFound org/apache/htrace/Trace
  TestReservedRawPaths.setup:75 » NoClassDefFound org/apache/htrace/Trace
  TestReservedRawPaths.setup:75 » NoClassDefFound org/apache/htrace/Trace
  TestReservedRawPaths.setup:75 » NoClassDefFound org/apache/htrace/Trace
  TestReservedRawPaths.setup:75 » NoClassDefFound org/apache/htrace/Trace
  TestReservedRawPaths.setup:75 » NoClassDefFound org/apache/htrace/Trace
  TestReservedRawPaths.setup:75 » NoClassDefFound org/apache/htrace/Trace
  TestReservedRawPaths.setup:75 » NoClassDefFound org/apache/htrace/Trace
  TestMissingBlocksAlert.testMissingBlocksAlert:68 » NoClassDefFound org/apache/...
  TestClose.testWriteAfterClose:37 » NoClassDefFound org/apache/hadoop/io/erasur...
  TestFileConcurrentReader.setUp:82->init:95 » NoClassDefFound org/apache/hadoop...
  TestFileConcurrentReader.tearDown:87 NullPointer
  TestFileConcurrentReader.setUp:82->init:95 » NoClassDefFound Could not initial...
  TestFileConcurrentReader.tearDown:87 NullPointer
  TestFileConcurrentReader.setUp:82->init:95 » NoClassDefFound Could not initial...
  TestFileConcurrentReader.tearDown:87 NullPointer
  TestFileConcurrentReader.setUp:82->init:95 » NoClassDefFound Could not initial...
  TestFileConcurrentReader.tearDown:87 NullPointer
  TestFileConcurrentReader.setUp:82->init:95 » NoClassDefFound Could not initial...
  TestFileConcurrentReader.tearDown:87 NullPointer
  TestFileConcurrentReader.setUp:82->init:95 » NoClassDefFound Could not initial...
  TestFileConcurrentReader.tearDown:87 NullPointer
  TestFileConcurrentReader.setUp:82->init:95 » NoClassDefFound Could not initial...
  TestFileConcurrentReader.tearDown:87 NullPointer
  TestHDFSServerPorts.testBackupNodePorts:368->startNameNode:89->startNameNode:107 »
NoClassDefFound
  TestHDFSServerPorts.testDataNodePorts:303->startNameNode:89->startNameNode:107 »
NoClassDefFound
  TestHDFSServerPorts.testNameNodePorts:250->runTestNameNodePorts:259->startNameNode:107
» NoClassDefFound
  TestHDFSServerPorts.testSecondaryNodePorts:339->startNameNode:89->startNameNode:107
» NoClassDefFound
  TestTracing.<clinit>:59 » NoClassDefFound org/apache/htrace/SpanReceiver
  TestTraceAdmin.testCreateAndDestroySpanReceiver:64 » NoClassDefFound org/apach...
  TestTracingShortCircuitLocalRead.testShortCircuitTraceHooks:67 » NoClassDefFound

Tests run: 3510, Failures: 29, Errors: 1240, Skipped: 15

[INFO]                                                                         
[INFO] ------------------------------------------------------------------------
[INFO] Skipping Apache Hadoop HttpFS
[INFO] This project has been banned from the build due to previous failures.
[INFO] ------------------------------------------------------------------------
[INFO]                                                                         
[INFO] ------------------------------------------------------------------------
[INFO] Skipping Apache Hadoop HDFS BookKeeper Journal
[INFO] This project has been banned from the build due to previous failures.
[INFO] ------------------------------------------------------------------------
[INFO]                                                                         
[INFO] ------------------------------------------------------------------------
[INFO] Skipping Apache Hadoop HDFS-NFS
[INFO] This project has been banned from the build due to previous failures.
[INFO] ------------------------------------------------------------------------
[INFO]                                                                         
[INFO] ------------------------------------------------------------------------
[INFO] Building Apache Hadoop HDFS Project 3.0.0-SNAPSHOT
[INFO] ------------------------------------------------------------------------
[INFO] 
[INFO] --- maven-clean-plugin:2.5:clean (default-clean) @ hadoop-hdfs-project ---
[INFO] Deleting <https://builds.apache.org/job/Hadoop-Hdfs-trunk/ws/hadoop-hdfs-project/target>
[INFO] 
[INFO] --- maven-antrun-plugin:1.7:run (create-testdirs) @ hadoop-hdfs-project ---
[INFO] Executing tasks

main:
    [mkdir] Created dir: <https://builds.apache.org/job/Hadoop-Hdfs-trunk/ws/hadoop-hdfs-project/target/test-dir>
[INFO] Executed tasks
[INFO] 
[INFO] --- maven-source-plugin:2.3:jar-no-fork (hadoop-java-sources) @ hadoop-hdfs-project
---
[INFO] 
[INFO] --- maven-source-plugin:2.3:test-jar-no-fork (hadoop-java-sources) @ hadoop-hdfs-project
---
[INFO] 
[INFO] --- maven-enforcer-plugin:1.3.1:enforce (dist-enforce) @ hadoop-hdfs-project ---
[INFO] 
[INFO] --- maven-site-plugin:3.4:attach-descriptor (attach-descriptor) @ hadoop-hdfs-project
---
[INFO] 
[INFO] --- maven-javadoc-plugin:2.8.1:jar (module-javadocs) @ hadoop-hdfs-project ---
[INFO] Skipping javadoc generation
[INFO] 
[INFO] --- maven-enforcer-plugin:1.3.1:enforce (depcheck) @ hadoop-hdfs-project ---
[INFO] 
[INFO] --- maven-checkstyle-plugin:2.15:checkstyle (default-cli) @ hadoop-hdfs-project ---
[INFO] 
[INFO] --- findbugs-maven-plugin:3.0.0:findbugs (default-cli) @ hadoop-hdfs-project ---
[INFO] ------------------------------------------------------------------------
[INFO] Reactor Summary:
[INFO] 
[INFO] Apache Hadoop HDFS Client ......................... SUCCESS [03:37 min]
[INFO] Apache Hadoop HDFS ................................ FAILURE [  01:30 h]
[INFO] Apache Hadoop HttpFS .............................. SKIPPED
[INFO] Apache Hadoop HDFS BookKeeper Journal ............. SKIPPED
[INFO] Apache Hadoop HDFS-NFS ............................ SKIPPED
[INFO] Apache Hadoop HDFS Project ........................ SUCCESS [  0.060 s]
[INFO] ------------------------------------------------------------------------
[INFO] BUILD FAILURE
[INFO] ------------------------------------------------------------------------
[INFO] Total time: 01:33 h
[INFO] Finished at: 2015-10-01T22:57:12+00:00
[INFO] Final Memory: 55M/679M
[INFO] ------------------------------------------------------------------------
[ERROR] Failed to execute goal org.apache.maven.plugins:maven-surefire-plugin:2.17:test (default-test)
on project hadoop-hdfs: ExecutionException: java.lang.RuntimeException: The forked VM terminated
without properly saying goodbye. VM crash or System.exit called?
[ERROR] Command was /bin/sh -c cd <https://builds.apache.org/job/Hadoop-Hdfs-trunk/ws/hadoop-hdfs-project/hadoop-hdfs>
&& /home/jenkins/tools/java/jdk1.7.0_55/jre/bin/java -Xmx2048m -XX:MaxPermSize=768m
-XX:+HeapDumpOnOutOfMemoryError -jar <https://builds.apache.org/job/Hadoop-Hdfs-trunk/ws/hadoop-hdfs-project/hadoop-hdfs/target/surefire/surefirebooter6599320452435625625.jar>
<https://builds.apache.org/job/Hadoop-Hdfs-trunk/ws/hadoop-hdfs-project/hadoop-hdfs/target/surefire/surefire4231219783556978983tmp>
<https://builds.apache.org/job/Hadoop-Hdfs-trunk/ws/hadoop-hdfs-project/hadoop-hdfs/target/surefire/surefire_5512139073877281145870tmp>
[ERROR] -> [Help 1]
[ERROR] 
[ERROR] To see the full stack trace of the errors, re-run Maven with the -e switch.
[ERROR] Re-run Maven using the -X switch to enable full debug logging.
[ERROR] 
[ERROR] For more information about the errors and possible solutions, please read the following
articles:
[ERROR] [Help 1] http://cwiki.apache.org/confluence/display/MAVEN/MojoFailureException
[ERROR] 
[ERROR] After correcting the problems, you can resume the build with the command
[ERROR]   mvn <goals> -rf :hadoop-hdfs
Build step 'Execute shell' marked build as failure
Archiving artifacts
Recording test results
Updating HADOOP-8437

Mime
View raw message