hadoop-hdfs-dev mailing list archives

Site index · List index
Message view « Date » · « Thread »
Top « Date » · « Thread »
From Apache Jenkins Server <jenk...@builds.apache.org>
Subject Hadoop-Hdfs-trunk - Build # 2435 - Still Failing
Date Thu, 15 Oct 2015 04:56:36 GMT
See https://builds.apache.org/job/Hadoop-Hdfs-trunk/2435/

###################################################################################
########################## LAST 60 LINES OF THE CONSOLE ###########################
[...truncated 6932 lines...]

main:
    [mkdir] Created dir: /home/jenkins/jenkins-slave/workspace/Hadoop-Hdfs-trunk/hadoop-hdfs-project/target/test-dir
[INFO] Executed tasks
[INFO] 
[INFO] --- maven-source-plugin:2.3:jar-no-fork (hadoop-java-sources) @ hadoop-hdfs-project
---
[INFO] 
[INFO] --- maven-source-plugin:2.3:test-jar-no-fork (hadoop-java-sources) @ hadoop-hdfs-project
---
[INFO] 
[INFO] --- maven-enforcer-plugin:1.3.1:enforce (dist-enforce) @ hadoop-hdfs-project ---
[INFO] 
[INFO] --- maven-site-plugin:3.4:attach-descriptor (attach-descriptor) @ hadoop-hdfs-project
---
[INFO] 
[INFO] --- maven-javadoc-plugin:2.8.1:jar (module-javadocs) @ hadoop-hdfs-project ---
[INFO] Skipping javadoc generation
[INFO] 
[INFO] --- maven-enforcer-plugin:1.3.1:enforce (depcheck) @ hadoop-hdfs-project ---
[INFO] 
[INFO] --- maven-checkstyle-plugin:2.15:checkstyle (default-cli) @ hadoop-hdfs-project ---
[INFO] 
[INFO] --- findbugs-maven-plugin:3.0.0:findbugs (default-cli) @ hadoop-hdfs-project ---
[INFO] ------------------------------------------------------------------------
[INFO] Reactor Summary:
[INFO] 
[INFO] Apache Hadoop HDFS Client ......................... SUCCESS [05:24 min]
[INFO] Apache Hadoop HDFS ................................ FAILURE [  04:06 h]
[INFO] Apache Hadoop HDFS Native Client .................. SKIPPED
[INFO] Apache Hadoop HttpFS .............................. SKIPPED
[INFO] Apache Hadoop HDFS BookKeeper Journal ............. SKIPPED
[INFO] Apache Hadoop HDFS-NFS ............................ SKIPPED
[INFO] Apache Hadoop HDFS Project ........................ SUCCESS [  0.114 s]
[INFO] ------------------------------------------------------------------------
[INFO] BUILD FAILURE
[INFO] ------------------------------------------------------------------------
[INFO] Total time: 04:12 h
[INFO] Finished at: 2015-10-15T04:57:05+00:00
[INFO] Final Memory: 55M/724M
[INFO] ------------------------------------------------------------------------
[ERROR] Failed to execute goal org.apache.maven.plugins:maven-surefire-plugin:2.17:test (default-test)
on project hadoop-hdfs: There are test failures.
[ERROR] 
[ERROR] Please refer to /home/jenkins/jenkins-slave/workspace/Hadoop-Hdfs-trunk/hadoop-hdfs-project/hadoop-hdfs/target/surefire-reports
for the individual test results.
[ERROR] -> [Help 1]
[ERROR] 
[ERROR] To see the full stack trace of the errors, re-run Maven with the -e switch.
[ERROR] Re-run Maven using the -X switch to enable full debug logging.
[ERROR] 
[ERROR] For more information about the errors and possible solutions, please read the following
articles:
[ERROR] [Help 1] http://cwiki.apache.org/confluence/display/MAVEN/MojoFailureException
[ERROR] 
[ERROR] After correcting the problems, you can resume the build with the command
[ERROR]   mvn <goals> -rf :hadoop-hdfs
Build step 'Execute shell' marked build as failure
Archiving artifacts
Recording test results
Updating HDFS-9210
Updating HDFS-9223
Sending e-mails to: hdfs-dev@hadoop.apache.org
Email was triggered for: Failure - Any
Sending email for trigger: Failure - Any



###################################################################################
############################## FAILED TESTS (if any) ##############################
4 tests failed.
FAILED:  org.apache.hadoop.hdfs.TestReplaceDatanodeOnFailure.testReplaceDatanodeOnFailure

Error Message:
expected:<3> but was:<2>

Stack Trace:
java.lang.AssertionError: expected:<3> but was:<2>
	at org.junit.Assert.fail(Assert.java:88)
	at org.junit.Assert.failNotEquals(Assert.java:743)
	at org.junit.Assert.assertEquals(Assert.java:118)
	at org.junit.Assert.assertEquals(Assert.java:555)
	at org.junit.Assert.assertEquals(Assert.java:542)
	at org.apache.hadoop.hdfs.TestReplaceDatanodeOnFailure$SlowWriter.checkReplication(TestReplaceDatanodeOnFailure.java:235)
	at org.apache.hadoop.hdfs.TestReplaceDatanodeOnFailure.testReplaceDatanodeOnFailure(TestReplaceDatanodeOnFailure.java:154)


FAILED:  org.apache.hadoop.hdfs.TestWriteReadStripedFile.testConcatWithDifferentECPolicy

Error Message:
org/apache/hadoop/ipc/ProtobufHelper

Stack Trace:
java.lang.NoClassDefFoundError: org/apache/hadoop/ipc/ProtobufHelper
	at java.net.URLClassLoader$1.run(URLClassLoader.java:366)
	at java.net.URLClassLoader$1.run(URLClassLoader.java:355)
	at java.security.AccessController.doPrivileged(Native Method)
	at java.net.URLClassLoader.findClass(URLClassLoader.java:354)
	at java.lang.ClassLoader.loadClass(ClassLoader.java:425)
	at sun.misc.Launcher$AppClassLoader.loadClass(Launcher.java:308)
	at java.lang.ClassLoader.loadClass(ClassLoader.java:358)
	at org.apache.hadoop.hdfs.protocolPB.ClientNamenodeProtocolTranslatorPB.concat(ClientNamenodeProtocolTranslatorPB.java:508)
	at sun.reflect.NativeMethodAccessorImpl.invoke0(Native Method)
	at sun.reflect.NativeMethodAccessorImpl.invoke(NativeMethodAccessorImpl.java:57)
	at sun.reflect.DelegatingMethodAccessorImpl.invoke(DelegatingMethodAccessorImpl.java:43)
	at java.lang.reflect.Method.invoke(Method.java:606)
	at org.apache.hadoop.io.retry.RetryInvocationHandler.invokeMethod(RetryInvocationHandler.java:251)
	at org.apache.hadoop.io.retry.RetryInvocationHandler.invoke(RetryInvocationHandler.java:103)
	at com.sun.proxy.$Proxy25.concat(Unknown Source)
	at org.apache.hadoop.hdfs.DFSClient.concat(DFSClient.java:1462)
	at org.apache.hadoop.hdfs.DistributedFileSystem.concat(DistributedFileSystem.java:573)
	at org.apache.hadoop.hdfs.TestWriteReadStripedFile.testConcatWithDifferentECPolicy(TestWriteReadStripedFile.java:305)


FAILED:  org.apache.hadoop.hdfs.server.namenode.ha.TestHAAppend.testMultipleAppendsDuringCatchupTailing

Error Message:
inode should complete in ~60000 ms.
Expected: is <true>
     but: was <false>

Stack Trace:
java.lang.AssertionError: inode should complete in ~60000 ms.
Expected: is <true>
     but: was <false>
	at org.hamcrest.MatcherAssert.assertThat(MatcherAssert.java:20)
	at org.junit.Assert.assertThat(Assert.java:865)
	at org.apache.hadoop.hdfs.server.namenode.TestFileTruncate.checkBlockRecovery(TestFileTruncate.java:1192)
	at org.apache.hadoop.hdfs.server.namenode.ha.TestHAAppend.testMultipleAppendsDuringCatchupTailing(TestHAAppend.java:125)


FAILED:  org.apache.hadoop.fs.TestGlobPaths.pTestCurlyBracket

Error Message:
error parsing regexp: Unclosed group at pos 10: `myuser}{bc`

Stack Trace:
com.google.re2j.PatternSyntaxException: error parsing regexp: Unclosed group at pos 10: `myuser}{bc`
	at org.apache.hadoop.fs.GlobPattern.error(GlobPattern.java:168)
	at org.apache.hadoop.fs.GlobPattern.set(GlobPattern.java:154)
	at org.apache.hadoop.fs.GlobPattern.<init>(GlobPattern.java:42)
	at org.apache.hadoop.fs.GlobFilter.init(GlobFilter.java:67)
	at org.apache.hadoop.fs.GlobFilter.<init>(GlobFilter.java:50)
	at org.apache.hadoop.fs.Globber.doGlob(Globber.java:209)
	at org.apache.hadoop.fs.Globber.glob(Globber.java:148)
	at org.apache.hadoop.fs.FileSystem.globStatus(FileSystem.java:1664)
	at org.apache.hadoop.fs.TestGlobPaths.prepareTesting(TestGlobPaths.java:758)
	at org.apache.hadoop.fs.TestGlobPaths.pTestCurlyBracket(TestGlobPaths.java:724)



Mime
  • Unnamed multipart/mixed (inline, None, 0 bytes)
View raw message