hadoop-hdfs-dev mailing list archives

Site index · List index
Message view « Date » · « Thread »
Top « Date » · « Thread »
From Apache Jenkins Server <jenk...@builds.apache.org>
Subject Build failed in Jenkins: Hadoop-Hdfs-trunk #2424
Date Tue, 13 Oct 2015 03:13:02 GMT
See <https://builds.apache.org/job/Hadoop-Hdfs-trunk/2424/changes>

Changes:

[wheat9] Addendum patch for HDFS-9215.

------------------------------------------
[...truncated 6273 lines...]
Tests run: 26, Failures: 0, Errors: 0, Skipped: 0, Time elapsed: 42.715 sec - in org.apache.hadoop.hdfs.server.namenode.TestINodeFile
Running org.apache.hadoop.hdfs.server.namenode.TestFsckWithMultipleNameNodes
Tests run: 1, Failures: 0, Errors: 0, Skipped: 0, Time elapsed: 5.794 sec - in org.apache.hadoop.hdfs.server.namenode.TestFsckWithMultipleNameNodes
Running org.apache.hadoop.hdfs.server.mover.TestMover
Tests run: 10, Failures: 0, Errors: 0, Skipped: 0, Time elapsed: 89.982 sec - in org.apache.hadoop.hdfs.server.mover.TestMover
Running org.apache.hadoop.hdfs.server.mover.TestStorageMover
Tests run: 6, Failures: 0, Errors: 0, Skipped: 0, Time elapsed: 184.905 sec - in org.apache.hadoop.hdfs.server.mover.TestStorageMover
Running org.apache.hadoop.hdfs.server.balancer.TestBalancerWithSaslDataTransfer
Tests run: 3, Failures: 0, Errors: 0, Skipped: 0, Time elapsed: 45.725 sec - in org.apache.hadoop.hdfs.server.balancer.TestBalancerWithSaslDataTransfer
Running org.apache.hadoop.hdfs.server.balancer.TestBalancerWithNodeGroup
Tests run: 3, Failures: 0, Errors: 0, Skipped: 0, Time elapsed: 29.481 sec - in org.apache.hadoop.hdfs.server.balancer.TestBalancerWithNodeGroup
Running org.apache.hadoop.hdfs.server.balancer.TestBalancerWithEncryptedTransfer
Tests run: 3, Failures: 0, Errors: 0, Skipped: 0, Time elapsed: 28.518 sec - in org.apache.hadoop.hdfs.server.balancer.TestBalancerWithEncryptedTransfer
Running org.apache.hadoop.hdfs.server.balancer.TestBalancerWithHANameNodes
Tests run: 1, Failures: 0, Errors: 0, Skipped: 0, Time elapsed: 10.036 sec - in org.apache.hadoop.hdfs.server.balancer.TestBalancerWithHANameNodes
Running org.apache.hadoop.hdfs.server.balancer.TestBalancer
Tests run: 29, Failures: 0, Errors: 0, Skipped: 0, Time elapsed: 254.077 sec - in org.apache.hadoop.hdfs.server.balancer.TestBalancer
Running org.apache.hadoop.hdfs.server.balancer.TestBalancerWithMultipleNameNodes
Tests run: 4, Failures: 0, Errors: 0, Skipped: 0, Time elapsed: 45.492 sec - in org.apache.hadoop.hdfs.server.balancer.TestBalancerWithMultipleNameNodes
Running org.apache.hadoop.hdfs.TestParallelShortCircuitReadNoChecksum
Tests run: 4, Failures: 0, Errors: 0, Skipped: 0, Time elapsed: 15.105 sec - in org.apache.hadoop.hdfs.TestParallelShortCircuitReadNoChecksum
Running org.apache.hadoop.hdfs.TestGetBlocks
Tests run: 3, Failures: 0, Errors: 0, Skipped: 0, Time elapsed: 41.968 sec - in org.apache.hadoop.hdfs.TestGetBlocks
Running org.apache.hadoop.hdfs.TestRollingUpgradeDowngrade
Tests run: 2, Failures: 0, Errors: 0, Skipped: 0, Time elapsed: 8.421 sec - in org.apache.hadoop.hdfs.TestRollingUpgradeDowngrade
Running org.apache.hadoop.hdfs.TestDataTransferKeepalive
Tests run: 4, Failures: 0, Errors: 0, Skipped: 0, Time elapsed: 16.35 sec - in org.apache.hadoop.hdfs.TestDataTransferKeepalive
Running org.apache.hadoop.hdfs.TestFileAppendRestart
Tests run: 3, Failures: 0, Errors: 0, Skipped: 0, Time elapsed: 14.606 sec - in org.apache.hadoop.hdfs.TestFileAppendRestart
Running org.apache.hadoop.hdfs.TestDFSClientFailover
Tests run: 8, Failures: 0, Errors: 0, Skipped: 0, Time elapsed: 12.358 sec - in org.apache.hadoop.hdfs.TestDFSClientFailover
Running org.apache.hadoop.hdfs.TestDistributedFileSystem
Tests run: 17, Failures: 0, Errors: 0, Skipped: 0, Time elapsed: 43.36 sec - in org.apache.hadoop.hdfs.TestDistributedFileSystem
Running org.apache.hadoop.hdfs.TestSmallBlock
Tests run: 2, Failures: 0, Errors: 0, Skipped: 0, Time elapsed: 5.48 sec - in org.apache.hadoop.hdfs.TestSmallBlock
Running org.apache.hadoop.hdfs.TestDFSStripedInputStream
Tests run: 4, Failures: 0, Errors: 0, Skipped: 0, Time elapsed: 19.41 sec - in org.apache.hadoop.hdfs.TestDFSStripedInputStream
Running org.apache.hadoop.hdfs.TestGetFileChecksum
Tests run: 2, Failures: 0, Errors: 0, Skipped: 0, Time elapsed: 7.839 sec - in org.apache.hadoop.hdfs.TestGetFileChecksum
Running org.apache.hadoop.hdfs.TestLeaseRecovery
Tests run: 3, Failures: 0, Errors: 0, Skipped: 0, Time elapsed: 19.853 sec - in org.apache.hadoop.hdfs.TestLeaseRecovery
Running org.apache.hadoop.hdfs.TestHFlush
Tests run: 14, Failures: 0, Errors: 0, Skipped: 0, Time elapsed: 30.32 sec - in org.apache.hadoop.hdfs.TestHFlush
Running org.apache.hadoop.hdfs.TestDFSPermission
Tests run: 8, Failures: 0, Errors: 0, Skipped: 0, Time elapsed: 21.682 sec - in org.apache.hadoop.hdfs.TestDFSPermission
Running org.apache.hadoop.hdfs.TestParallelUnixDomainRead
Tests run: 4, Failures: 0, Errors: 0, Skipped: 0, Time elapsed: 39.367 sec - in org.apache.hadoop.hdfs.TestParallelUnixDomainRead
Running org.apache.hadoop.hdfs.TestWriteConfigurationToDFS
Tests run: 1, Failures: 0, Errors: 0, Skipped: 0, Time elapsed: 5.509 sec - in org.apache.hadoop.hdfs.TestWriteConfigurationToDFS
Running org.apache.hadoop.hdfs.TestDisableConnCache
Tests run: 1, Failures: 0, Errors: 0, Skipped: 0, Time elapsed: 4.814 sec - in org.apache.hadoop.hdfs.TestDisableConnCache
Running org.apache.hadoop.hdfs.TestLease
Tests run: 5, Failures: 0, Errors: 0, Skipped: 0, Time elapsed: 8.934 sec - in org.apache.hadoop.hdfs.TestLease
Running org.apache.hadoop.hdfs.TestDFSUtil
Tests run: 31, Failures: 0, Errors: 0, Skipped: 0, Time elapsed: 3.465 sec - in org.apache.hadoop.hdfs.TestDFSUtil
Running org.apache.hadoop.hdfs.TestClientBlockVerification
Tests run: 4, Failures: 0, Errors: 0, Skipped: 0, Time elapsed: 5.365 sec - in org.apache.hadoop.hdfs.TestClientBlockVerification
Running org.apache.hadoop.hdfs.security.TestDelegationTokenForProxyUser
Tests run: 2, Failures: 0, Errors: 0, Skipped: 0, Time elapsed: 6.638 sec - in org.apache.hadoop.hdfs.security.TestDelegationTokenForProxyUser
Running org.apache.hadoop.hdfs.security.TestDelegationToken
Tests run: 7, Failures: 0, Errors: 0, Skipped: 0, Time elapsed: 31.408 sec - in org.apache.hadoop.hdfs.security.TestDelegationToken
Running org.apache.hadoop.hdfs.security.TestClientProtocolWithDelegationToken
Tests run: 1, Failures: 0, Errors: 0, Skipped: 0, Time elapsed: 1.823 sec - in org.apache.hadoop.hdfs.security.TestClientProtocolWithDelegationToken
Running org.apache.hadoop.hdfs.security.token.block.TestBlockToken
Tests run: 6, Failures: 0, Errors: 0, Skipped: 0, Time elapsed: 7.774 sec - in org.apache.hadoop.hdfs.security.token.block.TestBlockToken
Running org.apache.hadoop.hdfs.TestClientProtocolForPipelineRecovery
Tests run: 5, Failures: 0, Errors: 0, Skipped: 0, Time elapsed: 38.506 sec - in org.apache.hadoop.hdfs.TestClientProtocolForPipelineRecovery
Running org.apache.hadoop.hdfs.TestParallelShortCircuitLegacyRead
Tests run: 4, Failures: 0, Errors: 0, Skipped: 0, Time elapsed: 16.208 sec - in org.apache.hadoop.hdfs.TestParallelShortCircuitLegacyRead
Running org.apache.hadoop.hdfs.TestKeyProviderCache
Tests run: 1, Failures: 0, Errors: 0, Skipped: 0, Time elapsed: 0.586 sec - in org.apache.hadoop.hdfs.TestKeyProviderCache
Running org.apache.hadoop.hdfs.TestExternalBlockReader
Tests run: 2, Failures: 0, Errors: 0, Skipped: 0, Time elapsed: 5.82 sec - in org.apache.hadoop.hdfs.TestExternalBlockReader
Running org.apache.hadoop.hdfs.TestDatanodeStartupFixesLegacyStorageIDs
Tests run: 3, Failures: 0, Errors: 0, Skipped: 0, Time elapsed: 6.513 sec - in org.apache.hadoop.hdfs.TestDatanodeStartupFixesLegacyStorageIDs
Running org.apache.hadoop.hdfs.TestPeerCache
Tests run: 5, Failures: 0, Errors: 0, Skipped: 0, Time elapsed: 1.42 sec - in org.apache.hadoop.hdfs.TestPeerCache
Running org.apache.hadoop.hdfs.TestFileCreationClient
Tests run: 1, Failures: 0, Errors: 0, Skipped: 0, Time elapsed: 40.679 sec - in org.apache.hadoop.hdfs.TestFileCreationClient
Running org.apache.hadoop.hdfs.TestFileCreationEmpty
Tests run: 1, Failures: 0, Errors: 0, Skipped: 0, Time elapsed: 9.561 sec - in org.apache.hadoop.hdfs.TestFileCreationEmpty
Running org.apache.hadoop.hdfs.TestFileStatusWithECPolicy
Tests run: 1, Failures: 0, Errors: 0, Skipped: 0, Time elapsed: 4.332 sec - in org.apache.hadoop.hdfs.TestFileStatusWithECPolicy
Running org.apache.hadoop.hdfs.TestReplaceDatanodeOnFailure
Tests run: 4, Failures: 0, Errors: 0, Skipped: 0, Time elapsed: 12.839 sec - in org.apache.hadoop.hdfs.TestReplaceDatanodeOnFailure
Running org.apache.hadoop.hdfs.TestDFSStartupVersions
Tests run: 1, Failures: 0, Errors: 0, Skipped: 0, Time elapsed: 11.437 sec - in org.apache.hadoop.hdfs.TestDFSStartupVersions
Running org.apache.hadoop.hdfs.TestDFSUpgrade
Tests run: 2, Failures: 0, Errors: 0, Skipped: 0, Time elapsed: 14.202 sec - in org.apache.hadoop.hdfs.TestDFSUpgrade
Running org.apache.hadoop.hdfs.web.TestWebHDFSOAuth2
Tests run: 1, Failures: 0, Errors: 1, Skipped: 0, Time elapsed: 2.026 sec <<< FAILURE!
- in org.apache.hadoop.hdfs.web.TestWebHDFSOAuth2
listStatusReturnsAsExpected(org.apache.hadoop.hdfs.web.TestWebHDFSOAuth2)  Time elapsed: 1.748
sec  <<< ERROR!
java.io.IOException: Unable to load OAuth2 connection factory.
	at java.io.FileInputStream.open(Native Method)
	at java.io.FileInputStream.<init>(FileInputStream.java:146)
	at org.apache.hadoop.security.ssl.ReloadingX509TrustManager.loadTrustManager(ReloadingX509TrustManager.java:164)
	at org.apache.hadoop.security.ssl.ReloadingX509TrustManager.<init>(ReloadingX509TrustManager.java:81)
	at org.apache.hadoop.security.ssl.FileBasedKeyStoresFactory.init(FileBasedKeyStoresFactory.java:215)
	at org.apache.hadoop.security.ssl.SSLFactory.init(SSLFactory.java:131)
	at org.apache.hadoop.hdfs.web.URLConnectionFactory.newSslConnConfigurator(URLConnectionFactory.java:138)
	at org.apache.hadoop.hdfs.web.URLConnectionFactory.newOAuth2URLConnectionFactory(URLConnectionFactory.java:112)
	at org.apache.hadoop.hdfs.web.WebHdfsFileSystem.initialize(WebHdfsFileSystem.java:163)
	at org.apache.hadoop.hdfs.web.TestWebHDFSOAuth2.listStatusReturnsAsExpected(TestWebHDFSOAuth2.java:147)

Running org.apache.hadoop.hdfs.web.TestFSMainOperationsWebHdfs
Tests run: 52, Failures: 0, Errors: 0, Skipped: 0, Time elapsed: 10.418 sec - in org.apache.hadoop.hdfs.web.TestFSMainOperationsWebHdfs
Running org.apache.hadoop.hdfs.web.TestOffsetUrlInputStream
Tests run: 1, Failures: 0, Errors: 0, Skipped: 0, Time elapsed: 0.252 sec - in org.apache.hadoop.hdfs.web.TestOffsetUrlInputStream
Running org.apache.hadoop.hdfs.web.TestWebHdfsUrl
Tests run: 6, Failures: 0, Errors: 0, Skipped: 0, Time elapsed: 1.922 sec - in org.apache.hadoop.hdfs.web.TestWebHdfsUrl
Running org.apache.hadoop.hdfs.web.TestWebHdfsContentLength
Tests run: 7, Failures: 0, Errors: 0, Skipped: 0, Time elapsed: 1.149 sec - in org.apache.hadoop.hdfs.web.TestWebHdfsContentLength
Running org.apache.hadoop.hdfs.web.TestWebHDFSForHA
Tests run: 6, Failures: 0, Errors: 0, Skipped: 0, Time elapsed: 15.188 sec - in org.apache.hadoop.hdfs.web.TestWebHDFSForHA
Running org.apache.hadoop.hdfs.web.resources.TestParam
Tests run: 29, Failures: 0, Errors: 0, Skipped: 0, Time elapsed: 0.951 sec - in org.apache.hadoop.hdfs.web.resources.TestParam
Running org.apache.hadoop.hdfs.web.TestWebHdfsWithMultipleNameNodes
Tests run: 1, Failures: 0, Errors: 0, Skipped: 0, Time elapsed: 9.681 sec - in org.apache.hadoop.hdfs.web.TestWebHdfsWithMultipleNameNodes
Running org.apache.hadoop.hdfs.web.TestWebHdfsTokens
Tests run: 11, Failures: 0, Errors: 0, Skipped: 0, Time elapsed: 10.176 sec - in org.apache.hadoop.hdfs.web.TestWebHdfsTokens
Running org.apache.hadoop.hdfs.web.TestTokenAspect
Tests run: 6, Failures: 0, Errors: 0, Skipped: 0, Time elapsed: 1.512 sec - in org.apache.hadoop.hdfs.web.TestTokenAspect
Running org.apache.hadoop.hdfs.web.TestURLConnectionFactory
Tests run: 1, Failures: 0, Errors: 0, Skipped: 0, Time elapsed: 0.212 sec - in org.apache.hadoop.hdfs.web.TestURLConnectionFactory
Running org.apache.hadoop.hdfs.web.oauth2.TestRefreshTokenTimeBasedTokenRefresher
Tests run: 1, Failures: 0, Errors: 0, Skipped: 0, Time elapsed: 2.243 sec - in org.apache.hadoop.hdfs.web.oauth2.TestRefreshTokenTimeBasedTokenRefresher
Running org.apache.hadoop.hdfs.web.oauth2.TestClientCredentialTimeBasedTokenRefresher
Tests run: 1, Failures: 0, Errors: 0, Skipped: 0, Time elapsed: 2.189 sec - in org.apache.hadoop.hdfs.web.oauth2.TestClientCredentialTimeBasedTokenRefresher
Running org.apache.hadoop.hdfs.web.oauth2.TestAccessTokenTimer
Tests run: 2, Failures: 0, Errors: 0, Skipped: 0, Time elapsed: 0.288 sec - in org.apache.hadoop.hdfs.web.oauth2.TestAccessTokenTimer
Running org.apache.hadoop.hdfs.web.TestHttpsFileSystem
Tests run: 1, Failures: 0, Errors: 0, Skipped: 0, Time elapsed: 6.997 sec - in org.apache.hadoop.hdfs.web.TestHttpsFileSystem
Running org.apache.hadoop.hdfs.web.TestByteRangeInputStream
Tests run: 5, Failures: 0, Errors: 0, Skipped: 0, Time elapsed: 0.417 sec - in org.apache.hadoop.hdfs.web.TestByteRangeInputStream
Running org.apache.hadoop.hdfs.web.TestWebHdfsWithAuthenticationFilter
Tests run: 1, Failures: 0, Errors: 0, Skipped: 0, Time elapsed: 5.584 sec - in org.apache.hadoop.hdfs.web.TestWebHdfsWithAuthenticationFilter
Running org.apache.hadoop.hdfs.web.TestWebHDFS
Tests run: 15, Failures: 0, Errors: 0, Skipped: 0, Time elapsed: 103.125 sec - in org.apache.hadoop.hdfs.web.TestWebHDFS
Running org.apache.hadoop.hdfs.web.TestWebHdfsTimeouts
Tests run: 8, Failures: 0, Errors: 0, Skipped: 0, Time elapsed: 1.897 sec - in org.apache.hadoop.hdfs.web.TestWebHdfsTimeouts
Running org.apache.hadoop.hdfs.web.TestWebHDFSAcl
Tests run: 64, Failures: 0, Errors: 0, Skipped: 1, Time elapsed: 29.28 sec - in org.apache.hadoop.hdfs.web.TestWebHDFSAcl
Running org.apache.hadoop.hdfs.web.TestWebHDFSXAttr
Tests run: 12, Failures: 0, Errors: 0, Skipped: 0, Time elapsed: 17.896 sec - in org.apache.hadoop.hdfs.web.TestWebHDFSXAttr
Running org.apache.hadoop.hdfs.web.TestAuthFilter
Tests run: 3, Failures: 0, Errors: 0, Skipped: 0, Time elapsed: 0.731 sec - in org.apache.hadoop.hdfs.web.TestAuthFilter
Running org.apache.hadoop.hdfs.web.TestJsonUtil
Tests run: 8, Failures: 0, Errors: 0, Skipped: 0, Time elapsed: 0.636 sec - in org.apache.hadoop.hdfs.web.TestJsonUtil
Running org.apache.hadoop.hdfs.web.TestWebHdfsFileSystemContract
Tests run: 52, Failures: 0, Errors: 0, Skipped: 0, Time elapsed: 25.893 sec - in org.apache.hadoop.hdfs.web.TestWebHdfsFileSystemContract
Running org.apache.hadoop.hdfs.TestBlockReaderLocalLegacy
Tests run: 3, Failures: 0, Errors: 0, Skipped: 0, Time elapsed: 6.219 sec - in org.apache.hadoop.hdfs.TestBlockReaderLocalLegacy
Running org.apache.hadoop.hdfs.TestEncryptionZonesWithKMS
Tests run: 20, Failures: 0, Errors: 0, Skipped: 0, Time elapsed: 53.144 sec - in org.apache.hadoop.hdfs.TestEncryptionZonesWithKMS
Running org.apache.hadoop.hdfs.TestConnCache
Tests run: 1, Failures: 0, Errors: 0, Skipped: 0, Time elapsed: 4.254 sec - in org.apache.hadoop.hdfs.TestConnCache
Running org.apache.hadoop.hdfs.TestRollingUpgrade

Results :

Tests in error: 
  TestWebHDFSOAuth2.listStatusReturnsAsExpected:147 ยป IO Unable to load OAuth2 c...

Tests run: 2286, Failures: 0, Errors: 1, Skipped: 4

[INFO]                                                                         
[INFO] ------------------------------------------------------------------------
[INFO] Skipping Apache Hadoop HDFS Native Client
[INFO] This project has been banned from the build due to previous failures.
[INFO] ------------------------------------------------------------------------
[INFO]                                                                         
[INFO] ------------------------------------------------------------------------
[INFO] Skipping Apache Hadoop HttpFS
[INFO] This project has been banned from the build due to previous failures.
[INFO] ------------------------------------------------------------------------
[INFO]                                                                         
[INFO] ------------------------------------------------------------------------
[INFO] Skipping Apache Hadoop HDFS BookKeeper Journal
[INFO] This project has been banned from the build due to previous failures.
[INFO] ------------------------------------------------------------------------
[INFO]                                                                         
[INFO] ------------------------------------------------------------------------
[INFO] Skipping Apache Hadoop HDFS-NFS
[INFO] This project has been banned from the build due to previous failures.
[INFO] ------------------------------------------------------------------------
[INFO]                                                                         
[INFO] ------------------------------------------------------------------------
[INFO] Building Apache Hadoop HDFS Project 3.0.0-SNAPSHOT
[INFO] ------------------------------------------------------------------------
[INFO] 
[INFO] --- maven-clean-plugin:2.5:clean (default-clean) @ hadoop-hdfs-project ---
[INFO] Deleting <https://builds.apache.org/job/Hadoop-Hdfs-trunk/ws/hadoop-hdfs-project/target>
[INFO] 
[INFO] --- maven-antrun-plugin:1.7:run (create-testdirs) @ hadoop-hdfs-project ---
[INFO] Executing tasks

main:
    [mkdir] Created dir: <https://builds.apache.org/job/Hadoop-Hdfs-trunk/ws/hadoop-hdfs-project/target/test-dir>
[INFO] Executed tasks
[INFO] 
[INFO] --- maven-source-plugin:2.3:jar-no-fork (hadoop-java-sources) @ hadoop-hdfs-project
---
[INFO] 
[INFO] --- maven-source-plugin:2.3:test-jar-no-fork (hadoop-java-sources) @ hadoop-hdfs-project
---
[INFO] 
[INFO] --- maven-enforcer-plugin:1.3.1:enforce (dist-enforce) @ hadoop-hdfs-project ---
[INFO] 
[INFO] --- maven-site-plugin:3.4:attach-descriptor (attach-descriptor) @ hadoop-hdfs-project
---
[INFO] 
[INFO] --- maven-javadoc-plugin:2.8.1:jar (module-javadocs) @ hadoop-hdfs-project ---
[INFO] Skipping javadoc generation
[INFO] 
[INFO] --- maven-enforcer-plugin:1.3.1:enforce (depcheck) @ hadoop-hdfs-project ---
[INFO] 
[INFO] --- maven-checkstyle-plugin:2.15:checkstyle (default-cli) @ hadoop-hdfs-project ---
[INFO] 
[INFO] --- findbugs-maven-plugin:3.0.0:findbugs (default-cli) @ hadoop-hdfs-project ---
[INFO] ------------------------------------------------------------------------
[INFO] Reactor Summary:
[INFO] 
[INFO] Apache Hadoop HDFS Client ......................... SUCCESS [03:30 min]
[INFO] Apache Hadoop HDFS ................................ FAILURE [  02:15 h]
[INFO] Apache Hadoop HDFS Native Client .................. SKIPPED
[INFO] Apache Hadoop HttpFS .............................. SKIPPED
[INFO] Apache Hadoop HDFS BookKeeper Journal ............. SKIPPED
[INFO] Apache Hadoop HDFS-NFS ............................ SKIPPED
[INFO] Apache Hadoop HDFS Project ........................ SUCCESS [  0.074 s]
[INFO] ------------------------------------------------------------------------
[INFO] BUILD FAILURE
[INFO] ------------------------------------------------------------------------
[INFO] Total time: 02:18 h
[INFO] Finished at: 2015-10-13T03:13:35+00:00
[INFO] Final Memory: 78M/964M
[INFO] ------------------------------------------------------------------------
[ERROR] Failed to execute goal org.apache.maven.plugins:maven-surefire-plugin:2.17:test (default-test)
on project hadoop-hdfs: ExecutionException: java.lang.RuntimeException: The forked VM terminated
without properly saying goodbye. VM crash or System.exit called?
[ERROR] Command was /bin/sh -c cd <https://builds.apache.org/job/Hadoop-Hdfs-trunk/ws/hadoop-hdfs-project/hadoop-hdfs>
&& /home/jenkins/tools/java/jdk1.7.0_55/jre/bin/java -Xmx2048m -XX:MaxPermSize=768m
-XX:+HeapDumpOnOutOfMemoryError -jar <https://builds.apache.org/job/Hadoop-Hdfs-trunk/ws/hadoop-hdfs-project/hadoop-hdfs/target/surefire/surefirebooter4255495163919430919.jar>
<https://builds.apache.org/job/Hadoop-Hdfs-trunk/ws/hadoop-hdfs-project/hadoop-hdfs/target/surefire/surefire3955652136566494646tmp>
<https://builds.apache.org/job/Hadoop-Hdfs-trunk/ws/hadoop-hdfs-project/hadoop-hdfs/target/surefire/surefire_2121103783797586463539tmp>
[ERROR] -> [Help 1]
[ERROR] 
[ERROR] To see the full stack trace of the errors, re-run Maven with the -e switch.
[ERROR] Re-run Maven using the -X switch to enable full debug logging.
[ERROR] 
[ERROR] For more information about the errors and possible solutions, please read the following
articles:
[ERROR] [Help 1] http://cwiki.apache.org/confluence/display/MAVEN/MojoFailureException
[ERROR] 
[ERROR] After correcting the problems, you can resume the build with the command
[ERROR]   mvn <goals> -rf :hadoop-hdfs
Build step 'Execute shell' marked build as failure
Archiving artifacts
Recording test results
Updating HDFS-9215

Mime
View raw message