hadoop-hdfs-dev mailing list archives

Site index · List index
Message view « Date » · « Thread »
Top « Date » · « Thread »
From Apache Jenkins Server <jenk...@builds.apache.org>
Subject Hadoop-Hdfs-trunk-Java8 - Build # 483 - Still Failing
Date Mon, 12 Oct 2015 10:09:19 GMT
See https://builds.apache.org/job/Hadoop-Hdfs-trunk-Java8/483/

###################################################################################
########################## LAST 60 LINES OF THE CONSOLE ###########################
[...truncated 7517 lines...]
[INFO] Executing tasks

main:
    [mkdir] Created dir: /home/jenkins/jenkins-slave/workspace/Hadoop-Hdfs-trunk-Java8/hadoop-hdfs-project/target/test-dir
[INFO] Executed tasks
[INFO] 
[INFO] --- maven-source-plugin:2.3:jar-no-fork (hadoop-java-sources) @ hadoop-hdfs-project
---
[INFO] 
[INFO] --- maven-source-plugin:2.3:test-jar-no-fork (hadoop-java-sources) @ hadoop-hdfs-project
---
[INFO] 
[INFO] --- maven-enforcer-plugin:1.3.1:enforce (dist-enforce) @ hadoop-hdfs-project ---
[INFO] 
[INFO] --- maven-site-plugin:3.4:attach-descriptor (attach-descriptor) @ hadoop-hdfs-project
---
[INFO] 
[INFO] --- maven-javadoc-plugin:2.8.1:jar (module-javadocs) @ hadoop-hdfs-project ---
[INFO] Not executing Javadoc as the project is not a Java classpath-capable package
[INFO] 
[INFO] --- maven-enforcer-plugin:1.3.1:enforce (depcheck) @ hadoop-hdfs-project ---
[INFO] 
[INFO] --- maven-checkstyle-plugin:2.15:checkstyle (default-cli) @ hadoop-hdfs-project ---
[INFO] 
[INFO] --- findbugs-maven-plugin:3.0.0:findbugs (default-cli) @ hadoop-hdfs-project ---
[INFO] ------------------------------------------------------------------------
[INFO] Reactor Summary:
[INFO] 
[INFO] Apache Hadoop HDFS Client ......................... SUCCESS [04:13 min]
[INFO] Apache Hadoop HDFS ................................ FAILURE [  03:14 h]
[INFO] Apache Hadoop HDFS Native Client .................. SKIPPED
[INFO] Apache Hadoop HttpFS .............................. SKIPPED
[INFO] Apache Hadoop HDFS BookKeeper Journal ............. SKIPPED
[INFO] Apache Hadoop HDFS-NFS ............................ SKIPPED
[INFO] Apache Hadoop HDFS Project ........................ SUCCESS [  0.047 s]
[INFO] ------------------------------------------------------------------------
[INFO] BUILD FAILURE
[INFO] ------------------------------------------------------------------------
[INFO] Total time: 03:18 h
[INFO] Finished at: 2015-10-12T10:09:15+00:00
[INFO] Final Memory: 55M/622M
[INFO] ------------------------------------------------------------------------
[ERROR] Failed to execute goal org.apache.maven.plugins:maven-surefire-plugin:2.17:test (default-test)
on project hadoop-hdfs: There are test failures.
[ERROR] 
[ERROR] Please refer to /home/jenkins/jenkins-slave/workspace/Hadoop-Hdfs-trunk-Java8/hadoop-hdfs-project/hadoop-hdfs/target/surefire-reports
for the individual test results.
[ERROR] -> [Help 1]
[ERROR] 
[ERROR] To see the full stack trace of the errors, re-run Maven with the -e switch.
[ERROR] Re-run Maven using the -X switch to enable full debug logging.
[ERROR] 
[ERROR] For more information about the errors and possible solutions, please read the following
articles:
[ERROR] [Help 1] http://cwiki.apache.org/confluence/display/MAVEN/MojoFailureException
[ERROR] 
[ERROR] After correcting the problems, you can resume the build with the command
[ERROR]   mvn <goals> -rf :hadoop-hdfs
Build step 'Execute shell' marked build as failure
Archiving artifacts
Recording test results
Updating HDFS-9221
Sending e-mails to: hdfs-dev@hadoop.apache.org
Email was triggered for: Failure - Any
Sending email for trigger: Failure - Any



###################################################################################
############################## FAILED TESTS (if any) ##############################
6 tests failed.
FAILED:  org.apache.hadoop.hdfs.server.namenode.snapshot.TestSnapshot.testCreateSnapshotWithIllegalName

Error Message:
org/apache/hadoop/ipc/ProtobufHelper

Stack Trace:
java.lang.NoClassDefFoundError: org/apache/hadoop/ipc/ProtobufHelper
	at java.net.URLClassLoader$1.run(URLClassLoader.java:372)
	at java.net.URLClassLoader$1.run(URLClassLoader.java:361)
	at java.security.AccessController.doPrivileged(Native Method)
	at java.net.URLClassLoader.findClass(URLClassLoader.java:360)
	at java.lang.ClassLoader.loadClass(ClassLoader.java:424)
	at sun.misc.Launcher$AppClassLoader.loadClass(Launcher.java:308)
	at java.lang.ClassLoader.loadClass(ClassLoader.java:357)
	at org.apache.hadoop.hdfs.protocolPB.ClientNamenodeProtocolTranslatorPB.createSnapshot(ClientNamenodeProtocolTranslatorPB.java:997)
	at sun.reflect.NativeMethodAccessorImpl.invoke0(Native Method)
	at sun.reflect.NativeMethodAccessorImpl.invoke(NativeMethodAccessorImpl.java:62)
	at sun.reflect.DelegatingMethodAccessorImpl.invoke(DelegatingMethodAccessorImpl.java:43)
	at java.lang.reflect.Method.invoke(Method.java:483)
	at org.apache.hadoop.io.retry.RetryInvocationHandler.invokeMethod(RetryInvocationHandler.java:251)
	at org.apache.hadoop.io.retry.RetryInvocationHandler.invoke(RetryInvocationHandler.java:103)
	at com.sun.proxy.$Proxy23.createSnapshot(Unknown Source)
	at org.apache.hadoop.hdfs.DFSClient.createSnapshot(DFSClient.java:2071)
	at org.apache.hadoop.hdfs.DistributedFileSystem$35.doCall(DistributedFileSystem.java:1588)
	at org.apache.hadoop.hdfs.DistributedFileSystem$35.doCall(DistributedFileSystem.java:1585)
	at org.apache.hadoop.fs.FileSystemLinkResolver.resolve(FileSystemLinkResolver.java:81)
	at org.apache.hadoop.hdfs.DistributedFileSystem.createSnapshot(DistributedFileSystem.java:1603)
	at org.apache.hadoop.hdfs.server.namenode.snapshot.TestSnapshot.testCreateSnapshotWithIllegalName(TestSnapshot.java:335)


FAILED:  org.apache.hadoop.hdfs.server.namenode.snapshot.TestSnapshot.testSnapshot

Error Message:
org/apache/hadoop/util/IdentityHashStore$Visitor

Stack Trace:
java.lang.NoClassDefFoundError: org/apache/hadoop/util/IdentityHashStore$Visitor
	at java.net.URLClassLoader$1.run(URLClassLoader.java:372)
	at java.net.URLClassLoader$1.run(URLClassLoader.java:361)
	at java.security.AccessController.doPrivileged(Native Method)
	at java.net.URLClassLoader.findClass(URLClassLoader.java:360)
	at java.lang.ClassLoader.loadClass(ClassLoader.java:424)
	at sun.misc.Launcher$AppClassLoader.loadClass(Launcher.java:308)
	at java.lang.ClassLoader.loadClass(ClassLoader.java:357)
	at org.apache.hadoop.hdfs.DFSClient.open(DFSClient.java:1046)
	at org.apache.hadoop.hdfs.DistributedFileSystem$3.doCall(DistributedFileSystem.java:270)
	at org.apache.hadoop.hdfs.DistributedFileSystem$3.doCall(DistributedFileSystem.java:266)
	at org.apache.hadoop.fs.FileSystemLinkResolver.resolve(FileSystemLinkResolver.java:81)
	at org.apache.hadoop.hdfs.DistributedFileSystem.open(DistributedFileSystem.java:278)
	at org.apache.hadoop.fs.FileSystem.open(FileSystem.java:777)
	at org.apache.hadoop.hdfs.server.namenode.snapshot.TestSnapshot$FileAppend.checkSnapshots(TestSnapshot.java:756)
	at org.apache.hadoop.hdfs.server.namenode.snapshot.TestSnapshot.modifyCurrentDirAndCheckSnapshots(TestSnapshot.java:150)
	at org.apache.hadoop.hdfs.server.namenode.snapshot.TestSnapshot.runTestSnapshot(TestSnapshot.java:283)
	at org.apache.hadoop.hdfs.server.namenode.snapshot.TestSnapshot.testSnapshot(TestSnapshot.java:236)


FAILED:  org.apache.hadoop.hdfs.server.namenode.snapshot.TestSnapshot.testSnapshottableDirectory

Error Message:
org/apache/hadoop/ipc/ProtobufHelper

Stack Trace:
java.lang.NoClassDefFoundError: org/apache/hadoop/ipc/ProtobufHelper
	at org.apache.hadoop.hdfs.protocolPB.ClientNamenodeProtocolTranslatorPB.createSnapshot(ClientNamenodeProtocolTranslatorPB.java:997)
	at sun.reflect.NativeMethodAccessorImpl.invoke0(Native Method)
	at sun.reflect.NativeMethodAccessorImpl.invoke(NativeMethodAccessorImpl.java:62)
	at sun.reflect.DelegatingMethodAccessorImpl.invoke(DelegatingMethodAccessorImpl.java:43)
	at java.lang.reflect.Method.invoke(Method.java:483)
	at org.apache.hadoop.io.retry.RetryInvocationHandler.invokeMethod(RetryInvocationHandler.java:251)
	at org.apache.hadoop.io.retry.RetryInvocationHandler.invoke(RetryInvocationHandler.java:103)
	at com.sun.proxy.$Proxy23.createSnapshot(Unknown Source)
	at org.apache.hadoop.hdfs.DFSClient.createSnapshot(DFSClient.java:2071)
	at org.apache.hadoop.hdfs.DistributedFileSystem$35.doCall(DistributedFileSystem.java:1588)
	at org.apache.hadoop.hdfs.DistributedFileSystem$35.doCall(DistributedFileSystem.java:1585)
	at org.apache.hadoop.fs.FileSystemLinkResolver.resolve(FileSystemLinkResolver.java:81)
	at org.apache.hadoop.hdfs.DistributedFileSystem.createSnapshot(DistributedFileSystem.java:1603)
	at org.apache.hadoop.hdfs.server.namenode.snapshot.TestSnapshot.testSnapshottableDirectory(TestSnapshot.java:368)


FAILED:  org.apache.hadoop.hdfs.web.TestWebHDFSOAuth2.listStatusReturnsAsExpected

Error Message:
Unable to load OAuth2 connection factory.

Stack Trace:
java.io.IOException: Unable to load OAuth2 connection factory.
	at java.io.FileInputStream.open(Native Method)
	at java.io.FileInputStream.<init>(FileInputStream.java:131)
	at org.apache.hadoop.security.ssl.ReloadingX509TrustManager.loadTrustManager(ReloadingX509TrustManager.java:164)
	at org.apache.hadoop.security.ssl.ReloadingX509TrustManager.<init>(ReloadingX509TrustManager.java:81)
	at org.apache.hadoop.security.ssl.FileBasedKeyStoresFactory.init(FileBasedKeyStoresFactory.java:215)
	at org.apache.hadoop.security.ssl.SSLFactory.init(SSLFactory.java:131)
	at org.apache.hadoop.hdfs.web.URLConnectionFactory.newSslConnConfigurator(URLConnectionFactory.java:138)
	at org.apache.hadoop.hdfs.web.URLConnectionFactory.newOAuth2URLConnectionFactory(URLConnectionFactory.java:113)
	at org.apache.hadoop.hdfs.web.WebHdfsFileSystem.initialize(WebHdfsFileSystem.java:164)
	at org.apache.hadoop.hdfs.web.TestWebHDFSOAuth2.listStatusReturnsAsExpected(TestWebHDFSOAuth2.java:147)


FAILED:  org.apache.hadoop.hdfs.server.blockmanagement.TestBlockManager.testBlocksAreNotUnderreplicatedInSingleRack

Error Message:

BlockCollection$$EnhancerByMockitoWithCGLIB$$6d8c7526 cannot be returned by isRunning()
isRunning() should return boolean

Stack Trace:
org.mockito.exceptions.misusing.WrongTypeOfReturnValue: 
BlockCollection$$EnhancerByMockitoWithCGLIB$$6d8c7526 cannot be returned by isRunning()
isRunning() should return boolean
	at org.apache.hadoop.hdfs.server.blockmanagement.TestBlockManager.addBlockOnNodes(TestBlockManager.java:443)
	at org.apache.hadoop.hdfs.server.blockmanagement.TestBlockManager.doTestSingleRackClusterIsSufficientlyReplicated(TestBlockManager.java:376)
	at org.apache.hadoop.hdfs.server.blockmanagement.TestBlockManager.testBlocksAreNotUnderreplicatedInSingleRack(TestBlockManager.java:368)


FAILED:  org.apache.hadoop.hdfs.server.namenode.ha.TestSeveralNameNodes.testCircularLinkedListWrites

Error Message:
Some writers didn't complete in expected runtime! Current writer state:[Circular Writer:
  directory: /test-0
  target length: 50
  current item: 50
  done: false
] expected:<0> but was:<1>

Stack Trace:
java.lang.AssertionError: Some writers didn't complete in expected runtime! Current writer
state:[Circular Writer:
	 directory: /test-0
	 target length: 50
	 current item: 50
	 done: false
] expected:<0> but was:<1>
	at org.junit.Assert.fail(Assert.java:88)
	at org.junit.Assert.failNotEquals(Assert.java:743)
	at org.junit.Assert.assertEquals(Assert.java:118)
	at org.junit.Assert.assertEquals(Assert.java:555)
	at org.apache.hadoop.hdfs.server.namenode.ha.TestSeveralNameNodes.testCircularLinkedListWrites(TestSeveralNameNodes.java:90)



Mime
  • Unnamed multipart/mixed (inline, None, 0 bytes)
View raw message