hadoop-hdfs-dev mailing list archives

Site index · List index
Message view « Date » · « Thread »
Top « Date » · « Thread »
From Apache Jenkins Server <jenk...@builds.apache.org>
Subject Build failed in Jenkins: Hadoop-Hdfs-trunk #2408
Date Thu, 08 Oct 2015 07:44:11 GMT
See <https://builds.apache.org/job/Hadoop-Hdfs-trunk/2408/changes>

Changes:

[yliu] HDFS-9137. DeadLock between DataNode#refreshVolumes and

------------------------------------------
[...truncated 6361 lines...]
Running org.apache.hadoop.hdfs.server.namenode.ha.TestLossyRetryInvocationHandler
Tests run: 1, Failures: 0, Errors: 0, Skipped: 0, Time elapsed: 4.125 sec - in org.apache.hadoop.hdfs.server.namenode.ha.TestLossyRetryInvocationHandler
Running org.apache.hadoop.hdfs.server.namenode.ha.TestHAFsck
Tests run: 1, Failures: 0, Errors: 0, Skipped: 0, Time elapsed: 4.914 sec - in org.apache.hadoop.hdfs.server.namenode.ha.TestHAFsck
Running org.apache.hadoop.hdfs.server.namenode.ha.TestBootstrapStandby
Tests run: 5, Failures: 0, Errors: 0, Skipped: 0, Time elapsed: 9.929 sec - in org.apache.hadoop.hdfs.server.namenode.ha.TestBootstrapStandby
Running org.apache.hadoop.hdfs.server.namenode.ha.TestDNFencing
Tests run: 6, Failures: 0, Errors: 0, Skipped: 0, Time elapsed: 41.411 sec - in org.apache.hadoop.hdfs.server.namenode.ha.TestDNFencing
Running org.apache.hadoop.hdfs.server.namenode.ha.TestHAAppend
Tests run: 1, Failures: 0, Errors: 0, Skipped: 0, Time elapsed: 8.529 sec - in org.apache.hadoop.hdfs.server.namenode.ha.TestHAAppend
Running org.apache.hadoop.hdfs.server.namenode.ha.TestStandbyIsHot
Tests run: 2, Failures: 0, Errors: 0, Skipped: 0, Time elapsed: 17.58 sec - in org.apache.hadoop.hdfs.server.namenode.ha.TestStandbyIsHot
Running org.apache.hadoop.hdfs.server.namenode.ha.TestRetryCacheWithHA
Tests run: 22, Failures: 0, Errors: 0, Skipped: 0, Time elapsed: 94.976 sec - in org.apache.hadoop.hdfs.server.namenode.ha.TestRetryCacheWithHA
Running org.apache.hadoop.hdfs.server.namenode.ha.TestHAStateTransitions
Tests run: 11, Failures: 0, Errors: 0, Skipped: 0, Time elapsed: 64.705 sec - in org.apache.hadoop.hdfs.server.namenode.ha.TestHAStateTransitions
Running org.apache.hadoop.hdfs.server.namenode.ha.TestBootstrapStandbyWithQJM
Tests run: 5, Failures: 0, Errors: 0, Skipped: 0, Time elapsed: 16.426 sec - in org.apache.hadoop.hdfs.server.namenode.ha.TestBootstrapStandbyWithQJM
Running org.apache.hadoop.hdfs.server.namenode.ha.TestRemoteNameNodeInfo
Tests run: 1, Failures: 0, Errors: 0, Skipped: 0, Time elapsed: 0.845 sec - in org.apache.hadoop.hdfs.server.namenode.ha.TestRemoteNameNodeInfo
Running org.apache.hadoop.hdfs.server.namenode.ha.TestStandbyCheckpoints
Tests run: 7, Failures: 0, Errors: 0, Skipped: 0, Time elapsed: 170.926 sec - in org.apache.hadoop.hdfs.server.namenode.ha.TestStandbyCheckpoints
Running org.apache.hadoop.hdfs.server.namenode.ha.TestHAConfiguration
Tests run: 4, Failures: 0, Errors: 0, Skipped: 0, Time elapsed: 1.508 sec - in org.apache.hadoop.hdfs.server.namenode.ha.TestHAConfiguration
Running org.apache.hadoop.hdfs.server.namenode.ha.TestHAMetrics
Tests run: 1, Failures: 0, Errors: 0, Skipped: 0, Time elapsed: 8.034 sec - in org.apache.hadoop.hdfs.server.namenode.ha.TestHAMetrics
Running org.apache.hadoop.hdfs.server.namenode.ha.TestRequestHedgingProxyProvider
Tests run: 5, Failures: 0, Errors: 0, Skipped: 0, Time elapsed: 14.548 sec - in org.apache.hadoop.hdfs.server.namenode.ha.TestRequestHedgingProxyProvider
Running org.apache.hadoop.hdfs.server.namenode.ha.TestStateTransitionFailure
Tests run: 1, Failures: 0, Errors: 0, Skipped: 0, Time elapsed: 4.27 sec - in org.apache.hadoop.hdfs.server.namenode.ha.TestStateTransitionFailure
Running org.apache.hadoop.hdfs.server.namenode.ha.TestStandbyBlockManagement
Tests run: 1, Failures: 0, Errors: 0, Skipped: 0, Time elapsed: 7.641 sec - in org.apache.hadoop.hdfs.server.namenode.ha.TestStandbyBlockManagement
Running org.apache.hadoop.hdfs.server.namenode.ha.TestDelegationTokensWithHA
Tests run: 6, Failures: 0, Errors: 0, Skipped: 0, Time elapsed: 9.081 sec - in org.apache.hadoop.hdfs.server.namenode.ha.TestDelegationTokensWithHA
Running org.apache.hadoop.hdfs.server.namenode.ha.TestFailoverWithBlockTokensEnabled
Tests run: 4, Failures: 0, Errors: 0, Skipped: 0, Time elapsed: 19.379 sec - in org.apache.hadoop.hdfs.server.namenode.ha.TestFailoverWithBlockTokensEnabled
Running org.apache.hadoop.hdfs.server.namenode.ha.TestSeveralNameNodes
Tests run: 1, Failures: 0, Errors: 0, Skipped: 0, Time elapsed: 105.005 sec - in org.apache.hadoop.hdfs.server.namenode.ha.TestSeveralNameNodes
Running org.apache.hadoop.hdfs.server.namenode.ha.TestHarFileSystemWithHA
Tests run: 1, Failures: 0, Errors: 0, Skipped: 0, Time elapsed: 4.894 sec - in org.apache.hadoop.hdfs.server.namenode.ha.TestHarFileSystemWithHA
Running org.apache.hadoop.hdfs.server.namenode.ha.TestXAttrsWithHA
Tests run: 1, Failures: 0, Errors: 0, Skipped: 0, Time elapsed: 5.48 sec - in org.apache.hadoop.hdfs.server.namenode.ha.TestXAttrsWithHA
Running org.apache.hadoop.hdfs.server.namenode.ha.TestInitializeSharedEdits
Tests run: 4, Failures: 0, Errors: 0, Skipped: 0, Time elapsed: 11.718 sec - in org.apache.hadoop.hdfs.server.namenode.ha.TestInitializeSharedEdits
Running org.apache.hadoop.hdfs.server.namenode.TestDefaultBlockPlacementPolicy
Tests run: 4, Failures: 0, Errors: 0, Skipped: 0, Time elapsed: 9.866 sec - in org.apache.hadoop.hdfs.server.namenode.TestDefaultBlockPlacementPolicy
Running org.apache.hadoop.hdfs.server.namenode.TestDecommissioningStatus
Tests run: 3, Failures: 0, Errors: 0, Skipped: 0, Time elapsed: 13.336 sec - in org.apache.hadoop.hdfs.server.namenode.TestDecommissioningStatus
Running org.apache.hadoop.hdfs.server.namenode.TestINodeAttributeProvider
Tests run: 2, Failures: 0, Errors: 0, Skipped: 0, Time elapsed: 4.609 sec - in org.apache.hadoop.hdfs.server.namenode.TestINodeAttributeProvider
Running org.apache.hadoop.hdfs.server.namenode.metrics.TestNameNodeMetrics
Tests run: 13, Failures: 0, Errors: 0, Skipped: 0, Time elapsed: 113.051 sec - in org.apache.hadoop.hdfs.server.namenode.metrics.TestNameNodeMetrics
Running org.apache.hadoop.hdfs.server.namenode.metrics.TestNNMetricFilesInGetListingOps
Tests run: 1, Failures: 0, Errors: 0, Skipped: 0, Time elapsed: 7.806 sec - in org.apache.hadoop.hdfs.server.namenode.metrics.TestNNMetricFilesInGetListingOps
Running org.apache.hadoop.hdfs.server.namenode.TestDeadDatanode
Tests run: 2, Failures: 0, Errors: 0, Skipped: 0, Time elapsed: 33.586 sec - in org.apache.hadoop.hdfs.server.namenode.TestDeadDatanode
Running org.apache.hadoop.hdfs.server.namenode.TestNameNodeRespectsBindHostKeys
Tests run: 4, Failures: 0, Errors: 0, Skipped: 0, Time elapsed: 7.898 sec - in org.apache.hadoop.hdfs.server.namenode.TestNameNodeRespectsBindHostKeys
Running org.apache.hadoop.hdfs.server.namenode.startupprogress.TestStartupProgressMetrics
Tests run: 3, Failures: 0, Errors: 0, Skipped: 0, Time elapsed: 0.523 sec - in org.apache.hadoop.hdfs.server.namenode.startupprogress.TestStartupProgressMetrics
Running org.apache.hadoop.hdfs.server.namenode.startupprogress.TestStartupProgress
Tests run: 9, Failures: 0, Errors: 0, Skipped: 0, Time elapsed: 0.394 sec - in org.apache.hadoop.hdfs.server.namenode.startupprogress.TestStartupProgress
Running org.apache.hadoop.hdfs.server.namenode.TestNameNodeXAttr
Tests run: 13, Failures: 0, Errors: 0, Skipped: 0, Time elapsed: 12.055 sec - in org.apache.hadoop.hdfs.server.namenode.TestNameNodeXAttr
Running org.apache.hadoop.hdfs.server.namenode.TestXAttrConfigFlag
Tests run: 5, Failures: 0, Errors: 0, Skipped: 0, Time elapsed: 9.268 sec - in org.apache.hadoop.hdfs.server.namenode.TestXAttrConfigFlag
Running org.apache.hadoop.hdfs.server.namenode.TestNameNodeRecovery
Tests run: 11, Failures: 0, Errors: 0, Skipped: 0, Time elapsed: 16.936 sec - in org.apache.hadoop.hdfs.server.namenode.TestNameNodeRecovery
Running org.apache.hadoop.hdfs.server.namenode.TestBlockUnderConstruction
Tests run: 2, Failures: 0, Errors: 0, Skipped: 0, Time elapsed: 4.867 sec - in org.apache.hadoop.hdfs.server.namenode.TestBlockUnderConstruction
Running org.apache.hadoop.hdfs.server.namenode.TestDeleteRace
Tests run: 5, Failures: 0, Errors: 0, Skipped: 0, Time elapsed: 59.085 sec - in org.apache.hadoop.hdfs.server.namenode.TestDeleteRace
Running org.apache.hadoop.hdfs.server.namenode.TestNameEditsConfigs
Tests run: 4, Failures: 0, Errors: 0, Skipped: 0, Time elapsed: 17.469 sec - in org.apache.hadoop.hdfs.server.namenode.TestNameEditsConfigs
Running org.apache.hadoop.hdfs.server.namenode.TestEditLogFileInputStream
Tests run: 2, Failures: 0, Errors: 0, Skipped: 0, Time elapsed: 1.2 sec - in org.apache.hadoop.hdfs.server.namenode.TestEditLogFileInputStream
Running org.apache.hadoop.hdfs.server.namenode.TestNameNodeOptionParsing
Tests run: 2, Failures: 0, Errors: 0, Skipped: 0, Time elapsed: 0.326 sec - in org.apache.hadoop.hdfs.server.namenode.TestNameNodeOptionParsing
Running org.apache.hadoop.hdfs.server.namenode.TestEditsDoubleBuffer
Tests run: 2, Failures: 0, Errors: 0, Skipped: 0, Time elapsed: 0.218 sec - in org.apache.hadoop.hdfs.server.namenode.TestEditsDoubleBuffer
Running org.apache.hadoop.hdfs.server.namenode.TestPathComponents
Tests run: 1, Failures: 0, Errors: 0, Skipped: 0, Time elapsed: 0.248 sec - in org.apache.hadoop.hdfs.server.namenode.TestPathComponents
Running org.apache.hadoop.hdfs.server.namenode.TestNameNodeResourcePolicy
Tests run: 5, Failures: 0, Errors: 0, Skipped: 0, Time elapsed: 0.35 sec - in org.apache.hadoop.hdfs.server.namenode.TestNameNodeResourcePolicy
Running org.apache.hadoop.hdfs.server.namenode.TestFSImageWithXAttr
Tests run: 2, Failures: 0, Errors: 0, Skipped: 0, Time elapsed: 39.84 sec - in org.apache.hadoop.hdfs.server.namenode.TestFSImageWithXAttr
Running org.apache.hadoop.hdfs.server.namenode.TestAclConfigFlag
Tests run: 8, Failures: 0, Errors: 0, Skipped: 0, Time elapsed: 11.374 sec - in org.apache.hadoop.hdfs.server.namenode.TestAclConfigFlag
Running org.apache.hadoop.hdfs.server.namenode.TestHDFSConcat
Tests run: 6, Failures: 0, Errors: 0, Skipped: 0, Time elapsed: 16.66 sec - in org.apache.hadoop.hdfs.server.namenode.TestHDFSConcat
Running org.apache.hadoop.hdfs.server.namenode.TestQuotaByStorageType
Tests run: 20, Failures: 0, Errors: 0, Skipped: 0, Time elapsed: 36.729 sec - in org.apache.hadoop.hdfs.server.namenode.TestQuotaByStorageType
Running org.apache.hadoop.hdfs.server.namenode.TestNNStorageRetentionFunctional
Tests run: 1, Failures: 0, Errors: 0, Skipped: 0, Time elapsed: 3.618 sec - in org.apache.hadoop.hdfs.server.namenode.TestNNStorageRetentionFunctional
Running org.apache.hadoop.hdfs.server.namenode.TestAclTransformation
Tests run: 55, Failures: 0, Errors: 0, Skipped: 0, Time elapsed: 0.459 sec - in org.apache.hadoop.hdfs.server.namenode.TestAclTransformation
Running org.apache.hadoop.hdfs.server.namenode.TestMetadataVersionOutput
Tests run: 1, Failures: 0, Errors: 0, Skipped: 0, Time elapsed: 6.13 sec - in org.apache.hadoop.hdfs.server.namenode.TestMetadataVersionOutput
Running org.apache.hadoop.hdfs.server.namenode.TestNNStorageRetentionManager
Tests run: 9, Failures: 0, Errors: 0, Skipped: 0, Time elapsed: 1.37 sec - in org.apache.hadoop.hdfs.server.namenode.TestNNStorageRetentionManager
Running org.apache.hadoop.hdfs.server.namenode.TestStripedINodeFile
Tests run: 10, Failures: 0, Errors: 0, Skipped: 0, Time elapsed: 6.327 sec - in org.apache.hadoop.hdfs.server.namenode.TestStripedINodeFile
Running org.apache.hadoop.hdfs.server.namenode.TestFSEditLogLoader
Tests run: 11, Failures: 0, Errors: 0, Skipped: 0, Time elapsed: 37.724 sec - in org.apache.hadoop.hdfs.server.namenode.TestFSEditLogLoader
Running org.apache.hadoop.hdfs.server.namenode.TestDiskspaceQuotaUpdate
Tests run: 7, Failures: 0, Errors: 0, Skipped: 0, Time elapsed: 46.228 sec - in org.apache.hadoop.hdfs.server.namenode.TestDiskspaceQuotaUpdate
Running org.apache.hadoop.hdfs.server.namenode.TestSecondaryNameNodeUpgrade
Tests run: 3, Failures: 0, Errors: 0, Skipped: 0, Time elapsed: 7.083 sec - in org.apache.hadoop.hdfs.server.namenode.TestSecondaryNameNodeUpgrade
Running org.apache.hadoop.hdfs.server.namenode.TestNamenodeRetryCache
Tests run: 11, Failures: 0, Errors: 0, Skipped: 0, Time elapsed: 23.762 sec - in org.apache.hadoop.hdfs.server.namenode.TestNamenodeRetryCache
Running org.apache.hadoop.hdfs.server.namenode.TestAllowFormat
Tests run: 2, Failures: 0, Errors: 0, Skipped: 0, Time elapsed: 4.161 sec - in org.apache.hadoop.hdfs.server.namenode.TestAllowFormat
Running org.apache.hadoop.hdfs.server.namenode.TestNamenodeCapacityReport
Tests run: 2, Failures: 0, Errors: 0, Skipped: 0, Time elapsed: 15.31 sec - in org.apache.hadoop.hdfs.server.namenode.TestNamenodeCapacityReport
Running org.apache.hadoop.hdfs.server.namenode.TestNameNodeRpcServer
Tests run: 1, Failures: 0, Errors: 0, Skipped: 0, Time elapsed: 3.972 sec - in org.apache.hadoop.hdfs.server.namenode.TestNameNodeRpcServer
Running org.apache.hadoop.hdfs.server.namenode.TestFavoredNodesEndToEnd
Tests run: 4, Failures: 0, Errors: 0, Skipped: 0, Time elapsed: 7.368 sec - in org.apache.hadoop.hdfs.server.namenode.TestFavoredNodesEndToEnd
Running org.apache.hadoop.hdfs.server.namenode.TestSecureNameNode
Tests run: 2, Failures: 0, Errors: 0, Skipped: 0, Time elapsed: 9.233 sec - in org.apache.hadoop.hdfs.server.namenode.TestSecureNameNode
Running org.apache.hadoop.hdfs.server.namenode.TestEditLogAutoroll
Tests run: 1, Failures: 0, Errors: 0, Skipped: 0, Time elapsed: 5.48 sec - in org.apache.hadoop.hdfs.server.namenode.TestEditLogAutoroll
Running org.apache.hadoop.hdfs.server.namenode.TestAddStripedBlocks
Tests run: 5, Failures: 0, Errors: 0, Skipped: 0, Time elapsed: 41.084 sec - in org.apache.hadoop.hdfs.server.namenode.TestAddStripedBlocks
Running org.apache.hadoop.hdfs.server.namenode.TestClusterId
Tests run: 13, Failures: 0, Errors: 0, Skipped: 0, Time elapsed: 2.474 sec - in org.apache.hadoop.hdfs.server.namenode.TestClusterId
Running org.apache.hadoop.hdfs.server.namenode.TestStartupOptionUpgrade
Tests run: 10, Failures: 0, Errors: 0, Skipped: 0, Time elapsed: 1.195 sec - in org.apache.hadoop.hdfs.server.namenode.TestStartupOptionUpgrade
Running org.apache.hadoop.hdfs.server.namenode.TestLargeDirectoryDelete
Tests run: 1, Failures: 0, Errors: 0, Skipped: 0, Time elapsed: 44.997 sec - in org.apache.hadoop.hdfs.server.namenode.TestLargeDirectoryDelete
Running org.apache.hadoop.hdfs.server.namenode.TestFSImageWithAcl
Tests run: 4, Failures: 0, Errors: 0, Skipped: 0, Time elapsed: 64.818 sec - in org.apache.hadoop.hdfs.server.namenode.TestFSImageWithAcl
Running org.apache.hadoop.hdfs.server.namenode.TestNameNodeHttpServer
Tests run: 3, Failures: 0, Errors: 0, Skipped: 0, Time elapsed: 2.45 sec - in org.apache.hadoop.hdfs.server.namenode.TestNameNodeHttpServer
Running org.apache.hadoop.hdfs.server.namenode.TestEditLog
Tests run: 24, Failures: 0, Errors: 0, Skipped: 0, Time elapsed: 67.074 sec - in org.apache.hadoop.hdfs.server.namenode.TestEditLog
Running org.apache.hadoop.hdfs.server.namenode.TestStorageRestore
Tests run: 4, Failures: 0, Errors: 0, Skipped: 0, Time elapsed: 14.407 sec - in org.apache.hadoop.hdfs.server.namenode.TestStorageRestore
Running org.apache.hadoop.hdfs.server.namenode.TestProcessCorruptBlocks
Tests run: 4, Failures: 0, Errors: 0, Skipped: 0, Time elapsed: 23.336 sec - in org.apache.hadoop.hdfs.server.namenode.TestProcessCorruptBlocks
Running org.apache.hadoop.hdfs.server.namenode.TestNameNodeResourceChecker
Tests run: 6, Failures: 0, Errors: 0, Skipped: 0, Time elapsed: 5.427 sec - in org.apache.hadoop.hdfs.server.namenode.TestNameNodeResourceChecker
Running org.apache.hadoop.hdfs.server.namenode.TestListCorruptFileBlocks
Tests run: 5, Failures: 0, Errors: 0, Skipped: 0, Time elapsed: 35.38 sec - in org.apache.hadoop.hdfs.server.namenode.TestListCorruptFileBlocks
Running org.apache.hadoop.hdfs.server.namenode.TestBlockPlacementPolicyRackFaultTolerant
Tests run: 1, Failures: 0, Errors: 0, Skipped: 0, Time elapsed: 8.673 sec - in org.apache.hadoop.hdfs.server.namenode.TestBlockPlacementPolicyRackFaultTolerant
Running org.apache.hadoop.hdfs.server.balancer.TestBalancerWithEncryptedTransfer
Tests run: 3, Failures: 0, Errors: 0, Skipped: 0, Time elapsed: 28.495 sec - in org.apache.hadoop.hdfs.server.balancer.TestBalancerWithEncryptedTransfer
Running org.apache.hadoop.hdfs.server.balancer.TestBalancerWithMultipleNameNodes
Tests run: 4, Failures: 0, Errors: 0, Skipped: 0, Time elapsed: 53.591 sec - in org.apache.hadoop.hdfs.server.balancer.TestBalancerWithMultipleNameNodes
Running org.apache.hadoop.hdfs.server.balancer.TestBalancerWithSaslDataTransfer
Tests run: 3, Failures: 0, Errors: 0, Skipped: 0, Time elapsed: 44.672 sec - in org.apache.hadoop.hdfs.server.balancer.TestBalancerWithSaslDataTransfer
Running org.apache.hadoop.hdfs.server.balancer.TestBalancer

Results :

Tests in error: 
  TestFileLimit.testFileLimitSimulated:162->testFileLimit:79 » NoClassDefFound o...
  TestFileLimit.testFileLimit:79 » NoClassDefFound Could not initialize class or...
  TestFileLimit.testMinBlockSizeLimit:201 » NoClassDefFound Could not initialize...
  TestFileLimit.testMaxBlocksPerFileLimit:174 » NoClassDefFound Could not initia...
  TestSaveNamespace.testSaveNamespaceWithDanglingLease:624 » NoClassDefFound org...

Tests run: 2901, Failures: 0, Errors: 4, Skipped: 13

[INFO]                                                                         
[INFO] ------------------------------------------------------------------------
[INFO] Skipping Apache Hadoop HDFS Native Client
[INFO] This project has been banned from the build due to previous failures.
[INFO] ------------------------------------------------------------------------
[INFO]                                                                         
[INFO] ------------------------------------------------------------------------
[INFO] Skipping Apache Hadoop HttpFS
[INFO] This project has been banned from the build due to previous failures.
[INFO] ------------------------------------------------------------------------
[INFO]                                                                         
[INFO] ------------------------------------------------------------------------
[INFO] Skipping Apache Hadoop HDFS BookKeeper Journal
[INFO] This project has been banned from the build due to previous failures.
[INFO] ------------------------------------------------------------------------
[INFO]                                                                         
[INFO] ------------------------------------------------------------------------
[INFO] Skipping Apache Hadoop HDFS-NFS
[INFO] This project has been banned from the build due to previous failures.
[INFO] ------------------------------------------------------------------------
[INFO]                                                                         
[INFO] ------------------------------------------------------------------------
[INFO] Building Apache Hadoop HDFS Project 3.0.0-SNAPSHOT
[INFO] ------------------------------------------------------------------------
[INFO] 
[INFO] --- maven-clean-plugin:2.5:clean (default-clean) @ hadoop-hdfs-project ---
[INFO] Deleting <https://builds.apache.org/job/Hadoop-Hdfs-trunk/ws/hadoop-hdfs-project/target>
[INFO] 
[INFO] --- maven-antrun-plugin:1.7:run (create-testdirs) @ hadoop-hdfs-project ---
[INFO] Executing tasks

main:
    [mkdir] Created dir: <https://builds.apache.org/job/Hadoop-Hdfs-trunk/ws/hadoop-hdfs-project/target/test-dir>
[INFO] Executed tasks
[INFO] 
[INFO] --- maven-source-plugin:2.3:jar-no-fork (hadoop-java-sources) @ hadoop-hdfs-project
---
[INFO] 
[INFO] --- maven-source-plugin:2.3:test-jar-no-fork (hadoop-java-sources) @ hadoop-hdfs-project
---
[INFO] 
[INFO] --- maven-enforcer-plugin:1.3.1:enforce (dist-enforce) @ hadoop-hdfs-project ---
[INFO] 
[INFO] --- maven-site-plugin:3.4:attach-descriptor (attach-descriptor) @ hadoop-hdfs-project
---
[INFO] 
[INFO] --- maven-javadoc-plugin:2.8.1:jar (module-javadocs) @ hadoop-hdfs-project ---
[INFO] Skipping javadoc generation
[INFO] 
[INFO] --- maven-enforcer-plugin:1.3.1:enforce (depcheck) @ hadoop-hdfs-project ---
[INFO] 
[INFO] --- maven-checkstyle-plugin:2.15:checkstyle (default-cli) @ hadoop-hdfs-project ---
[INFO] 
[INFO] --- findbugs-maven-plugin:3.0.0:findbugs (default-cli) @ hadoop-hdfs-project ---
[INFO] ------------------------------------------------------------------------
[INFO] Reactor Summary:
[INFO] 
[INFO] Apache Hadoop HDFS Client ......................... SUCCESS [03:33 min]
[INFO] Apache Hadoop HDFS ................................ FAILURE [  02:02 h]
[INFO] Apache Hadoop HDFS Native Client .................. SKIPPED
[INFO] Apache Hadoop HttpFS .............................. SKIPPED
[INFO] Apache Hadoop HDFS BookKeeper Journal ............. SKIPPED
[INFO] Apache Hadoop HDFS-NFS ............................ SKIPPED
[INFO] Apache Hadoop HDFS Project ........................ SUCCESS [  0.062 s]
[INFO] ------------------------------------------------------------------------
[INFO] BUILD FAILURE
[INFO] ------------------------------------------------------------------------
[INFO] Total time: 02:06 h
[INFO] Finished at: 2015-10-08T07:44:38+00:00
[INFO] Final Memory: 75M/967M
[INFO] ------------------------------------------------------------------------
[ERROR] Failed to execute goal org.apache.maven.plugins:maven-surefire-plugin:2.17:test (default-test)
on project hadoop-hdfs: ExecutionException: java.lang.RuntimeException: The forked VM terminated
without properly saying goodbye. VM crash or System.exit called?
[ERROR] Command was /bin/sh -c cd <https://builds.apache.org/job/Hadoop-Hdfs-trunk/ws/hadoop-hdfs-project/hadoop-hdfs>
&& /home/jenkins/tools/java/jdk1.7.0_55/jre/bin/java -Xmx2048m -XX:MaxPermSize=768m
-XX:+HeapDumpOnOutOfMemoryError -jar <https://builds.apache.org/job/Hadoop-Hdfs-trunk/ws/hadoop-hdfs-project/hadoop-hdfs/target/surefire/surefirebooter7394440030430767850.jar>
<https://builds.apache.org/job/Hadoop-Hdfs-trunk/ws/hadoop-hdfs-project/hadoop-hdfs/target/surefire/surefire6966872138011137667tmp>
<https://builds.apache.org/job/Hadoop-Hdfs-trunk/ws/hadoop-hdfs-project/hadoop-hdfs/target/surefire/surefire_2212846035686301584792tmp>
[ERROR] -> [Help 1]
[ERROR] 
[ERROR] To see the full stack trace of the errors, re-run Maven with the -e switch.
[ERROR] Re-run Maven using the -X switch to enable full debug logging.
[ERROR] 
[ERROR] For more information about the errors and possible solutions, please read the following
articles:
[ERROR] [Help 1] http://cwiki.apache.org/confluence/display/MAVEN/MojoFailureException
[ERROR] 
[ERROR] After correcting the problems, you can resume the build with the command
[ERROR]   mvn <goals> -rf :hadoop-hdfs
Build step 'Execute shell' marked build as failure
Archiving artifacts
Recording test results
Updating HDFS-9137

Mime
View raw message