hadoop-hdfs-dev mailing list archives

Site index · List index
Message view « Date » · « Thread »
Top « Date » · « Thread »
From Apache Jenkins Server <jenk...@builds.apache.org>
Subject Build failed in Jenkins: Hadoop-Hdfs-trunk #2392
Date Sun, 04 Oct 2015 01:21:56 GMT
See <https://builds.apache.org/job/Hadoop-Hdfs-trunk/2392/changes>

Changes:

[wheat9] HDFS-9193. Fix incorrect references the usages of the DN in

------------------------------------------
[...truncated 7685 lines...]
Tests run: 13, Failures: 0, Errors: 0, Skipped: 0, Time elapsed: 107.903 sec - in org.apache.hadoop.hdfs.server.namenode.TestCacheDirectives
Running org.apache.hadoop.hdfs.server.namenode.TestGetImageServlet
Tests run: 1, Failures: 0, Errors: 0, Skipped: 0, Time elapsed: 1.673 sec - in org.apache.hadoop.hdfs.server.namenode.TestGetImageServlet
Running org.apache.hadoop.hdfs.server.namenode.snapshot.TestRenameWithSnapshots
Tests run: 36, Failures: 0, Errors: 0, Skipped: 0, Time elapsed: 162.569 sec - in org.apache.hadoop.hdfs.server.namenode.snapshot.TestRenameWithSnapshots
Running org.apache.hadoop.hdfs.server.namenode.snapshot.TestSnapshotNameWithInvalidCharacters
Tests run: 2, Failures: 0, Errors: 0, Skipped: 0, Time elapsed: 7.217 sec - in org.apache.hadoop.hdfs.server.namenode.snapshot.TestSnapshotNameWithInvalidCharacters
Running org.apache.hadoop.hdfs.server.namenode.snapshot.TestFileWithSnapshotFeature
Tests run: 1, Failures: 0, Errors: 0, Skipped: 0, Time elapsed: 0.671 sec - in org.apache.hadoop.hdfs.server.namenode.snapshot.TestFileWithSnapshotFeature
Running org.apache.hadoop.hdfs.server.namenode.snapshot.TestSnapshotBlocksMap
Tests run: 7, Failures: 0, Errors: 0, Skipped: 0, Time elapsed: 28.151 sec - in org.apache.hadoop.hdfs.server.namenode.snapshot.TestSnapshotBlocksMap
Running org.apache.hadoop.hdfs.server.namenode.snapshot.TestSnapshotManager
Tests run: 1, Failures: 0, Errors: 0, Skipped: 0, Time elapsed: 0.677 sec - in org.apache.hadoop.hdfs.server.namenode.snapshot.TestSnapshotManager
Running org.apache.hadoop.hdfs.server.namenode.snapshot.TestOpenFilesWithSnapshot
Tests run: 7, Failures: 0, Errors: 0, Skipped: 0, Time elapsed: 56.781 sec - in org.apache.hadoop.hdfs.server.namenode.snapshot.TestOpenFilesWithSnapshot
Running org.apache.hadoop.hdfs.server.namenode.snapshot.TestNestedSnapshots
Tests run: 5, Failures: 0, Errors: 0, Skipped: 0, Time elapsed: 53.755 sec - in org.apache.hadoop.hdfs.server.namenode.snapshot.TestNestedSnapshots
Running org.apache.hadoop.hdfs.server.namenode.snapshot.TestINodeFileUnderConstructionWithSnapshot
Tests run: 4, Failures: 0, Errors: 0, Skipped: 0, Time elapsed: 13.921 sec - in org.apache.hadoop.hdfs.server.namenode.snapshot.TestINodeFileUnderConstructionWithSnapshot
Running org.apache.hadoop.hdfs.server.namenode.snapshot.TestSnapshotMetrics
Tests run: 2, Failures: 0, Errors: 0, Skipped: 0, Time elapsed: 9.274 sec - in org.apache.hadoop.hdfs.server.namenode.snapshot.TestSnapshotMetrics
Running org.apache.hadoop.hdfs.server.namenode.snapshot.TestAclWithSnapshot
Tests run: 16, Failures: 0, Errors: 0, Skipped: 0, Time elapsed: 14.526 sec - in org.apache.hadoop.hdfs.server.namenode.snapshot.TestAclWithSnapshot
Running org.apache.hadoop.hdfs.server.namenode.snapshot.TestFileContextSnapshot
Tests run: 2, Failures: 0, Errors: 0, Skipped: 0, Time elapsed: 8.381 sec - in org.apache.hadoop.hdfs.server.namenode.snapshot.TestFileContextSnapshot
Running org.apache.hadoop.hdfs.server.namenode.snapshot.TestSnapshotStatsMXBean
Tests run: 1, Failures: 0, Errors: 0, Skipped: 0, Time elapsed: 5.001 sec - in org.apache.hadoop.hdfs.server.namenode.snapshot.TestSnapshotStatsMXBean
Running org.apache.hadoop.hdfs.server.namenode.snapshot.TestSnapshotListing
Tests run: 1, Failures: 0, Errors: 0, Skipped: 0, Time elapsed: 5.864 sec - in org.apache.hadoop.hdfs.server.namenode.snapshot.TestSnapshotListing
Running org.apache.hadoop.hdfs.server.namenode.snapshot.TestCheckpointsWithSnapshots
Tests run: 1, Failures: 0, Errors: 0, Skipped: 0, Time elapsed: 6.892 sec - in org.apache.hadoop.hdfs.server.namenode.snapshot.TestCheckpointsWithSnapshots
Running org.apache.hadoop.hdfs.server.namenode.snapshot.TestDisallowModifyROSnapshot
Tests run: 11, Failures: 0, Errors: 0, Skipped: 0, Time elapsed: 5.13 sec - in org.apache.hadoop.hdfs.server.namenode.snapshot.TestDisallowModifyROSnapshot
Running org.apache.hadoop.hdfs.server.namenode.snapshot.TestSnapshot
Tests run: 6, Failures: 0, Errors: 0, Skipped: 0, Time elapsed: 93.637 sec - in org.apache.hadoop.hdfs.server.namenode.snapshot.TestSnapshot
Running org.apache.hadoop.hdfs.server.namenode.snapshot.TestSnapshotReplication
Tests run: 3, Failures: 0, Errors: 0, Skipped: 0, Time elapsed: 12.021 sec - in org.apache.hadoop.hdfs.server.namenode.snapshot.TestSnapshotReplication
Running org.apache.hadoop.hdfs.server.namenode.snapshot.TestSnapshottableDirListing
Tests run: 2, Failures: 0, Errors: 0, Skipped: 0, Time elapsed: 8.449 sec - in org.apache.hadoop.hdfs.server.namenode.snapshot.TestSnapshottableDirListing
Running org.apache.hadoop.hdfs.server.namenode.snapshot.TestGetContentSummaryWithSnapshot
Tests run: 1, Failures: 0, Errors: 0, Skipped: 0, Time elapsed: 6.094 sec - in org.apache.hadoop.hdfs.server.namenode.snapshot.TestGetContentSummaryWithSnapshot
Running org.apache.hadoop.hdfs.server.namenode.snapshot.TestXAttrWithSnapshot
Tests run: 8, Failures: 0, Errors: 0, Skipped: 0, Time elapsed: 9.55 sec - in org.apache.hadoop.hdfs.server.namenode.snapshot.TestXAttrWithSnapshot
Running org.apache.hadoop.hdfs.server.namenode.snapshot.TestSnapshotRename
Tests run: 6, Failures: 0, Errors: 0, Skipped: 0, Time elapsed: 17.315 sec - in org.apache.hadoop.hdfs.server.namenode.snapshot.TestSnapshotRename
Running org.apache.hadoop.hdfs.server.namenode.snapshot.TestUpdatePipelineWithSnapshots
Tests run: 1, Failures: 0, Errors: 0, Skipped: 0, Time elapsed: 10.466 sec - in org.apache.hadoop.hdfs.server.namenode.snapshot.TestUpdatePipelineWithSnapshots
Running org.apache.hadoop.hdfs.server.namenode.snapshot.TestSetQuotaWithSnapshot
Tests run: 2, Failures: 0, Errors: 0, Skipped: 0, Time elapsed: 8.383 sec - in org.apache.hadoop.hdfs.server.namenode.snapshot.TestSetQuotaWithSnapshot
Running org.apache.hadoop.hdfs.server.namenode.snapshot.TestSnapshotDiffReport
Tests run: 8, Failures: 0, Errors: 0, Skipped: 0, Time elapsed: 21.682 sec - in org.apache.hadoop.hdfs.server.namenode.snapshot.TestSnapshotDiffReport
Running org.apache.hadoop.hdfs.server.namenode.snapshot.TestSnapshotFileLength
Tests run: 2, Failures: 0, Errors: 0, Skipped: 0, Time elapsed: 7.797 sec - in org.apache.hadoop.hdfs.server.namenode.snapshot.TestSnapshotFileLength
Running org.apache.hadoop.hdfs.server.namenode.snapshot.TestSnapshotDeletion
Tests run: 17, Failures: 0, Errors: 0, Skipped: 0, Time elapsed: 71.423 sec - in org.apache.hadoop.hdfs.server.namenode.snapshot.TestSnapshotDeletion
Running org.apache.hadoop.hdfs.server.namenode.TestFavoredNodesEndToEnd
Tests run: 4, Failures: 0, Errors: 0, Skipped: 0, Time elapsed: 8.83 sec - in org.apache.hadoop.hdfs.server.namenode.TestFavoredNodesEndToEnd
Running org.apache.hadoop.hdfs.server.namenode.TestFSEditLogLoader
Tests run: 11, Failures: 0, Errors: 0, Skipped: 0, Time elapsed: 41.029 sec - in org.apache.hadoop.hdfs.server.namenode.TestFSEditLogLoader
Running org.apache.hadoop.hdfs.server.namenode.TestNameNodeAcl
Tests run: 64, Failures: 0, Errors: 0, Skipped: 0, Time elapsed: 25.422 sec - in org.apache.hadoop.hdfs.server.namenode.TestNameNodeAcl
Running org.apache.hadoop.hdfs.server.namenode.TestFSImageStorageInspector
Tests run: 1, Failures: 0, Errors: 0, Skipped: 0, Time elapsed: 0.499 sec - in org.apache.hadoop.hdfs.server.namenode.TestFSImageStorageInspector
Running org.apache.hadoop.hdfs.server.namenode.TestStoragePolicySummary
Tests run: 5, Failures: 0, Errors: 0, Skipped: 0, Time elapsed: 0.239 sec - in org.apache.hadoop.hdfs.server.namenode.TestStoragePolicySummary
Running org.apache.hadoop.hdfs.server.namenode.TestRecoverStripedBlocks
Tests run: 3, Failures: 0, Errors: 0, Skipped: 0, Time elapsed: 15.919 sec - in org.apache.hadoop.hdfs.server.namenode.TestRecoverStripedBlocks
Running org.apache.hadoop.hdfs.server.namenode.TestNameEditsConfigs
Tests run: 4, Failures: 0, Errors: 0, Skipped: 0, Time elapsed: 26.487 sec - in org.apache.hadoop.hdfs.server.namenode.TestNameEditsConfigs
Running org.apache.hadoop.hdfs.server.namenode.TestCommitBlockSynchronization
Tests run: 5, Failures: 0, Errors: 0, Skipped: 0, Time elapsed: 2.534 sec - in org.apache.hadoop.hdfs.server.namenode.TestCommitBlockSynchronization
Running org.apache.hadoop.hdfs.server.namenode.TestMetadataVersionOutput
Tests run: 1, Failures: 0, Errors: 0, Skipped: 0, Time elapsed: 7.02 sec - in org.apache.hadoop.hdfs.server.namenode.TestMetadataVersionOutput
Running org.apache.hadoop.hdfs.server.namenode.TestAddBlockRetry
Tests run: 2, Failures: 0, Errors: 0, Skipped: 0, Time elapsed: 12.379 sec - in org.apache.hadoop.hdfs.server.namenode.TestAddBlockRetry
Running org.apache.hadoop.hdfs.server.namenode.metrics.TestNameNodeMetrics
Tests run: 13, Failures: 0, Errors: 0, Skipped: 0, Time elapsed: 133.427 sec - in org.apache.hadoop.hdfs.server.namenode.metrics.TestNameNodeMetrics
Running org.apache.hadoop.hdfs.server.namenode.metrics.TestNNMetricFilesInGetListingOps
Tests run: 1, Failures: 0, Errors: 0, Skipped: 0, Time elapsed: 8.834 sec - in org.apache.hadoop.hdfs.server.namenode.metrics.TestNNMetricFilesInGetListingOps
Running org.apache.hadoop.hdfs.server.namenode.TestFSImage
Tests run: 12, Failures: 0, Errors: 0, Skipped: 0, Time elapsed: 62.142 sec - in org.apache.hadoop.hdfs.server.namenode.TestFSImage
Running org.apache.hadoop.hdfs.server.namenode.TestMalformedURLs
Tests run: 1, Failures: 0, Errors: 0, Skipped: 0, Time elapsed: 5.007 sec - in org.apache.hadoop.hdfs.server.namenode.TestMalformedURLs
Running org.apache.hadoop.hdfs.server.namenode.TestDefaultBlockPlacementPolicy
Tests run: 4, Failures: 0, Errors: 0, Skipped: 0, Time elapsed: 14.155 sec - in org.apache.hadoop.hdfs.server.namenode.TestDefaultBlockPlacementPolicy
Running org.apache.hadoop.hdfs.server.namenode.TestFSPermissionChecker
Tests run: 15, Failures: 0, Errors: 0, Skipped: 0, Time elapsed: 2.191 sec - in org.apache.hadoop.hdfs.server.namenode.TestFSPermissionChecker
Running org.apache.hadoop.hdfs.server.namenode.TestNameNodeMXBean
Tests run: 6, Failures: 0, Errors: 0, Skipped: 0, Time elapsed: 21.922 sec - in org.apache.hadoop.hdfs.server.namenode.TestNameNodeMXBean
Running org.apache.hadoop.hdfs.server.namenode.TestXAttrConfigFlag
Tests run: 5, Failures: 0, Errors: 0, Skipped: 0, Time elapsed: 13.955 sec - in org.apache.hadoop.hdfs.server.namenode.TestXAttrConfigFlag
Running org.apache.hadoop.hdfs.server.namenode.TestEditLog
Tests run: 24, Failures: 0, Errors: 0, Skipped: 0, Time elapsed: 88.477 sec - in org.apache.hadoop.hdfs.server.namenode.TestEditLog
Running org.apache.hadoop.hdfs.server.namenode.TestINodeAttributeProvider
Tests run: 2, Failures: 0, Errors: 0, Skipped: 0, Time elapsed: 6.545 sec - in org.apache.hadoop.hdfs.server.namenode.TestINodeAttributeProvider
Running org.apache.hadoop.hdfs.server.namenode.TestNNThroughputBenchmark
Tests run: 1, Failures: 0, Errors: 0, Skipped: 0, Time elapsed: 6.937 sec - in org.apache.hadoop.hdfs.server.namenode.TestNNThroughputBenchmark
Running org.apache.hadoop.hdfs.server.namenode.TestINodeFile
Tests run: 26, Failures: 0, Errors: 0, Skipped: 0, Time elapsed: 48.725 sec - in org.apache.hadoop.hdfs.server.namenode.TestINodeFile
Running org.apache.hadoop.hdfs.server.namenode.TestNameCache
Tests run: 1, Failures: 0, Errors: 0, Skipped: 0, Time elapsed: 0.212 sec - in org.apache.hadoop.hdfs.server.namenode.TestNameCache
Running org.apache.hadoop.hdfs.server.namenode.TestFileContextAcl
Tests run: 64, Failures: 0, Errors: 0, Skipped: 0, Time elapsed: 25.967 sec - in org.apache.hadoop.hdfs.server.namenode.TestFileContextAcl
Running org.apache.hadoop.hdfs.server.namenode.TestFSNamesystem
Tests run: 10, Failures: 0, Errors: 0, Skipped: 0, Time elapsed: 3.342 sec - in org.apache.hadoop.hdfs.server.namenode.TestFSNamesystem
Running org.apache.hadoop.hdfs.server.namenode.TestHostsFiles
Tests run: 2, Failures: 0, Errors: 0, Skipped: 0, Time elapsed: 15.383 sec - in org.apache.hadoop.hdfs.server.namenode.TestHostsFiles
Running org.apache.hadoop.hdfs.server.namenode.TestNNStorageRetentionManager
Tests run: 9, Failures: 0, Errors: 0, Skipped: 0, Time elapsed: 1.436 sec - in org.apache.hadoop.hdfs.server.namenode.TestNNStorageRetentionManager
Running org.apache.hadoop.hdfs.server.namenode.TestAllowFormat
Tests run: 2, Failures: 0, Errors: 0, Skipped: 0, Time elapsed: 5.308 sec - in org.apache.hadoop.hdfs.server.namenode.TestAllowFormat
Running org.apache.hadoop.hdfs.server.namenode.TestNameNodeRespectsBindHostKeys
Tests run: 4, Failures: 0, Errors: 0, Skipped: 0, Time elapsed: 10.99 sec - in org.apache.hadoop.hdfs.server.namenode.TestNameNodeRespectsBindHostKeys
Running org.apache.hadoop.hdfs.server.namenode.TestSecureNameNodeWithExternalKdc
Tests run: 1, Failures: 0, Errors: 0, Skipped: 1, Time elapsed: 0.116 sec - in org.apache.hadoop.hdfs.server.namenode.TestSecureNameNodeWithExternalKdc
Running org.apache.hadoop.hdfs.server.namenode.TestDeduplicationMap
Tests run: 1, Failures: 0, Errors: 0, Skipped: 0, Time elapsed: 0.1 sec - in org.apache.hadoop.hdfs.server.namenode.TestDeduplicationMap
Running org.apache.hadoop.hdfs.server.namenode.TestSecondaryWebUi
Tests run: 1, Failures: 0, Errors: 0, Skipped: 0, Time elapsed: 4.668 sec - in org.apache.hadoop.hdfs.server.namenode.TestSecondaryWebUi
Running org.apache.hadoop.hdfs.server.namenode.TestBlockPlacementPolicyRackFaultTolerant
Tests run: 1, Failures: 0, Errors: 0, Skipped: 0, Time elapsed: 10.923 sec - in org.apache.hadoop.hdfs.server.namenode.TestBlockPlacementPolicyRackFaultTolerant
Running org.apache.hadoop.hdfs.server.namenode.TestFSImageWithSnapshot
Tests run: 6, Failures: 0, Errors: 0, Skipped: 0, Time elapsed: 40.002 sec - in org.apache.hadoop.hdfs.server.namenode.TestFSImageWithSnapshot
Running org.apache.hadoop.hdfs.server.namenode.TestNameNodeRpcServer
Tests run: 1, Failures: 0, Errors: 0, Skipped: 0, Time elapsed: 5.042 sec - in org.apache.hadoop.hdfs.server.namenode.TestNameNodeRpcServer
Running org.apache.hadoop.hdfs.server.namenode.TestStartupOptionUpgrade
Tests run: 10, Failures: 0, Errors: 0, Skipped: 0, Time elapsed: 1.26 sec - in org.apache.hadoop.hdfs.server.namenode.TestStartupOptionUpgrade
Running org.apache.hadoop.hdfs.server.namenode.TestNameNodeRecovery
Tests run: 11, Failures: 0, Errors: 0, Skipped: 0, Time elapsed: 20.793 sec - in org.apache.hadoop.hdfs.server.namenode.TestNameNodeRecovery
Running org.apache.hadoop.hdfs.server.namenode.TestTransferFsImage
Tests run: 4, Failures: 0, Errors: 0, Skipped: 0, Time elapsed: 10.036 sec - in org.apache.hadoop.hdfs.server.namenode.TestTransferFsImage
Running org.apache.hadoop.hdfs.server.namenode.TestDecommissioningStatus
Tests run: 3, Failures: 0, Errors: 0, Skipped: 0, Time elapsed: 14.166 sec - in org.apache.hadoop.hdfs.server.namenode.TestDecommissioningStatus
Running org.apache.hadoop.hdfs.server.namenode.TestDeadDatanode
Tests run: 2, Failures: 0, Errors: 0, Skipped: 0, Time elapsed: 34.308 sec - in org.apache.hadoop.hdfs.server.namenode.TestDeadDatanode
Running org.apache.hadoop.hdfs.server.namenode.TestQuotaByStorageType
Tests run: 20, Failures: 0, Errors: 0, Skipped: 0, Time elapsed: 53.253 sec - in org.apache.hadoop.hdfs.server.namenode.TestQuotaByStorageType
Running org.apache.hadoop.hdfs.server.namenode.TestFsck
Tests run: 23, Failures: 0, Errors: 0, Skipped: 0, Time elapsed: 87.813 sec - in org.apache.hadoop.hdfs.server.namenode.TestFsck
Running org.apache.hadoop.hdfs.server.namenode.TestLeaseManager
Tests run: 3, Failures: 0, Errors: 0, Skipped: 0, Time elapsed: 0.793 sec - in org.apache.hadoop.hdfs.server.namenode.TestLeaseManager
Running org.apache.hadoop.hdfs.server.namenode.TestNameNodeXAttr
Tests run: 13, Failures: 0, Errors: 0, Skipped: 0, Time elapsed: 16.052 sec - in org.apache.hadoop.hdfs.server.namenode.TestNameNodeXAttr
Running org.apache.hadoop.hdfs.server.namenode.TestPathComponents
Tests run: 1, Failures: 0, Errors: 0, Skipped: 0, Time elapsed: 0.264 sec - in org.apache.hadoop.hdfs.server.namenode.TestPathComponents
Running org.apache.hadoop.hdfs.server.namenode.TestAddStripedBlocks
Tests run: 5, Failures: 0, Errors: 0, Skipped: 0, Time elapsed: 45.647 sec - in org.apache.hadoop.hdfs.server.namenode.TestAddStripedBlocks
Running org.apache.hadoop.hdfs.server.namenode.TestTruncateQuotaUpdate
Tests run: 3, Failures: 0, Errors: 0, Skipped: 0, Time elapsed: 0.44 sec - in org.apache.hadoop.hdfs.server.namenode.TestTruncateQuotaUpdate
Running org.apache.hadoop.hdfs.server.namenode.TestStripedINodeFile
Tests run: 10, Failures: 0, Errors: 0, Skipped: 0, Time elapsed: 7.074 sec - in org.apache.hadoop.hdfs.server.namenode.TestStripedINodeFile
Running org.apache.hadoop.hdfs.server.namenode.TestFSDirectory
Tests run: 5, Failures: 0, Errors: 0, Skipped: 0, Time elapsed: 15.275 sec - in org.apache.hadoop.hdfs.server.namenode.TestFSDirectory
Running org.apache.hadoop.hdfs.server.namenode.TestFileLimit
Tests run: 4, Failures: 0, Errors: 0, Skipped: 0, Time elapsed: 10.141 sec - in org.apache.hadoop.hdfs.server.namenode.TestFileLimit
Running org.apache.hadoop.hdfs.server.namenode.TestMetaSave

Results :

Failed tests: 
  TestDelegationTokenForProxyUser.testWebHdfsDoAs:163 expected:<...ocalhost:50149/user/[Proxy]User>
but was:<...ocalhost:50149/user/[Real]User>
  TestWebHdfsContentLength.testPutOp:116 expected:<0> but was:<null>
  TestWebHdfsContentLength.testPutOpWithRedirect:130 expected:<[chunked]> but was:<[0]>

Tests in error: 
  TestWebHdfsTimeouts.testRedirectConnectTimeout:172 »  test timed out after 100...
  TestBlockManager.testBlocksAreNotUnderreplicatedInSingleRack:368->doTestSingleRackClusterIsSufficientlyReplicated:376->addBlockOnNodes:443
WrongTypeOfReturnValue
  TestUnderReplicatedBlocks.testSetrepIncWithUnderReplicatedBlocks:69 »  test ti...

Tests run: 1914, Failures: 3, Errors: 3, Skipped: 6

[INFO]                                                                         
[INFO] ------------------------------------------------------------------------
[INFO] Skipping Apache Hadoop HttpFS
[INFO] This project has been banned from the build due to previous failures.
[INFO] ------------------------------------------------------------------------
[INFO]                                                                         
[INFO] ------------------------------------------------------------------------
[INFO] Skipping Apache Hadoop HDFS BookKeeper Journal
[INFO] This project has been banned from the build due to previous failures.
[INFO] ------------------------------------------------------------------------
[INFO]                                                                         
[INFO] ------------------------------------------------------------------------
[INFO] Skipping Apache Hadoop HDFS-NFS
[INFO] This project has been banned from the build due to previous failures.
[INFO] ------------------------------------------------------------------------
[INFO]                                                                         
[INFO] ------------------------------------------------------------------------
[INFO] Building Apache Hadoop HDFS Project 3.0.0-SNAPSHOT
[INFO] ------------------------------------------------------------------------
[INFO] 
[INFO] --- maven-clean-plugin:2.5:clean (default-clean) @ hadoop-hdfs-project ---
[INFO] Deleting <https://builds.apache.org/job/Hadoop-Hdfs-trunk/ws/hadoop-hdfs-project/target>
[INFO] 
[INFO] --- maven-antrun-plugin:1.7:run (create-testdirs) @ hadoop-hdfs-project ---
[INFO] Executing tasks

main:
    [mkdir] Created dir: <https://builds.apache.org/job/Hadoop-Hdfs-trunk/ws/hadoop-hdfs-project/target/test-dir>
[INFO] Executed tasks
[INFO] 
[INFO] --- maven-source-plugin:2.3:jar-no-fork (hadoop-java-sources) @ hadoop-hdfs-project
---
[INFO] 
[INFO] --- maven-source-plugin:2.3:test-jar-no-fork (hadoop-java-sources) @ hadoop-hdfs-project
---
[INFO] 
[INFO] --- maven-enforcer-plugin:1.3.1:enforce (dist-enforce) @ hadoop-hdfs-project ---
[INFO] 
[INFO] --- maven-site-plugin:3.4:attach-descriptor (attach-descriptor) @ hadoop-hdfs-project
---
[INFO] 
[INFO] --- maven-javadoc-plugin:2.8.1:jar (module-javadocs) @ hadoop-hdfs-project ---
[INFO] Skipping javadoc generation
[INFO] 
[INFO] --- maven-enforcer-plugin:1.3.1:enforce (depcheck) @ hadoop-hdfs-project ---
[INFO] 
[INFO] --- maven-checkstyle-plugin:2.15:checkstyle (default-cli) @ hadoop-hdfs-project ---
[INFO] 
[INFO] --- findbugs-maven-plugin:3.0.0:findbugs (default-cli) @ hadoop-hdfs-project ---
[INFO] ------------------------------------------------------------------------
[INFO] Reactor Summary:
[INFO] 
[INFO] Apache Hadoop HDFS Client ......................... SUCCESS [04:44 min]
[INFO] Apache Hadoop HDFS ................................ FAILURE [  02:15 h]
[INFO] Apache Hadoop HttpFS .............................. SKIPPED
[INFO] Apache Hadoop HDFS BookKeeper Journal ............. SKIPPED
[INFO] Apache Hadoop HDFS-NFS ............................ SKIPPED
[INFO] Apache Hadoop HDFS Project ........................ SUCCESS [  0.070 s]
[INFO] ------------------------------------------------------------------------
[INFO] BUILD FAILURE
[INFO] ------------------------------------------------------------------------
[INFO] Total time: 02:19 h
[INFO] Finished at: 2015-10-04T01:22:18+00:00
[INFO] Final Memory: 67M/977M
[INFO] ------------------------------------------------------------------------
[ERROR] Failed to execute goal org.apache.maven.plugins:maven-surefire-plugin:2.17:test (default-test)
on project hadoop-hdfs: ExecutionException: java.lang.RuntimeException: The forked VM terminated
without properly saying goodbye. VM crash or System.exit called?
[ERROR] Command was /bin/sh -c cd <https://builds.apache.org/job/Hadoop-Hdfs-trunk/ws/hadoop-hdfs-project/hadoop-hdfs>
&& /home/jenkins/tools/java/jdk1.7.0_55/jre/bin/java -Xmx2048m -XX:MaxPermSize=768m
-XX:+HeapDumpOnOutOfMemoryError -jar <https://builds.apache.org/job/Hadoop-Hdfs-trunk/ws/hadoop-hdfs-project/hadoop-hdfs/target/surefire/surefirebooter4238990361724042870.jar>
<https://builds.apache.org/job/Hadoop-Hdfs-trunk/ws/hadoop-hdfs-project/hadoop-hdfs/target/surefire/surefire3649163715581151200tmp>
<https://builds.apache.org/job/Hadoop-Hdfs-trunk/ws/hadoop-hdfs-project/hadoop-hdfs/target/surefire/surefire_1308457507758963408634tmp>
[ERROR] -> [Help 1]
[ERROR] 
[ERROR] To see the full stack trace of the errors, re-run Maven with the -e switch.
[ERROR] Re-run Maven using the -X switch to enable full debug logging.
[ERROR] 
[ERROR] For more information about the errors and possible solutions, please read the following
articles:
[ERROR] [Help 1] http://cwiki.apache.org/confluence/display/MAVEN/MojoFailureException
[ERROR] 
[ERROR] After correcting the problems, you can resume the build with the command
[ERROR]   mvn <goals> -rf :hadoop-hdfs
Build step 'Execute shell' marked build as failure
Archiving artifacts
Recording test results
Updating HDFS-9193

Mime
View raw message