hadoop-hdfs-dev mailing list archives

Site index · List index
Message view « Date » · « Thread »
Top « Date » · « Thread »
From Apache Jenkins Server <jenk...@builds.apache.org>
Subject Hadoop-Hdfs-trunk - Build # 2497 - Still Failing
Date Sat, 31 Oct 2015 13:34:04 GMT
See https://builds.apache.org/job/Hadoop-Hdfs-trunk/2497/

###################################################################################
########################## LAST 60 LINES OF THE CONSOLE ###########################
[...truncated 9547 lines...]
[INFO] Executing tasks

main:
    [mkdir] Created dir: /home/jenkins/jenkins-slave/workspace/Hadoop-Hdfs-trunk/hadoop-hdfs-project/target/test-dir
[INFO] Executed tasks
[INFO] 
[INFO] --- maven-source-plugin:2.3:jar-no-fork (hadoop-java-sources) @ hadoop-hdfs-project
---
[INFO] 
[INFO] --- maven-source-plugin:2.3:test-jar-no-fork (hadoop-java-sources) @ hadoop-hdfs-project
---
[INFO] 
[INFO] --- maven-enforcer-plugin:1.3.1:enforce (dist-enforce) @ hadoop-hdfs-project ---
[INFO] 
[INFO] --- maven-site-plugin:3.4:attach-descriptor (attach-descriptor) @ hadoop-hdfs-project
---
[INFO] 
[INFO] --- maven-javadoc-plugin:2.8.1:jar (module-javadocs) @ hadoop-hdfs-project ---
[INFO] Skipping javadoc generation
[INFO] 
[INFO] --- maven-enforcer-plugin:1.3.1:enforce (depcheck) @ hadoop-hdfs-project ---
[INFO] 
[INFO] --- maven-checkstyle-plugin:2.15:checkstyle (default-cli) @ hadoop-hdfs-project ---
[INFO] 
[INFO] --- findbugs-maven-plugin:3.0.0:findbugs (default-cli) @ hadoop-hdfs-project ---
[INFO] ------------------------------------------------------------------------
[INFO] Reactor Summary:
[INFO] 
[INFO] Apache Hadoop HDFS Client ......................... SUCCESS [07:42 min]
[INFO] Apache Hadoop HDFS ................................ FAILURE [  04:02 h]
[INFO] Apache Hadoop HDFS Native Client .................. SKIPPED
[INFO] Apache Hadoop HttpFS .............................. SKIPPED
[INFO] Apache Hadoop HDFS BookKeeper Journal ............. SKIPPED
[INFO] Apache Hadoop HDFS-NFS ............................ SKIPPED
[INFO] Apache Hadoop HDFS Project ........................ SUCCESS [  0.123 s]
[INFO] ------------------------------------------------------------------------
[INFO] BUILD FAILURE
[INFO] ------------------------------------------------------------------------
[INFO] Total time: 04:09 h
[INFO] Finished at: 2015-10-31T13:33:33+00:00
[INFO] Final Memory: 56M/792M
[INFO] ------------------------------------------------------------------------
[ERROR] Failed to execute goal org.apache.maven.plugins:maven-surefire-plugin:2.17:test (default-test)
on project hadoop-hdfs: There are test failures.
[ERROR] 
[ERROR] Please refer to /home/jenkins/jenkins-slave/workspace/Hadoop-Hdfs-trunk/hadoop-hdfs-project/hadoop-hdfs/target/surefire-reports
for the individual test results.
[ERROR] -> [Help 1]
[ERROR] 
[ERROR] To see the full stack trace of the errors, re-run Maven with the -e switch.
[ERROR] Re-run Maven using the -X switch to enable full debug logging.
[ERROR] 
[ERROR] For more information about the errors and possible solutions, please read the following
articles:
[ERROR] [Help 1] http://cwiki.apache.org/confluence/display/MAVEN/MojoFailureException
[ERROR] 
[ERROR] After correcting the problems, you can resume the build with the command
[ERROR]   mvn <goals> -rf :hadoop-hdfs
Build step 'Execute shell' marked build as failure
Archiving artifacts
Recording test results
Updating HDFS-4937
Sending e-mails to: hdfs-dev@hadoop.apache.org
Email was triggered for: Failure - Any
Sending email for trigger: Failure - Any



###################################################################################
############################## FAILED TESTS (if any) ##############################
2 tests failed.
FAILED:  org.apache.hadoop.hdfs.TestCrcCorruption.testCorruptionDuringWrt

Error Message:
test timed out after 50000 milliseconds

Stack Trace:
java.lang.Exception: test timed out after 50000 milliseconds
	at java.lang.Object.wait(Native Method)
	at org.apache.hadoop.hdfs.DataStreamer.waitForAckedSeqno(DataStreamer.java:763)
	at org.apache.hadoop.hdfs.DFSOutputStream.flushInternal(DFSOutputStream.java:700)
	at org.apache.hadoop.hdfs.DFSOutputStream.closeImpl(DFSOutputStream.java:774)
	at org.apache.hadoop.hdfs.DFSOutputStream.close(DFSOutputStream.java:753)
	at org.apache.hadoop.fs.FSDataOutputStream$PositionCache.close(FSDataOutputStream.java:72)
	at org.apache.hadoop.fs.FSDataOutputStream.close(FSDataOutputStream.java:101)
	at org.apache.hadoop.hdfs.TestCrcCorruption.testCorruptionDuringWrt(TestCrcCorruption.java:134)


FAILED:  org.apache.hadoop.hdfs.server.datanode.TestDirectoryScanner.testThrottling

Error Message:
test timed out after 300000 milliseconds

Stack Trace:
java.lang.Exception: test timed out after 300000 milliseconds
	at java.lang.Object.wait(Native Method)
	at java.lang.Object.wait(Object.java:503)
	at org.apache.hadoop.hdfs.DataStreamer.waitAndQueuePacket(DataStreamer.java:804)
	at org.apache.hadoop.hdfs.DFSOutputStream.enqueueCurrentPacket(DFSOutputStream.java:423)
	at org.apache.hadoop.hdfs.DFSOutputStream.enqueueCurrentPacketFull(DFSOutputStream.java:432)
	at org.apache.hadoop.hdfs.DFSOutputStream.writeChunk(DFSOutputStream.java:418)
	at org.apache.hadoop.fs.FSOutputSummer.writeChecksumChunks(FSOutputSummer.java:217)
	at org.apache.hadoop.fs.FSOutputSummer.write1(FSOutputSummer.java:125)
	at org.apache.hadoop.fs.FSOutputSummer.write(FSOutputSummer.java:111)
	at org.apache.hadoop.fs.FSDataOutputStream$PositionCache.write(FSDataOutputStream.java:57)
	at java.io.DataOutputStream.write(DataOutputStream.java:107)
	at org.apache.hadoop.hdfs.DFSTestUtil.createFile(DFSTestUtil.java:418)
	at org.apache.hadoop.hdfs.DFSTestUtil.createFile(DFSTestUtil.java:376)
	at org.apache.hadoop.hdfs.server.datanode.TestDirectoryScanner.createFile(TestDirectoryScanner.java:104)
	at org.apache.hadoop.hdfs.server.datanode.TestDirectoryScanner.testThrottling(TestDirectoryScanner.java:580)



Mime
  • Unnamed multipart/mixed (inline, None, 0 bytes)
View raw message