hadoop-hdfs-dev mailing list archives

Site index · List index
Message view « Date » · « Thread »
Top « Date » · « Thread »
From Apache Jenkins Server <jenk...@builds.apache.org>
Subject Hadoop-Hdfs-trunk - Build # 2460 - Still Failing
Date Thu, 22 Oct 2015 02:02:37 GMT
See https://builds.apache.org/job/Hadoop-Hdfs-trunk/2460/

###################################################################################
########################## LAST 60 LINES OF THE CONSOLE ###########################
[...truncated 6896 lines...]
[INFO] Executed tasks
[INFO] 
[INFO] --- maven-source-plugin:2.3:jar-no-fork (hadoop-java-sources) @ hadoop-hdfs-project
---
[INFO] 
[INFO] --- maven-source-plugin:2.3:test-jar-no-fork (hadoop-java-sources) @ hadoop-hdfs-project
---
[INFO] 
[INFO] --- maven-enforcer-plugin:1.3.1:enforce (dist-enforce) @ hadoop-hdfs-project ---
[INFO] 
[INFO] --- maven-site-plugin:3.4:attach-descriptor (attach-descriptor) @ hadoop-hdfs-project
---
[INFO] 
[INFO] --- maven-javadoc-plugin:2.8.1:jar (module-javadocs) @ hadoop-hdfs-project ---
[INFO] Skipping javadoc generation
[INFO] 
[INFO] --- maven-enforcer-plugin:1.3.1:enforce (depcheck) @ hadoop-hdfs-project ---
[INFO] 
[INFO] --- maven-checkstyle-plugin:2.15:checkstyle (default-cli) @ hadoop-hdfs-project ---
[INFO] 
[INFO] --- findbugs-maven-plugin:3.0.0:findbugs (default-cli) @ hadoop-hdfs-project ---
[INFO] ------------------------------------------------------------------------
[INFO] Reactor Summary:
[INFO] 
[INFO] Apache Hadoop HDFS Client ......................... SUCCESS [03:31 min]
[INFO] Apache Hadoop HDFS ................................ FAILURE [  03:57 h]
[INFO] Apache Hadoop HDFS Native Client .................. SKIPPED
[INFO] Apache Hadoop HttpFS .............................. SKIPPED
[INFO] Apache Hadoop HDFS BookKeeper Journal ............. SKIPPED
[INFO] Apache Hadoop HDFS-NFS ............................ SKIPPED
[INFO] Apache Hadoop HDFS Project ........................ SUCCESS [  0.077 s]
[INFO] ------------------------------------------------------------------------
[INFO] BUILD FAILURE
[INFO] ------------------------------------------------------------------------
[INFO] Total time: 04:00 h
[INFO] Finished at: 2015-10-22T02:03:17+00:00
[INFO] Final Memory: 55M/755M
[INFO] ------------------------------------------------------------------------
[ERROR] Failed to execute goal org.apache.maven.plugins:maven-surefire-plugin:2.17:test (default-test)
on project hadoop-hdfs: There are test failures.
[ERROR] 
[ERROR] Please refer to /home/jenkins/jenkins-slave/workspace/Hadoop-Hdfs-trunk/hadoop-hdfs-project/hadoop-hdfs/target/surefire-reports
for the individual test results.
[ERROR] -> [Help 1]
[ERROR] 
[ERROR] To see the full stack trace of the errors, re-run Maven with the -e switch.
[ERROR] Re-run Maven using the -X switch to enable full debug logging.
[ERROR] 
[ERROR] For more information about the errors and possible solutions, please read the following
articles:
[ERROR] [Help 1] http://cwiki.apache.org/confluence/display/MAVEN/MojoFailureException
[ERROR] 
[ERROR] After correcting the problems, you can resume the build with the command
[ERROR]   mvn <goals> -rf :hadoop-hdfs
Build step 'Execute shell' marked build as failure
Archiving artifacts
Recording test results
Updating HDFS-9225
Updating HDFS-9274
Updating HDFS-9070
Updating MAPREDUCE-6518
Updating YARN-2513
Sending e-mails to: hdfs-dev@hadoop.apache.org
Email was triggered for: Failure - Any
Sending email for trigger: Failure - Any



###################################################################################
############################## FAILED TESTS (if any) ##############################
2 tests failed.
FAILED:  org.apache.hadoop.hdfs.TestRecoverStripedFile.testRecoverAnyBlocks1

Error Message:
Time out waiting for EC block recovery.

Stack Trace:
java.io.IOException: Time out waiting for EC block recovery.
	at org.apache.hadoop.hdfs.TestRecoverStripedFile.waitForRecoveryFinished(TestRecoverStripedFile.java:388)
	at org.apache.hadoop.hdfs.TestRecoverStripedFile.assertFileBlocksRecovery(TestRecoverStripedFile.java:288)
	at org.apache.hadoop.hdfs.TestRecoverStripedFile.testRecoverAnyBlocks1(TestRecoverStripedFile.java:173)


FAILED:  org.apache.hadoop.hdfs.TestReplaceDatanodeOnFailure.testReplaceDatanodeOnFailure

Error Message:
expected:<3> but was:<2>

Stack Trace:
java.lang.AssertionError: expected:<3> but was:<2>
	at org.junit.Assert.fail(Assert.java:88)
	at org.junit.Assert.failNotEquals(Assert.java:743)
	at org.junit.Assert.assertEquals(Assert.java:118)
	at org.junit.Assert.assertEquals(Assert.java:555)
	at org.junit.Assert.assertEquals(Assert.java:542)
	at org.apache.hadoop.hdfs.TestReplaceDatanodeOnFailure$SlowWriter.checkReplication(TestReplaceDatanodeOnFailure.java:235)
	at org.apache.hadoop.hdfs.TestReplaceDatanodeOnFailure.testReplaceDatanodeOnFailure(TestReplaceDatanodeOnFailure.java:154)



Mime
  • Unnamed multipart/mixed (inline, None, 0 bytes)
View raw message