hadoop-hdfs-dev mailing list archives

Site index · List index
Message view « Date » · « Thread »
Top « Date » · « Thread »
From Apache Jenkins Server <jenk...@builds.apache.org>
Subject Hadoop-Hdfs-trunk - Build # 2380 - Still Failing
Date Thu, 01 Oct 2015 03:13:31 GMT
See https://builds.apache.org/job/Hadoop-Hdfs-trunk/2380/

###################################################################################
########################## LAST 60 LINES OF THE CONSOLE ###########################
[...truncated 7633 lines...]
[INFO] --- maven-antrun-plugin:1.7:run (create-testdirs) @ hadoop-hdfs-project ---
[INFO] Executing tasks

main:
    [mkdir] Created dir: /home/jenkins/jenkins-slave/workspace/Hadoop-Hdfs-trunk/hadoop-hdfs-project/target/test-dir
[INFO] Executed tasks
[INFO] 
[INFO] --- maven-source-plugin:2.3:jar-no-fork (hadoop-java-sources) @ hadoop-hdfs-project
---
[INFO] 
[INFO] --- maven-source-plugin:2.3:test-jar-no-fork (hadoop-java-sources) @ hadoop-hdfs-project
---
[INFO] 
[INFO] --- maven-enforcer-plugin:1.3.1:enforce (dist-enforce) @ hadoop-hdfs-project ---
[INFO] 
[INFO] --- maven-site-plugin:3.4:attach-descriptor (attach-descriptor) @ hadoop-hdfs-project
---
[INFO] 
[INFO] --- maven-javadoc-plugin:2.8.1:jar (module-javadocs) @ hadoop-hdfs-project ---
[INFO] Skipping javadoc generation
[INFO] 
[INFO] --- maven-enforcer-plugin:1.3.1:enforce (depcheck) @ hadoop-hdfs-project ---
[INFO] 
[INFO] --- maven-checkstyle-plugin:2.15:checkstyle (default-cli) @ hadoop-hdfs-project ---
[INFO] 
[INFO] --- findbugs-maven-plugin:3.0.0:findbugs (default-cli) @ hadoop-hdfs-project ---
[INFO] ------------------------------------------------------------------------
[INFO] Reactor Summary:
[INFO] 
[INFO] Apache Hadoop HDFS Client ......................... SUCCESS [04:03 min]
[INFO] Apache Hadoop HDFS ................................ FAILURE [  03:19 h]
[INFO] Apache Hadoop HttpFS .............................. SKIPPED
[INFO] Apache Hadoop HDFS BookKeeper Journal ............. SKIPPED
[INFO] Apache Hadoop HDFS-NFS ............................ SKIPPED
[INFO] Apache Hadoop HDFS Project ........................ SUCCESS [  0.073 s]
[INFO] ------------------------------------------------------------------------
[INFO] BUILD FAILURE
[INFO] ------------------------------------------------------------------------
[INFO] Total time: 03:23 h
[INFO] Finished at: 2015-10-01T03:13:46+00:00
[INFO] Final Memory: 55M/698M
[INFO] ------------------------------------------------------------------------
[ERROR] Failed to execute goal org.apache.maven.plugins:maven-surefire-plugin:2.17:test (default-test)
on project hadoop-hdfs: There are test failures.
[ERROR] 
[ERROR] Please refer to /home/jenkins/jenkins-slave/workspace/Hadoop-Hdfs-trunk/hadoop-hdfs-project/hadoop-hdfs/target/surefire-reports
for the individual test results.
[ERROR] -> [Help 1]
[ERROR] 
[ERROR] To see the full stack trace of the errors, re-run Maven with the -e switch.
[ERROR] Re-run Maven using the -X switch to enable full debug logging.
[ERROR] 
[ERROR] For more information about the errors and possible solutions, please read the following
articles:
[ERROR] [Help 1] http://cwiki.apache.org/confluence/display/MAVEN/MojoFailureException
[ERROR] 
[ERROR] After correcting the problems, you can resume the build with the command
[ERROR]   mvn <goals> -rf :hadoop-hdfs
Build step 'Execute shell' marked build as failure
Archiving artifacts
Recording test results
Updating HDFS-9175
Sending e-mails to: hdfs-dev@hadoop.apache.org
Email was triggered for: Failure - Any
Sending email for trigger: Failure - Any



###################################################################################
############################## FAILED TESTS (if any) ##############################
18 tests failed.
FAILED:  org.apache.hadoop.hdfs.TestRecoverStripedFile.testRecoverAnyBlocks1

Error Message:
Time out waiting for EC block recovery.

Stack Trace:
java.io.IOException: Time out waiting for EC block recovery.
	at org.apache.hadoop.hdfs.TestRecoverStripedFile.waitForRecoveryFinished(TestRecoverStripedFile.java:383)
	at org.apache.hadoop.hdfs.TestRecoverStripedFile.assertFileBlocksRecovery(TestRecoverStripedFile.java:283)
	at org.apache.hadoop.hdfs.TestRecoverStripedFile.testRecoverAnyBlocks1(TestRecoverStripedFile.java:168)


FAILED:  org.apache.hadoop.hdfs.TestRecoverStripedFile.testRecoverOneDataBlock

Error Message:
Time out waiting for EC block recovery.

Stack Trace:
java.io.IOException: Time out waiting for EC block recovery.
	at org.apache.hadoop.hdfs.TestRecoverStripedFile.waitForRecoveryFinished(TestRecoverStripedFile.java:383)
	at org.apache.hadoop.hdfs.TestRecoverStripedFile.assertFileBlocksRecovery(TestRecoverStripedFile.java:283)
	at org.apache.hadoop.hdfs.TestRecoverStripedFile.testRecoverOneDataBlock(TestRecoverStripedFile.java:144)


FAILED:  org.apache.hadoop.hdfs.TestRecoverStripedFile.testRecoverThreeParityBlocks

Error Message:
Time out waiting for EC block recovery.

Stack Trace:
java.io.IOException: Time out waiting for EC block recovery.
	at org.apache.hadoop.hdfs.TestRecoverStripedFile.waitForRecoveryFinished(TestRecoverStripedFile.java:383)
	at org.apache.hadoop.hdfs.TestRecoverStripedFile.assertFileBlocksRecovery(TestRecoverStripedFile.java:283)
	at org.apache.hadoop.hdfs.TestRecoverStripedFile.testRecoverThreeParityBlocks(TestRecoverStripedFile.java:126)


FAILED:  org.apache.hadoop.hdfs.TestRecoverStripedFile.testRecoverOneParityBlock

Error Message:
Time out waiting for EC block recovery.

Stack Trace:
java.io.IOException: Time out waiting for EC block recovery.
	at org.apache.hadoop.hdfs.TestRecoverStripedFile.waitForRecoveryFinished(TestRecoverStripedFile.java:383)
	at org.apache.hadoop.hdfs.TestRecoverStripedFile.assertFileBlocksRecovery(TestRecoverStripedFile.java:283)
	at org.apache.hadoop.hdfs.TestRecoverStripedFile.testRecoverOneParityBlock(TestRecoverStripedFile.java:102)


FAILED:  org.apache.hadoop.hdfs.TestRecoverStripedFile.testRecoverThreeDataBlocks1

Error Message:
Time out waiting for EC block recovery.

Stack Trace:
java.io.IOException: Time out waiting for EC block recovery.
	at org.apache.hadoop.hdfs.TestRecoverStripedFile.waitForRecoveryFinished(TestRecoverStripedFile.java:383)
	at org.apache.hadoop.hdfs.TestRecoverStripedFile.assertFileBlocksRecovery(TestRecoverStripedFile.java:283)
	at org.apache.hadoop.hdfs.TestRecoverStripedFile.testRecoverThreeDataBlocks1(TestRecoverStripedFile.java:138)


FAILED:  org.apache.hadoop.hdfs.TestRecoverStripedFile.testRecoverOneDataBlock1

Error Message:
Time out waiting for EC block recovery.

Stack Trace:
java.io.IOException: Time out waiting for EC block recovery.
	at org.apache.hadoop.hdfs.TestRecoverStripedFile.waitForRecoveryFinished(TestRecoverStripedFile.java:383)
	at org.apache.hadoop.hdfs.TestRecoverStripedFile.assertFileBlocksRecovery(TestRecoverStripedFile.java:283)
	at org.apache.hadoop.hdfs.TestRecoverStripedFile.testRecoverOneDataBlock1(TestRecoverStripedFile.java:150)


FAILED:  org.apache.hadoop.hdfs.TestRecoverStripedFile.testRecoverOneDataBlock2

Error Message:
Time out waiting for EC block recovery.

Stack Trace:
java.io.IOException: Time out waiting for EC block recovery.
	at org.apache.hadoop.hdfs.TestRecoverStripedFile.waitForRecoveryFinished(TestRecoverStripedFile.java:383)
	at org.apache.hadoop.hdfs.TestRecoverStripedFile.assertFileBlocksRecovery(TestRecoverStripedFile.java:283)
	at org.apache.hadoop.hdfs.TestRecoverStripedFile.testRecoverOneDataBlock2(TestRecoverStripedFile.java:156)


FAILED:  org.apache.hadoop.hdfs.TestRecoverStripedFile.testRecoverAnyBlocks

Error Message:
Time out waiting for EC block recovery.

Stack Trace:
java.io.IOException: Time out waiting for EC block recovery.
	at org.apache.hadoop.hdfs.TestRecoverStripedFile.waitForRecoveryFinished(TestRecoverStripedFile.java:383)
	at org.apache.hadoop.hdfs.TestRecoverStripedFile.assertFileBlocksRecovery(TestRecoverStripedFile.java:283)
	at org.apache.hadoop.hdfs.TestRecoverStripedFile.testRecoverAnyBlocks(TestRecoverStripedFile.java:162)


FAILED:  org.apache.hadoop.hdfs.TestRecoverStripedFile.testRecoverOneParityBlock1

Error Message:
Time out waiting for EC block recovery.

Stack Trace:
java.io.IOException: Time out waiting for EC block recovery.
	at org.apache.hadoop.hdfs.TestRecoverStripedFile.waitForRecoveryFinished(TestRecoverStripedFile.java:383)
	at org.apache.hadoop.hdfs.TestRecoverStripedFile.assertFileBlocksRecovery(TestRecoverStripedFile.java:283)
	at org.apache.hadoop.hdfs.TestRecoverStripedFile.testRecoverOneParityBlock1(TestRecoverStripedFile.java:108)


FAILED:  org.apache.hadoop.hdfs.TestRecoverStripedFile.testRecoverOneParityBlock2

Error Message:
Time out waiting for EC block recovery.

Stack Trace:
java.io.IOException: Time out waiting for EC block recovery.
	at org.apache.hadoop.hdfs.TestRecoverStripedFile.waitForRecoveryFinished(TestRecoverStripedFile.java:383)
	at org.apache.hadoop.hdfs.TestRecoverStripedFile.assertFileBlocksRecovery(TestRecoverStripedFile.java:283)
	at org.apache.hadoop.hdfs.TestRecoverStripedFile.testRecoverOneParityBlock2(TestRecoverStripedFile.java:114)


FAILED:  org.apache.hadoop.hdfs.TestRecoverStripedFile.testRecoverOneParityBlock3

Error Message:
Time out waiting for EC block recovery.

Stack Trace:
java.io.IOException: Time out waiting for EC block recovery.
	at org.apache.hadoop.hdfs.TestRecoverStripedFile.waitForRecoveryFinished(TestRecoverStripedFile.java:383)
	at org.apache.hadoop.hdfs.TestRecoverStripedFile.assertFileBlocksRecovery(TestRecoverStripedFile.java:283)
	at org.apache.hadoop.hdfs.TestRecoverStripedFile.testRecoverOneParityBlock3(TestRecoverStripedFile.java:120)


FAILED:  org.apache.hadoop.hdfs.TestRecoverStripedFile.testRecoverThreeDataBlocks

Error Message:
Time out waiting for EC block recovery.

Stack Trace:
java.io.IOException: Time out waiting for EC block recovery.
	at org.apache.hadoop.hdfs.TestRecoverStripedFile.waitForRecoveryFinished(TestRecoverStripedFile.java:383)
	at org.apache.hadoop.hdfs.TestRecoverStripedFile.assertFileBlocksRecovery(TestRecoverStripedFile.java:283)
	at org.apache.hadoop.hdfs.TestRecoverStripedFile.testRecoverThreeDataBlocks(TestRecoverStripedFile.java:132)


FAILED:  org.apache.hadoop.hdfs.server.namenode.snapshot.TestRenameWithSnapshots.testRenameUndo_4

Error Message:
org/apache/hadoop/ipc/ProtobufHelper

Stack Trace:
java.lang.NoClassDefFoundError: org/apache/hadoop/ipc/ProtobufHelper
	at org.apache.hadoop.hdfs.protocolPB.ClientNamenodeProtocolTranslatorPB.rename2(ClientNamenodeProtocolTranslatorPB.java:528)
	at sun.reflect.NativeMethodAccessorImpl.invoke0(Native Method)
	at sun.reflect.NativeMethodAccessorImpl.invoke(NativeMethodAccessorImpl.java:57)
	at sun.reflect.DelegatingMethodAccessorImpl.invoke(DelegatingMethodAccessorImpl.java:43)
	at java.lang.reflect.Method.invoke(Method.java:606)
	at org.apache.hadoop.io.retry.RetryInvocationHandler.invokeMethod(RetryInvocationHandler.java:251)
	at org.apache.hadoop.io.retry.RetryInvocationHandler.invoke(RetryInvocationHandler.java:103)
	at com.sun.proxy.$Proxy22.rename2(Unknown Source)
	at org.apache.hadoop.hdfs.DFSClient.rename(DFSClient.java:1554)
	at org.apache.hadoop.hdfs.DistributedFileSystem.rename(DistributedFileSystem.java:654)
	at org.apache.hadoop.hdfs.server.namenode.snapshot.TestRenameWithSnapshots.testRenameUndo_4(TestRenameWithSnapshots.java:1528)


FAILED:  org.apache.hadoop.hdfs.server.namenode.snapshot.TestRenameWithSnapshots.testRenameUndo_6

Error Message:
org/apache/hadoop/ipc/ProtobufHelper

Stack Trace:
java.lang.NoClassDefFoundError: org/apache/hadoop/ipc/ProtobufHelper
	at org.apache.hadoop.hdfs.protocolPB.ClientNamenodeProtocolTranslatorPB.rename2(ClientNamenodeProtocolTranslatorPB.java:528)
	at sun.reflect.NativeMethodAccessorImpl.invoke0(Native Method)
	at sun.reflect.NativeMethodAccessorImpl.invoke(NativeMethodAccessorImpl.java:57)
	at sun.reflect.DelegatingMethodAccessorImpl.invoke(DelegatingMethodAccessorImpl.java:43)
	at java.lang.reflect.Method.invoke(Method.java:606)
	at org.apache.hadoop.io.retry.RetryInvocationHandler.invokeMethod(RetryInvocationHandler.java:251)
	at org.apache.hadoop.io.retry.RetryInvocationHandler.invoke(RetryInvocationHandler.java:103)
	at com.sun.proxy.$Proxy22.rename2(Unknown Source)
	at org.apache.hadoop.hdfs.DFSClient.rename(DFSClient.java:1554)
	at org.apache.hadoop.hdfs.DistributedFileSystem.rename(DistributedFileSystem.java:654)
	at org.apache.hadoop.hdfs.server.namenode.snapshot.TestRenameWithSnapshots.testRenameUndo_6(TestRenameWithSnapshots.java:1651)


FAILED:  org.apache.hadoop.hdfs.server.namenode.snapshot.TestRenameWithSnapshots.testRenameUndo_7

Error Message:
org/apache/hadoop/ipc/ProtobufHelper

Stack Trace:
java.lang.NoClassDefFoundError: org/apache/hadoop/ipc/ProtobufHelper
	at org.apache.hadoop.hdfs.protocolPB.ClientNamenodeProtocolTranslatorPB.rename(ClientNamenodeProtocolTranslatorPB.java:502)
	at sun.reflect.GeneratedMethodAccessor73.invoke(Unknown Source)
	at sun.reflect.DelegatingMethodAccessorImpl.invoke(DelegatingMethodAccessorImpl.java:43)
	at java.lang.reflect.Method.invoke(Method.java:606)
	at org.apache.hadoop.io.retry.RetryInvocationHandler.invokeMethod(RetryInvocationHandler.java:251)
	at org.apache.hadoop.io.retry.RetryInvocationHandler.invoke(RetryInvocationHandler.java:103)
	at com.sun.proxy.$Proxy22.rename(Unknown Source)
	at org.apache.hadoop.hdfs.DFSClient.rename(DFSClient.java:1515)
	at org.apache.hadoop.hdfs.DistributedFileSystem.rename(DistributedFileSystem.java:621)
	at org.apache.hadoop.hdfs.server.namenode.snapshot.TestRenameWithSnapshots.testRenameUndo_7(TestRenameWithSnapshots.java:1714)


FAILED:  org.apache.hadoop.hdfs.server.namenode.snapshot.TestRenameWithSnapshots.testRenameAndUpdateSnapshottableDirs

Error Message:
org/apache/hadoop/ipc/ProtobufHelper

Stack Trace:
java.lang.NoClassDefFoundError: org/apache/hadoop/ipc/ProtobufHelper
	at org.apache.hadoop.hdfs.protocolPB.ClientNamenodeProtocolTranslatorPB.rename2(ClientNamenodeProtocolTranslatorPB.java:528)
	at sun.reflect.NativeMethodAccessorImpl.invoke0(Native Method)
	at sun.reflect.NativeMethodAccessorImpl.invoke(NativeMethodAccessorImpl.java:57)
	at sun.reflect.DelegatingMethodAccessorImpl.invoke(DelegatingMethodAccessorImpl.java:43)
	at java.lang.reflect.Method.invoke(Method.java:606)
	at org.apache.hadoop.io.retry.RetryInvocationHandler.invokeMethod(RetryInvocationHandler.java:251)
	at org.apache.hadoop.io.retry.RetryInvocationHandler.invoke(RetryInvocationHandler.java:103)
	at com.sun.proxy.$Proxy22.rename2(Unknown Source)
	at org.apache.hadoop.hdfs.DFSClient.rename(DFSClient.java:1554)
	at org.apache.hadoop.hdfs.DistributedFileSystem.rename(DistributedFileSystem.java:654)
	at org.apache.hadoop.hdfs.server.namenode.snapshot.TestRenameWithSnapshots.testRenameAndUpdateSnapshottableDirs(TestRenameWithSnapshots.java:1109)


FAILED:  org.apache.hadoop.hdfs.server.namenode.snapshot.TestRenameWithSnapshots.testRenameFromSDir2NonSDir

Error Message:
org/apache/hadoop/ipc/ProtobufHelper

Stack Trace:
java.lang.NoClassDefFoundError: org/apache/hadoop/ipc/ProtobufHelper
	at org.apache.hadoop.hdfs.protocolPB.ClientNamenodeProtocolTranslatorPB.rename(ClientNamenodeProtocolTranslatorPB.java:502)
	at sun.reflect.GeneratedMethodAccessor73.invoke(Unknown Source)
	at sun.reflect.DelegatingMethodAccessorImpl.invoke(DelegatingMethodAccessorImpl.java:43)
	at java.lang.reflect.Method.invoke(Method.java:606)
	at org.apache.hadoop.io.retry.RetryInvocationHandler.invokeMethod(RetryInvocationHandler.java:251)
	at org.apache.hadoop.io.retry.RetryInvocationHandler.invoke(RetryInvocationHandler.java:103)
	at com.sun.proxy.$Proxy22.rename(Unknown Source)
	at org.apache.hadoop.hdfs.DFSClient.rename(DFSClient.java:1515)
	at org.apache.hadoop.hdfs.DistributedFileSystem.rename(DistributedFileSystem.java:621)
	at org.apache.hadoop.hdfs.server.namenode.snapshot.TestRenameWithSnapshots.testRenameFromSDir2NonSDir(TestRenameWithSnapshots.java:141)


FAILED:  org.apache.hadoop.hdfs.util.TestByteArrayManager.testByteArrayManager

Error Message:
expected null, but was:<[128: 14/64, free=50]>

Stack Trace:
java.lang.AssertionError: expected null, but was:<[128: 14/64, free=50]>
	at org.junit.Assert.fail(Assert.java:88)
	at org.junit.Assert.failNotNull(Assert.java:664)
	at org.junit.Assert.assertNull(Assert.java:646)
	at org.junit.Assert.assertNull(Assert.java:656)
	at org.apache.hadoop.hdfs.util.TestByteArrayManager.testByteArrayManager(TestByteArrayManager.java:384)



Mime
  • Unnamed multipart/mixed (inline, None, 0 bytes)
View raw message