hadoop-hdfs-dev mailing list archives

Site index · List index
Message view « Date » · « Thread »
Top « Date » · « Thread »
From Apache Jenkins Server <jenk...@builds.apache.org>
Subject Hadoop-Hdfs-trunk-Java8 - Build # 497 - Failure
Date Thu, 15 Oct 2015 02:32:24 GMT
See https://builds.apache.org/job/Hadoop-Hdfs-trunk-Java8/497/

###################################################################################
########################## LAST 60 LINES OF THE CONSOLE ###########################
[...truncated 15688 lines...]
    [mkdir] Created dir: /home/jenkins/jenkins-slave/workspace/Hadoop-Hdfs-trunk-Java8/hadoop-hdfs-project/target/test-dir
[INFO] Executed tasks
[INFO] 
[INFO] --- maven-source-plugin:2.3:jar-no-fork (hadoop-java-sources) @ hadoop-hdfs-project
---
[INFO] 
[INFO] --- maven-source-plugin:2.3:test-jar-no-fork (hadoop-java-sources) @ hadoop-hdfs-project
---
[INFO] 
[INFO] --- maven-enforcer-plugin:1.3.1:enforce (dist-enforce) @ hadoop-hdfs-project ---
[INFO] 
[INFO] --- maven-site-plugin:3.4:attach-descriptor (attach-descriptor) @ hadoop-hdfs-project
---
[INFO] 
[INFO] --- maven-javadoc-plugin:2.8.1:jar (module-javadocs) @ hadoop-hdfs-project ---
[INFO] Not executing Javadoc as the project is not a Java classpath-capable package
[INFO] 
[INFO] --- maven-enforcer-plugin:1.3.1:enforce (depcheck) @ hadoop-hdfs-project ---
[INFO] 
[INFO] --- maven-checkstyle-plugin:2.15:checkstyle (default-cli) @ hadoop-hdfs-project ---
[INFO] 
[INFO] --- findbugs-maven-plugin:3.0.0:findbugs (default-cli) @ hadoop-hdfs-project ---
[INFO] ------------------------------------------------------------------------
[INFO] Reactor Summary:
[INFO] 
[INFO] Apache Hadoop HDFS Client ......................... SUCCESS [03:35 min]
[INFO] Apache Hadoop HDFS ................................ FAILURE [  03:17 h]
[INFO] Apache Hadoop HDFS Native Client .................. SKIPPED
[INFO] Apache Hadoop HttpFS .............................. SKIPPED
[INFO] Apache Hadoop HDFS BookKeeper Journal ............. SKIPPED
[INFO] Apache Hadoop HDFS-NFS ............................ SKIPPED
[INFO] Apache Hadoop HDFS Project ........................ SUCCESS [  0.047 s]
[INFO] ------------------------------------------------------------------------
[INFO] BUILD FAILURE
[INFO] ------------------------------------------------------------------------
[INFO] Total time: 03:20 h
[INFO] Finished at: 2015-10-15T02:32:55+00:00
[INFO] Final Memory: 55M/600M
[INFO] ------------------------------------------------------------------------
[ERROR] Failed to execute goal org.apache.maven.plugins:maven-surefire-plugin:2.17:test (default-test)
on project hadoop-hdfs: There are test failures.
[ERROR] 
[ERROR] Please refer to /home/jenkins/jenkins-slave/workspace/Hadoop-Hdfs-trunk-Java8/hadoop-hdfs-project/hadoop-hdfs/target/surefire-reports
for the individual test results.
[ERROR] -> [Help 1]
[ERROR] 
[ERROR] To see the full stack trace of the errors, re-run Maven with the -e switch.
[ERROR] Re-run Maven using the -X switch to enable full debug logging.
[ERROR] 
[ERROR] For more information about the errors and possible solutions, please read the following
articles:
[ERROR] [Help 1] http://cwiki.apache.org/confluence/display/MAVEN/MojoFailureException
[ERROR] 
[ERROR] After correcting the problems, you can resume the build with the command
[ERROR]   mvn <goals> -rf :hadoop-hdfs
Build step 'Execute shell' marked build as failure
Archiving artifacts
Recording test results
Updating HADOOP-12364
Updating HDFS-9238
Updating HDFS-9210
Updating HADOOP-12478
Sending e-mails to: hdfs-dev@hadoop.apache.org
Email was triggered for: Failure - Any
Sending email for trigger: Failure - Any



###################################################################################
############################## FAILED TESTS (if any) ##############################
13 tests failed.
FAILED:  org.apache.hadoop.hdfs.server.balancer.TestBalancerWithMultipleNameNodes.testBalancer

Error Message:
File /tmp.txt could only be replicated to 0 nodes instead of minReplication (=1).  There are
1 datanode(s) running and 1 node(s) are excluded in this operation.
 at org.apache.hadoop.hdfs.server.blockmanagement.BlockManager.chooseTarget4NewBlock(BlockManager.java:1733)
 at org.apache.hadoop.hdfs.server.namenode.FSDirWriteFileOp.chooseTargetForNewBlock(FSDirWriteFileOp.java:298)
 at org.apache.hadoop.hdfs.server.namenode.FSNamesystem.getAdditionalBlock(FSNamesystem.java:2448)
 at org.apache.hadoop.hdfs.server.namenode.NameNodeRpcServer.addBlock(NameNodeRpcServer.java:730)
 at org.apache.hadoop.hdfs.protocolPB.ClientNamenodeProtocolServerSideTranslatorPB.addBlock(ClientNamenodeProtocolServerSideTranslatorPB.java:500)
 at org.apache.hadoop.hdfs.protocol.proto.ClientNamenodeProtocolProtos$ClientNamenodeProtocol$2.callBlockingMethod(ClientNamenodeProtocolProtos.java)
 at org.apache.hadoop.ipc.ProtobufRpcEngine$Server$ProtoBufRpcInvoker.call(ProtobufRpcEngine.java:637)
 at org.apache.hadoop.ipc.RPC$Server.call(RPC.java:976)
 at org.apache.hadoop.ipc.Server$Handler$1.run(Server.java:2276)
 at org.apache.hadoop.ipc.Server$Handler$1.run(Server.java:2272)
 at java.security.AccessController.doPrivileged(Native Method)
 at javax.security.auth.Subject.doAs(Subject.java:422)
 at org.apache.hadoop.security.UserGroupInformation.doAs(UserGroupInformation.java:1667)
 at org.apache.hadoop.ipc.Server$Handler.run(Server.java:2272)


Stack Trace:
org.apache.hadoop.ipc.RemoteException: File /tmp.txt could only be replicated to 0 nodes instead
of minReplication (=1).  There are 1 datanode(s) running and 1 node(s) are excluded in this
operation.
	at org.apache.hadoop.hdfs.server.blockmanagement.BlockManager.chooseTarget4NewBlock(BlockManager.java:1733)
	at org.apache.hadoop.hdfs.server.namenode.FSDirWriteFileOp.chooseTargetForNewBlock(FSDirWriteFileOp.java:298)
	at org.apache.hadoop.hdfs.server.namenode.FSNamesystem.getAdditionalBlock(FSNamesystem.java:2448)
	at org.apache.hadoop.hdfs.server.namenode.NameNodeRpcServer.addBlock(NameNodeRpcServer.java:730)
	at org.apache.hadoop.hdfs.protocolPB.ClientNamenodeProtocolServerSideTranslatorPB.addBlock(ClientNamenodeProtocolServerSideTranslatorPB.java:500)
	at org.apache.hadoop.hdfs.protocol.proto.ClientNamenodeProtocolProtos$ClientNamenodeProtocol$2.callBlockingMethod(ClientNamenodeProtocolProtos.java)
	at org.apache.hadoop.ipc.ProtobufRpcEngine$Server$ProtoBufRpcInvoker.call(ProtobufRpcEngine.java:637)
	at org.apache.hadoop.ipc.RPC$Server.call(RPC.java:976)
	at org.apache.hadoop.ipc.Server$Handler$1.run(Server.java:2276)
	at org.apache.hadoop.ipc.Server$Handler$1.run(Server.java:2272)
	at java.security.AccessController.doPrivileged(Native Method)
	at javax.security.auth.Subject.doAs(Subject.java:422)
	at org.apache.hadoop.security.UserGroupInformation.doAs(UserGroupInformation.java:1667)
	at org.apache.hadoop.ipc.Server$Handler.run(Server.java:2272)

	at org.apache.hadoop.ipc.Client.call(Client.java:1448)
	at org.apache.hadoop.ipc.Client.call(Client.java:1379)
	at org.apache.hadoop.ipc.ProtobufRpcEngine$Invoker.invoke(ProtobufRpcEngine.java:230)
	at com.sun.proxy.$Proxy18.addBlock(Unknown Source)
	at org.apache.hadoop.hdfs.protocolPB.ClientNamenodeProtocolTranslatorPB.addBlock(ClientNamenodeProtocolTranslatorPB.java:405)
	at sun.reflect.NativeMethodAccessorImpl.invoke0(Native Method)
	at sun.reflect.NativeMethodAccessorImpl.invoke(NativeMethodAccessorImpl.java:62)
	at sun.reflect.DelegatingMethodAccessorImpl.invoke(DelegatingMethodAccessorImpl.java:43)
	at java.lang.reflect.Method.invoke(Method.java:483)
	at org.apache.hadoop.io.retry.RetryInvocationHandler.invokeMethod(RetryInvocationHandler.java:251)
	at org.apache.hadoop.io.retry.RetryInvocationHandler.invoke(RetryInvocationHandler.java:103)
	at com.sun.proxy.$Proxy19.addBlock(Unknown Source)
	at org.apache.hadoop.hdfs.DFSOutputStream.addBlock(DFSOutputStream.java:911)
	at org.apache.hadoop.hdfs.DataStreamer.locateFollowingBlock(DataStreamer.java:1682)
	at org.apache.hadoop.hdfs.DataStreamer.nextBlockOutputStream(DataStreamer.java:1492)
	at org.apache.hadoop.hdfs.DataStreamer.run(DataStreamer.java:592)


FAILED:  org.apache.hadoop.hdfs.server.blockmanagement.TestBlockManager.testBlocksAreNotUnderreplicatedInSingleRack

Error Message:

BlockCollection$$EnhancerByMockitoWithCGLIB$$b04a45c3 cannot be returned by isRunning()
isRunning() should return boolean

Stack Trace:
org.mockito.exceptions.misusing.WrongTypeOfReturnValue: 
BlockCollection$$EnhancerByMockitoWithCGLIB$$b04a45c3 cannot be returned by isRunning()
isRunning() should return boolean
	at org.apache.hadoop.hdfs.server.blockmanagement.TestBlockManager.addBlockOnNodes(TestBlockManager.java:443)
	at org.apache.hadoop.hdfs.server.blockmanagement.TestBlockManager.doTestSingleRackClusterIsSufficientlyReplicated(TestBlockManager.java:376)
	at org.apache.hadoop.hdfs.server.blockmanagement.TestBlockManager.testBlocksAreNotUnderreplicatedInSingleRack(TestBlockManager.java:368)


FAILED:  org.apache.hadoop.hdfs.server.namenode.ha.TestDNFencing.testQueueingWithAppend

Error Message:
expected:<21> but was:<20>

Stack Trace:
java.lang.AssertionError: expected:<21> but was:<20>
	at org.junit.Assert.fail(Assert.java:88)
	at org.junit.Assert.failNotEquals(Assert.java:743)
	at org.junit.Assert.assertEquals(Assert.java:118)
	at org.junit.Assert.assertEquals(Assert.java:555)
	at org.junit.Assert.assertEquals(Assert.java:542)
	at org.apache.hadoop.hdfs.server.namenode.ha.TestDNFencing.testQueueingWithAppend(TestDNFencing.java:463)


FAILED:  org.apache.hadoop.hdfs.server.namenode.ha.TestRetryCacheWithHA.testRetryCacheOnStandbyNN

Error Message:
org/apache/hadoop/fs/FileContext

Stack Trace:
java.lang.NoClassDefFoundError: org/apache/hadoop/fs/FileContext
	at java.net.URLClassLoader$1.run(URLClassLoader.java:372)
	at java.net.URLClassLoader$1.run(URLClassLoader.java:361)
	at java.security.AccessController.doPrivileged(Native Method)
	at java.net.URLClassLoader.findClass(URLClassLoader.java:360)
	at java.lang.ClassLoader.loadClass(ClassLoader.java:424)
	at sun.misc.Launcher$AppClassLoader.loadClass(Launcher.java:308)
	at java.lang.ClassLoader.loadClass(ClassLoader.java:357)
	at org.apache.hadoop.hdfs.DFSTestUtil.runOperations(DFSTestUtil.java:1259)
	at org.apache.hadoop.hdfs.server.namenode.ha.TestRetryCacheWithHA.testRetryCacheOnStandbyNN(TestRetryCacheWithHA.java:162)


FAILED:  org.apache.hadoop.hdfs.server.namenode.ha.TestRetryCacheWithHA.testRename2

Error Message:
test timed out after 60000 milliseconds

Stack Trace:
java.lang.Exception: test timed out after 60000 milliseconds
	at java.lang.Object.wait(Native Method)
	at java.lang.Object.wait(Object.java:502)
	at org.apache.hadoop.hdfs.server.namenode.ha.TestRetryCacheWithHA.testClientRetryWithFailover(TestRetryCacheWithHA.java:1328)
	at org.apache.hadoop.hdfs.server.namenode.ha.TestRetryCacheWithHA.testRename2(TestRetryCacheWithHA.java:1185)


FAILED:  org.apache.hadoop.hdfs.server.namenode.ha.TestRetryCacheWithHA.testRename2

Error Message:
Test resulted in an unexpected exit

Stack Trace:
java.lang.AssertionError: Test resulted in an unexpected exit
	at org.apache.hadoop.hdfs.MiniDFSCluster.shutdown(MiniDFSCluster.java:1874)
	at org.apache.hadoop.hdfs.MiniDFSCluster.shutdown(MiniDFSCluster.java:1861)
	at org.apache.hadoop.hdfs.MiniDFSCluster.shutdown(MiniDFSCluster.java:1854)
	at org.apache.hadoop.hdfs.server.namenode.ha.TestRetryCacheWithHA.cleanup(TestRetryCacheWithHA.java:150)


FAILED:  org.apache.hadoop.hdfs.server.namenode.ha.TestRetryCacheWithHA.testAppend

Error Message:
test timed out after 60000 milliseconds

Stack Trace:
java.lang.Exception: test timed out after 60000 milliseconds
	at java.lang.Object.wait(Native Method)
	at java.lang.Object.wait(Object.java:502)
	at org.apache.hadoop.hdfs.server.namenode.ha.TestRetryCacheWithHA.testClientRetryWithFailover(TestRetryCacheWithHA.java:1328)
	at org.apache.hadoop.hdfs.server.namenode.ha.TestRetryCacheWithHA.testAppend(TestRetryCacheWithHA.java:1171)


FAILED:  org.apache.hadoop.hdfs.server.namenode.ha.TestRetryCacheWithHA.testDelete

Error Message:
After waiting the operation delete still has not taken effect on NN yet

Stack Trace:
java.lang.AssertionError: After waiting the operation delete still has not taken effect on
NN yet
	at org.junit.Assert.fail(Assert.java:88)
	at org.junit.Assert.assertTrue(Assert.java:41)
	at org.apache.hadoop.hdfs.server.namenode.ha.TestRetryCacheWithHA.testClientRetryWithFailover(TestRetryCacheWithHA.java:1315)
	at org.apache.hadoop.hdfs.server.namenode.ha.TestRetryCacheWithHA.testDelete(TestRetryCacheWithHA.java:1199)


FAILED:  org.apache.hadoop.hdfs.server.namenode.ha.TestRetryCacheWithHA.testRemoveCachePool

Error Message:
test timed out after 60000 milliseconds

Stack Trace:
java.lang.Exception: test timed out after 60000 milliseconds
	at java.lang.Thread.sleep(Native Method)
	at org.apache.hadoop.io.retry.RetryInvocationHandler.invoke(RetryInvocationHandler.java:154)
	at com.sun.proxy.$Proxy22.addCachePool(Unknown Source)
	at org.apache.hadoop.hdfs.DFSClient.addCachePool(DFSClient.java:2213)
	at org.apache.hadoop.hdfs.server.namenode.ha.TestRetryCacheWithHA$RemoveCachePoolOp.prepare(TestRetryCacheWithHA.java:1022)
	at org.apache.hadoop.hdfs.server.namenode.ha.TestRetryCacheWithHA.testClientRetryWithFailover(TestRetryCacheWithHA.java:1291)
	at org.apache.hadoop.hdfs.server.namenode.ha.TestRetryCacheWithHA.testRemoveCachePool(TestRetryCacheWithHA.java:1265)


FAILED:  org.apache.hadoop.hdfs.server.namenode.ha.TestSeveralNameNodes.testCircularLinkedListWrites

Error Message:
Some writers didn't complete in expected runtime! Current writer state:[Circular Writer:
  directory: /test-1
  target length: 50
  current item: 20
  done: false
] expected:<0> but was:<1>

Stack Trace:
java.lang.AssertionError: Some writers didn't complete in expected runtime! Current writer
state:[Circular Writer:
	 directory: /test-1
	 target length: 50
	 current item: 20
	 done: false
] expected:<0> but was:<1>
	at org.junit.Assert.fail(Assert.java:88)
	at org.junit.Assert.failNotEquals(Assert.java:743)
	at org.junit.Assert.assertEquals(Assert.java:118)
	at org.junit.Assert.assertEquals(Assert.java:555)
	at org.apache.hadoop.hdfs.server.namenode.ha.TestSeveralNameNodes.testCircularLinkedListWrites(TestSeveralNameNodes.java:90)


FAILED:  org.apache.hadoop.hdfs.web.TestWebHDFSOAuth2.listStatusReturnsAsExpected

Error Message:
Unable to load OAuth2 connection factory.

Stack Trace:
java.io.IOException: Unable to load OAuth2 connection factory.
	at java.io.FileInputStream.open(Native Method)
	at java.io.FileInputStream.<init>(FileInputStream.java:131)
	at org.apache.hadoop.security.ssl.ReloadingX509TrustManager.loadTrustManager(ReloadingX509TrustManager.java:164)
	at org.apache.hadoop.security.ssl.ReloadingX509TrustManager.<init>(ReloadingX509TrustManager.java:81)
	at org.apache.hadoop.security.ssl.FileBasedKeyStoresFactory.init(FileBasedKeyStoresFactory.java:215)
	at org.apache.hadoop.security.ssl.SSLFactory.init(SSLFactory.java:131)
	at org.apache.hadoop.hdfs.web.URLConnectionFactory.newSslConnConfigurator(URLConnectionFactory.java:138)
	at org.apache.hadoop.hdfs.web.URLConnectionFactory.newOAuth2URLConnectionFactory(URLConnectionFactory.java:113)
	at org.apache.hadoop.hdfs.web.WebHdfsFileSystem.initialize(WebHdfsFileSystem.java:164)
	at org.apache.hadoop.hdfs.web.TestWebHDFSOAuth2.listStatusReturnsAsExpected(TestWebHDFSOAuth2.java:147)


FAILED:  org.apache.hadoop.fs.TestGlobPaths.pTestCurlyBracket

Error Message:
error parsing regexp: Unclosed group at pos 10: `myuser}{bc`

Stack Trace:
com.google.re2j.PatternSyntaxException: error parsing regexp: Unclosed group at pos 10: `myuser}{bc`
	at org.apache.hadoop.fs.GlobPattern.error(GlobPattern.java:168)
	at org.apache.hadoop.fs.GlobPattern.set(GlobPattern.java:154)
	at org.apache.hadoop.fs.GlobPattern.<init>(GlobPattern.java:42)
	at org.apache.hadoop.fs.GlobFilter.init(GlobFilter.java:67)
	at org.apache.hadoop.fs.GlobFilter.<init>(GlobFilter.java:50)
	at org.apache.hadoop.fs.Globber.doGlob(Globber.java:209)
	at org.apache.hadoop.fs.Globber.glob(Globber.java:148)
	at org.apache.hadoop.fs.FileSystem.globStatus(FileSystem.java:1664)
	at org.apache.hadoop.fs.TestGlobPaths.prepareTesting(TestGlobPaths.java:758)
	at org.apache.hadoop.fs.TestGlobPaths.pTestCurlyBracket(TestGlobPaths.java:724)


FAILED:  org.apache.hadoop.hdfs.server.datanode.TestDataNodeMetrics.testDataNodeTimeSpend

Error Message:
null

Stack Trace:
java.lang.AssertionError: null
	at org.junit.Assert.fail(Assert.java:86)
	at org.junit.Assert.assertTrue(Assert.java:41)
	at org.junit.Assert.assertTrue(Assert.java:52)
	at org.apache.hadoop.hdfs.server.datanode.TestDataNodeMetrics.testDataNodeTimeSpend(TestDataNodeMetrics.java:289)



Mime
  • Unnamed multipart/mixed (inline, None, 0 bytes)
View raw message