hadoop-hdfs-dev mailing list archives

Site index · List index
Message view « Date » · « Thread »
Top « Date » · « Thread »
From Apache Jenkins Server <jenk...@builds.apache.org>
Subject Build failed in Jenkins: Hadoop-Hdfs-trunk-Java8 #351
Date Thu, 10 Sep 2015 04:54:21 GMT
See <https://builds.apache.org/job/Hadoop-Hdfs-trunk-Java8/351/changes>

Changes:

[kasha] MAPREDUCE-6415. Create a tool to combine aggregated logs into HAR files. (Robert Kanter
via kasha)

[rkanter] YARN-4086. Allow Aggregated Log readers to handle HAR files (rkanter)

[rkanter] removing accidental file in MAPREDUCE-6415

------------------------------------------
[...truncated 7929 lines...]
Tests run: 4, Failures: 0, Errors: 0, Skipped: 0, Time elapsed: 4.099 sec - in org.apache.hadoop.fs.viewfs.TestViewFsDefaultValue
Java HotSpot(TM) 64-Bit Server VM warning: ignoring option MaxPermSize=768m; support was removed
in 8.0
Running org.apache.hadoop.fs.viewfs.TestViewFileSystemWithAcls
Tests run: 1, Failures: 0, Errors: 0, Skipped: 0, Time elapsed: 5.33 sec - in org.apache.hadoop.fs.viewfs.TestViewFileSystemWithAcls
Java HotSpot(TM) 64-Bit Server VM warning: ignoring option MaxPermSize=768m; support was removed
in 8.0
Running org.apache.hadoop.fs.viewfs.TestViewFileSystemHdfs
Tests run: 60, Failures: 0, Errors: 0, Skipped: 0, Time elapsed: 12.36 sec - in org.apache.hadoop.fs.viewfs.TestViewFileSystemHdfs
Java HotSpot(TM) 64-Bit Server VM warning: ignoring option MaxPermSize=768m; support was removed
in 8.0
Running org.apache.hadoop.fs.viewfs.TestViewFsAtHdfsRoot
Tests run: 58, Failures: 0, Errors: 0, Skipped: 0, Time elapsed: 8.608 sec - in org.apache.hadoop.fs.viewfs.TestViewFsAtHdfsRoot
Java HotSpot(TM) 64-Bit Server VM warning: ignoring option MaxPermSize=768m; support was removed
in 8.0
Running org.apache.hadoop.fs.viewfs.TestViewFsFileStatusHdfs
Tests run: 2, Failures: 0, Errors: 0, Skipped: 0, Time elapsed: 4.518 sec - in org.apache.hadoop.fs.viewfs.TestViewFsFileStatusHdfs
Java HotSpot(TM) 64-Bit Server VM warning: ignoring option MaxPermSize=768m; support was removed
in 8.0
Running org.apache.hadoop.fs.viewfs.TestViewFileSystemWithXAttrs
Tests run: 1, Failures: 0, Errors: 0, Skipped: 0, Time elapsed: 5.112 sec - in org.apache.hadoop.fs.viewfs.TestViewFileSystemWithXAttrs
Java HotSpot(TM) 64-Bit Server VM warning: ignoring option MaxPermSize=768m; support was removed
in 8.0
Running org.apache.hadoop.fs.viewfs.TestViewFsWithXAttrs
Tests run: 1, Failures: 0, Errors: 0, Skipped: 0, Time elapsed: 4.959 sec - in org.apache.hadoop.fs.viewfs.TestViewFsWithXAttrs
Java HotSpot(TM) 64-Bit Server VM warning: ignoring option MaxPermSize=768m; support was removed
in 8.0
Running org.apache.hadoop.fs.viewfs.TestViewFsHdfs
Tests run: 58, Failures: 0, Errors: 0, Skipped: 0, Time elapsed: 8.098 sec - in org.apache.hadoop.fs.viewfs.TestViewFsHdfs
Java HotSpot(TM) 64-Bit Server VM warning: ignoring option MaxPermSize=768m; support was removed
in 8.0
Running org.apache.hadoop.fs.TestHdfsNativeCodeLoader
Tests run: 1, Failures: 0, Errors: 0, Skipped: 0, Time elapsed: 0.172 sec - in org.apache.hadoop.fs.TestHdfsNativeCodeLoader
Java HotSpot(TM) 64-Bit Server VM warning: ignoring option MaxPermSize=768m; support was removed
in 8.0
Running org.apache.hadoop.tools.TestJMXGet
Tests run: 2, Failures: 0, Errors: 0, Skipped: 0, Time elapsed: 5.871 sec - in org.apache.hadoop.tools.TestJMXGet
Java HotSpot(TM) 64-Bit Server VM warning: ignoring option MaxPermSize=768m; support was removed
in 8.0
Running org.apache.hadoop.tools.TestTools
Tests run: 5, Failures: 0, Errors: 0, Skipped: 0, Time elapsed: 1.137 sec - in org.apache.hadoop.tools.TestTools
Java HotSpot(TM) 64-Bit Server VM warning: ignoring option MaxPermSize=768m; support was removed
in 8.0
Running org.apache.hadoop.tools.TestHdfsConfigFields
Tests run: 2, Failures: 0, Errors: 0, Skipped: 0, Time elapsed: 0.553 sec - in org.apache.hadoop.tools.TestHdfsConfigFields
Java HotSpot(TM) 64-Bit Server VM warning: ignoring option MaxPermSize=768m; support was removed
in 8.0
Running org.apache.hadoop.TestRefreshCallQueue
Tests run: 1, Failures: 0, Errors: 0, Skipped: 0, Time elapsed: 4.532 sec - in org.apache.hadoop.TestRefreshCallQueue
Java HotSpot(TM) 64-Bit Server VM warning: ignoring option MaxPermSize=768m; support was removed
in 8.0
Running org.apache.hadoop.net.TestNetworkTopology
Tests run: 10, Failures: 0, Errors: 0, Skipped: 0, Time elapsed: 9.13 sec - in org.apache.hadoop.net.TestNetworkTopology
Java HotSpot(TM) 64-Bit Server VM warning: ignoring option MaxPermSize=768m; support was removed
in 8.0
Running org.apache.hadoop.cli.TestCacheAdminCLI
Tests run: 2, Failures: 1, Errors: 1, Skipped: 0, Time elapsed: 6.527 sec <<< FAILURE!
- in org.apache.hadoop.cli.TestCacheAdminCLI
testAll(org.apache.hadoop.cli.TestCacheAdminCLI)  Time elapsed: 6.341 sec  <<< ERROR!
java.lang.NoSuchMethodError: org.apache.hadoop.cli.util.CLICommand.getExecutor(Ljava/lang/String;Lorg/apache/hadoop/conf/Configuration;)Lorg/apache/hadoop/cli/util/CommandExecutor;
	at org.apache.hadoop.cli.TestCacheAdminCLI.execute(TestCacheAdminCLI.java:134)

testAll(org.apache.hadoop.cli.TestCacheAdminCLI)  Time elapsed: 6.341 sec  <<< FAILURE!
java.lang.AssertionError: One of the tests failed. See the Detailed results to identify the
command that failed
	at org.junit.Assert.fail(Assert.java:88)
	at org.junit.Assert.assertTrue(Assert.java:41)
	at org.apache.hadoop.cli.CLITestHelper.displayResults(CLITestHelper.java:263)
	at org.apache.hadoop.cli.CLITestHelper.tearDown(CLITestHelper.java:125)
	at org.apache.hadoop.cli.TestCacheAdminCLI.tearDown(TestCacheAdminCLI.java:84)

Java HotSpot(TM) 64-Bit Server VM warning: ignoring option MaxPermSize=768m; support was removed
in 8.0
Running org.apache.hadoop.cli.TestCryptoAdminCLI
Tests run: 2, Failures: 1, Errors: 1, Skipped: 0, Time elapsed: 6.197 sec <<< FAILURE!
- in org.apache.hadoop.cli.TestCryptoAdminCLI
testAll(org.apache.hadoop.cli.TestCryptoAdminCLI)  Time elapsed: 6.022 sec  <<< ERROR!
java.lang.NoSuchMethodError: org.apache.hadoop.cli.util.CLICommand.getExecutor(Ljava/lang/String;Lorg/apache/hadoop/conf/Configuration;)Lorg/apache/hadoop/cli/util/CommandExecutor;
	at org.apache.hadoop.cli.TestCryptoAdminCLI.execute(TestCryptoAdminCLI.java:163)

testAll(org.apache.hadoop.cli.TestCryptoAdminCLI)  Time elapsed: 6.023 sec  <<< FAILURE!
java.lang.AssertionError: One of the tests failed. See the Detailed results to identify the
command that failed
	at org.junit.Assert.fail(Assert.java:88)
	at org.junit.Assert.assertTrue(Assert.java:41)
	at org.apache.hadoop.cli.CLITestHelper.displayResults(CLITestHelper.java:263)
	at org.apache.hadoop.cli.CLITestHelper.tearDown(CLITestHelper.java:125)
	at org.apache.hadoop.cli.TestCryptoAdminCLI.tearDown(TestCryptoAdminCLI.java:94)

Java HotSpot(TM) 64-Bit Server VM warning: ignoring option MaxPermSize=768m; support was removed
in 8.0
Running org.apache.hadoop.cli.TestDeleteCLI
Tests run: 2, Failures: 1, Errors: 1, Skipped: 0, Time elapsed: 6.071 sec <<< FAILURE!
- in org.apache.hadoop.cli.TestDeleteCLI
testAll(org.apache.hadoop.cli.TestDeleteCLI)  Time elapsed: 5.859 sec  <<< ERROR!
java.lang.NoSuchMethodError: org.apache.hadoop.cli.util.CLICommand.getExecutor(Ljava/lang/String;Lorg/apache/hadoop/conf/Configuration;)Lorg/apache/hadoop/cli/util/CommandExecutor;
	at org.apache.hadoop.cli.TestDeleteCLI.execute(TestDeleteCLI.java:84)

testAll(org.apache.hadoop.cli.TestDeleteCLI)  Time elapsed: 5.859 sec  <<< FAILURE!
java.lang.AssertionError: One of the tests failed. See the Detailed results to identify the
command that failed
	at org.junit.Assert.fail(Assert.java:88)
	at org.junit.Assert.assertTrue(Assert.java:41)
	at org.apache.hadoop.cli.CLITestHelper.displayResults(CLITestHelper.java:263)
	at org.apache.hadoop.cli.CLITestHelper.tearDown(CLITestHelper.java:125)
	at org.apache.hadoop.cli.TestDeleteCLI.tearDown(TestDeleteCLI.java:66)

Java HotSpot(TM) 64-Bit Server VM warning: ignoring option MaxPermSize=768m; support was removed
in 8.0
Running org.apache.hadoop.cli.TestAclCLI
Tests run: 2, Failures: 1, Errors: 1, Skipped: 0, Time elapsed: 3.792 sec <<< FAILURE!
- in org.apache.hadoop.cli.TestAclCLI
testAll(org.apache.hadoop.cli.TestAclCLI)  Time elapsed: 3.614 sec  <<< ERROR!
java.lang.NoSuchMethodError: org.apache.hadoop.cli.util.CLICommand.getExecutor(Ljava/lang/String;Lorg/apache/hadoop/conf/Configuration;)Lorg/apache/hadoop/cli/util/CommandExecutor;
	at org.apache.hadoop.cli.TestAclCLI.execute(TestAclCLI.java:76)

testAll(org.apache.hadoop.cli.TestAclCLI)  Time elapsed: 3.615 sec  <<< FAILURE!
java.lang.AssertionError: One of the tests failed. See the Detailed results to identify the
command that failed
	at org.junit.Assert.fail(Assert.java:88)
	at org.junit.Assert.assertTrue(Assert.java:41)
	at org.apache.hadoop.cli.CLITestHelper.displayResults(CLITestHelper.java:263)
	at org.apache.hadoop.cli.CLITestHelper.tearDown(CLITestHelper.java:125)
	at org.apache.hadoop.cli.TestAclCLI.tearDown(TestAclCLI.java:49)

Java HotSpot(TM) 64-Bit Server VM warning: ignoring option MaxPermSize=768m; support was removed
in 8.0
Running org.apache.hadoop.cli.TestXAttrCLI
Tests run: 2, Failures: 1, Errors: 1, Skipped: 0, Time elapsed: 5.994 sec <<< FAILURE!
- in org.apache.hadoop.cli.TestXAttrCLI
testAll(org.apache.hadoop.cli.TestXAttrCLI)  Time elapsed: 5.816 sec  <<< ERROR!
java.lang.NoSuchMethodError: org.apache.hadoop.cli.util.CLICommand.getExecutor(Ljava/lang/String;Lorg/apache/hadoop/conf/Configuration;)Lorg/apache/hadoop/cli/util/CommandExecutor;
	at org.apache.hadoop.cli.TestXAttrCLI.execute(TestXAttrCLI.java:90)

testAll(org.apache.hadoop.cli.TestXAttrCLI)  Time elapsed: 5.816 sec  <<< FAILURE!
java.lang.AssertionError: One of the tests failed. See the Detailed results to identify the
command that failed
	at org.junit.Assert.fail(Assert.java:88)
	at org.junit.Assert.assertTrue(Assert.java:41)
	at org.apache.hadoop.cli.CLITestHelper.displayResults(CLITestHelper.java:263)
	at org.apache.hadoop.cli.CLITestHelper.tearDown(CLITestHelper.java:125)
	at org.apache.hadoop.cli.TestXAttrCLI.tearDown(TestXAttrCLI.java:75)

Java HotSpot(TM) 64-Bit Server VM warning: ignoring option MaxPermSize=768m; support was removed
in 8.0
Running org.apache.hadoop.cli.TestHDFSCLI
Tests run: 2, Failures: 1, Errors: 1, Skipped: 0, Time elapsed: 9.168 sec <<< FAILURE!
- in org.apache.hadoop.cli.TestHDFSCLI
testAll(org.apache.hadoop.cli.TestHDFSCLI)  Time elapsed: 8.983 sec  <<< ERROR!
java.lang.NoSuchMethodError: org.apache.hadoop.cli.util.CLICommand.getExecutor(Ljava/lang/String;Lorg/apache/hadoop/conf/Configuration;)Lorg/apache/hadoop/cli/util/CommandExecutor;
	at org.apache.hadoop.cli.TestHDFSCLI.execute(TestHDFSCLI.java:98)

testAll(org.apache.hadoop.cli.TestHDFSCLI)  Time elapsed: 8.984 sec  <<< FAILURE!
java.lang.AssertionError: One of the tests failed. See the Detailed results to identify the
command that failed
	at org.junit.Assert.fail(Assert.java:88)
	at org.junit.Assert.assertTrue(Assert.java:41)
	at org.apache.hadoop.cli.CLITestHelper.displayResults(CLITestHelper.java:263)
	at org.apache.hadoop.cli.CLITestHelper.tearDown(CLITestHelper.java:125)
	at org.apache.hadoop.cli.TestHDFSCLI.tearDown(TestHDFSCLI.java:85)


Results :

Failed tests: 
  TestSeveralNameNodes.testCircularLinkedListWrites:90 Some writers didn't complete in expected
runtime! Current writer state:[Circular Writer:
	 directory: /test-1
	 target length: 50
	 current item: 42
	 done: false
] expected:<0> but was:<1>
  TestStandbyCheckpoints.testCheckpointCancellationDuringUpload:317 Expected non-empty <https://builds.apache.org/job/Hadoop-Hdfs-trunk-Java8/ws/hadoop-hdfs-project/hadoop-hdfs/target/test/data/dfs/name-0-5/current/fsimage_0000000000000000104>
  TestDistributedFileSystem.testDFSClientPeerWriteTimeout:1043 write timedout too late in
1257 ms
  TestCacheAdminCLI.tearDown:84->CLITestHelper.tearDown:125->CLITestHelper.displayResults:263
One of the tests failed. See the Detailed results to identify the command that failed
  TestCryptoAdminCLI.tearDown:94->CLITestHelper.tearDown:125->CLITestHelper.displayResults:263
One of the tests failed. See the Detailed results to identify the command that failed
  TestDeleteCLI.tearDown:66->CLITestHelper.tearDown:125->CLITestHelper.displayResults:263
One of the tests failed. See the Detailed results to identify the command that failed
  TestAclCLI.tearDown:49->CLITestHelper.tearDown:125->CLITestHelper.displayResults:263
One of the tests failed. See the Detailed results to identify the command that failed
  TestXAttrCLI.tearDown:75->CLITestHelper.tearDown:125->CLITestHelper.displayResults:263
One of the tests failed. See the Detailed results to identify the command that failed
  TestHDFSCLI.tearDown:85->CLITestHelper.tearDown:125->CLITestHelper.displayResults:263
One of the tests failed. See the Detailed results to identify the command that failed

Tests in error: 
  TestHDFSConcat.startUpCluster:74 » IO Timed out waiting for Mini HDFS Cluster ...
  TestHDFSConcat.startUpCluster:74 » IO Timed out waiting for Mini HDFS Cluster ...
  TestHDFSConcat.startUpCluster:74 » IO Timed out waiting for Mini HDFS Cluster ...
  TestWebHDFSOAuth2.listStatusReturnsAsExpected:147 » IO Unable to load OAuth2 c...
  TestCacheAdminCLI.testAll:140->CLITestHelper.testAll:319->execute:134 NoSuchMethod
  TestCryptoAdminCLI.testAll:169->CLITestHelper.testAll:319->execute:163 NoSuchMethod
  TestDeleteCLI.testAll:90->CLITestHelper.testAll:319->execute:84 NoSuchMethod o...
  TestAclCLI.testAll:82->CLITestHelper.testAll:319->execute:76 NoSuchMethod org....
  TestXAttrCLI.testAll:96->CLITestHelper.testAll:319->execute:90 NoSuchMethod or...
  TestHDFSCLI.testAll:104->CLITestHelper.testAll:319->execute:98 NoSuchMethod or...

Tests run: 3677, Failures: 9, Errors: 10, Skipped: 16

[INFO]                                                                         
[INFO] ------------------------------------------------------------------------
[INFO] Skipping Apache Hadoop HttpFS
[INFO] This project has been banned from the build due to previous failures.
[INFO] ------------------------------------------------------------------------
[INFO]                                                                         
[INFO] ------------------------------------------------------------------------
[INFO] Skipping Apache Hadoop HDFS BookKeeper Journal
[INFO] This project has been banned from the build due to previous failures.
[INFO] ------------------------------------------------------------------------
[INFO]                                                                         
[INFO] ------------------------------------------------------------------------
[INFO] Skipping Apache Hadoop HDFS-NFS
[INFO] This project has been banned from the build due to previous failures.
[INFO] ------------------------------------------------------------------------
[INFO]                                                                         
[INFO] ------------------------------------------------------------------------
[INFO] Building Apache Hadoop HDFS Project 3.0.0-SNAPSHOT
[INFO] ------------------------------------------------------------------------
[INFO] 
[INFO] --- maven-clean-plugin:2.5:clean (default-clean) @ hadoop-hdfs-project ---
[INFO] Deleting <https://builds.apache.org/job/Hadoop-Hdfs-trunk-Java8/ws/hadoop-hdfs-project/target>
[INFO] 
[INFO] --- maven-antrun-plugin:1.7:run (create-testdirs) @ hadoop-hdfs-project ---
[INFO] Executing tasks

main:
    [mkdir] Created dir: <https://builds.apache.org/job/Hadoop-Hdfs-trunk-Java8/ws/hadoop-hdfs-project/target/test-dir>
[INFO] Executed tasks
[INFO] 
[INFO] --- maven-source-plugin:2.3:jar-no-fork (hadoop-java-sources) @ hadoop-hdfs-project
---
[INFO] 
[INFO] --- maven-source-plugin:2.3:test-jar-no-fork (hadoop-java-sources) @ hadoop-hdfs-project
---
[INFO] 
[INFO] --- maven-enforcer-plugin:1.3.1:enforce (dist-enforce) @ hadoop-hdfs-project ---
[INFO] 
[INFO] --- maven-site-plugin:3.4:attach-descriptor (attach-descriptor) @ hadoop-hdfs-project
---
[INFO] 
[INFO] --- maven-javadoc-plugin:2.8.1:jar (module-javadocs) @ hadoop-hdfs-project ---
[INFO] Not executing Javadoc as the project is not a Java classpath-capable package
[INFO] 
[INFO] --- maven-enforcer-plugin:1.3.1:enforce (depcheck) @ hadoop-hdfs-project ---
[INFO] 
[INFO] --- maven-checkstyle-plugin:2.15:checkstyle (default-cli) @ hadoop-hdfs-project ---
[INFO] 
[INFO] --- findbugs-maven-plugin:3.0.0:findbugs (default-cli) @ hadoop-hdfs-project ---
[INFO] ------------------------------------------------------------------------
[INFO] Reactor Summary:
[INFO] 
[INFO] Apache Hadoop HDFS Client ......................... SUCCESS [03:41 min]
[INFO] Apache Hadoop HDFS ................................ FAILURE [  02:49 h]
[INFO] Apache Hadoop HttpFS .............................. SKIPPED
[INFO] Apache Hadoop HDFS BookKeeper Journal ............. SKIPPED
[INFO] Apache Hadoop HDFS-NFS ............................ SKIPPED
[INFO] Apache Hadoop HDFS Project ........................ SUCCESS [  0.054 s]
[INFO] ------------------------------------------------------------------------
[INFO] BUILD FAILURE
[INFO] ------------------------------------------------------------------------
[INFO] Total time: 02:53 h
[INFO] Finished at: 2015-09-10T04:54:10+00:00
[INFO] Final Memory: 55M/706M
[INFO] ------------------------------------------------------------------------
[ERROR] Failed to execute goal org.apache.maven.plugins:maven-surefire-plugin:2.17:test (default-test)
on project hadoop-hdfs: There are test failures.
[ERROR] 
[ERROR] Please refer to <https://builds.apache.org/job/Hadoop-Hdfs-trunk-Java8/ws/hadoop-hdfs-project/hadoop-hdfs/target/surefire-reports>
for the individual test results.
[ERROR] -> [Help 1]
[ERROR] 
[ERROR] To see the full stack trace of the errors, re-run Maven with the -e switch.
[ERROR] Re-run Maven using the -X switch to enable full debug logging.
[ERROR] 
[ERROR] For more information about the errors and possible solutions, please read the following
articles:
[ERROR] [Help 1] http://cwiki.apache.org/confluence/display/MAVEN/MojoFailureException
[ERROR] 
[ERROR] After correcting the problems, you can resume the build with the command
[ERROR]   mvn <goals> -rf :hadoop-hdfs
Build step 'Execute shell' marked build as failure
Archiving artifacts
Sending artifact delta relative to Hadoop-Hdfs-trunk-Java8 #222
Archived 1 artifacts
Archive block size is 32768
Received 0 blocks and 5375702 bytes
Compression is 0.0%
Took 3.5 sec
Recording test results
Updating MAPREDUCE-6415
Updating YARN-4086

Mime
View raw message