hadoop-hdfs-dev mailing list archives

Site index · List index
Message view « Date » · « Thread »
Top « Date » · « Thread »
From Apache Jenkins Server <jenk...@builds.apache.org>
Subject Hadoop-Hdfs-trunk - Build # 2336 - Still Failing
Date Sun, 20 Sep 2015 04:59:12 GMT
See https://builds.apache.org/job/Hadoop-Hdfs-trunk/2336/

###################################################################################
########################## LAST 60 LINES OF THE CONSOLE ###########################
[...truncated 8541 lines...]
[INFO] 
[INFO] --- maven-source-plugin:2.3:jar-no-fork (hadoop-java-sources) @ hadoop-hdfs-project
---
[INFO] 
[INFO] --- maven-source-plugin:2.3:test-jar-no-fork (hadoop-java-sources) @ hadoop-hdfs-project
---
[INFO] 
[INFO] --- maven-enforcer-plugin:1.3.1:enforce (dist-enforce) @ hadoop-hdfs-project ---
[INFO] 
[INFO] --- maven-site-plugin:3.4:attach-descriptor (attach-descriptor) @ hadoop-hdfs-project
---
[INFO] 
[INFO] --- maven-javadoc-plugin:2.8.1:jar (module-javadocs) @ hadoop-hdfs-project ---
[INFO] Skipping javadoc generation
[INFO] 
[INFO] --- maven-enforcer-plugin:1.3.1:enforce (depcheck) @ hadoop-hdfs-project ---
[INFO] 
[INFO] --- maven-checkstyle-plugin:2.15:checkstyle (default-cli) @ hadoop-hdfs-project ---
[INFO] 
[INFO] --- findbugs-maven-plugin:3.0.0:findbugs (default-cli) @ hadoop-hdfs-project ---
[INFO] ------------------------------------------------------------------------
[INFO] Reactor Summary:
[INFO] 
[INFO] Apache Hadoop HDFS Client ......................... SUCCESS [03:19 min]
[INFO] Apache Hadoop HDFS ................................ FAILURE [  03:07 h]
[INFO] Apache Hadoop HttpFS .............................. SKIPPED
[INFO] Apache Hadoop HDFS BookKeeper Journal ............. SKIPPED
[INFO] Apache Hadoop HDFS-NFS ............................ SKIPPED
[INFO] Apache Hadoop HDFS Project ........................ SUCCESS [  0.059 s]
[INFO] ------------------------------------------------------------------------
[INFO] BUILD FAILURE
[INFO] ------------------------------------------------------------------------
[INFO] Total time: 03:10 h
[INFO] Finished at: 2015-09-20T04:59:13+00:00
[INFO] Final Memory: 55M/719M
[INFO] ------------------------------------------------------------------------
[ERROR] Failed to execute goal org.apache.maven.plugins:maven-surefire-plugin:2.17:test (default-test)
on project hadoop-hdfs: There are test failures.
[ERROR] 
[ERROR] Please refer to /home/jenkins/jenkins-slave/workspace/Hadoop-Hdfs-trunk/hadoop-hdfs-project/hadoop-hdfs/target/surefire-reports
for the individual test results.
[ERROR] -> [Help 1]
[ERROR] 
[ERROR] To see the full stack trace of the errors, re-run Maven with the -e switch.
[ERROR] Re-run Maven using the -X switch to enable full debug logging.
[ERROR] 
[ERROR] For more information about the errors and possible solutions, please read the following
articles:
[ERROR] [Help 1] http://cwiki.apache.org/confluence/display/MAVEN/MojoFailureException
[ERROR] 
[ERROR] After correcting the problems, you can resume the build with the command
[ERROR]   mvn <goals> -rf :hadoop-hdfs
Build step 'Execute shell' marked build as failure
Archiving artifacts
Sending artifact delta relative to Hadoop-Hdfs-trunk #2322
Archived 1 artifacts
Archive block size is 32768
Received 0 blocks and 4572385 bytes
Compression is 0.0%
Took 2.1 sec
Recording test results
Updating HDFS-9004
Sending e-mails to: hdfs-dev@hadoop.apache.org
Email was triggered for: Failure
Sending email for trigger: Failure



###################################################################################
############################## FAILED TESTS (if any) ##############################
31 tests failed.
REGRESSION:  org.apache.hadoop.cli.TestAclCLI.testAll

Error Message:
org.apache.hadoop.cli.util.CLICommand.getExecutor(Ljava/lang/String;Lorg/apache/hadoop/conf/Configuration;)Lorg/apache/hadoop/cli/util/CommandExecutor;

Stack Trace:
java.lang.NoSuchMethodError: org.apache.hadoop.cli.util.CLICommand.getExecutor(Ljava/lang/String;Lorg/apache/hadoop/conf/Configuration;)Lorg/apache/hadoop/cli/util/CommandExecutor;
	at org.apache.hadoop.cli.TestAclCLI.execute(TestAclCLI.java:76)


REGRESSION:  org.apache.hadoop.cli.TestAclCLI.testAll

Error Message:
One of the tests failed. See the Detailed results to identify the command that failed

Stack Trace:
java.lang.AssertionError: One of the tests failed. See the Detailed results to identify the
command that failed
	at org.junit.Assert.fail(Assert.java:88)
	at org.junit.Assert.assertTrue(Assert.java:41)
	at org.apache.hadoop.cli.CLITestHelper.displayResults(CLITestHelper.java:263)
	at org.apache.hadoop.cli.CLITestHelper.tearDown(CLITestHelper.java:125)
	at org.apache.hadoop.cli.TestAclCLI.tearDown(TestAclCLI.java:49)


REGRESSION:  org.apache.hadoop.cli.TestCacheAdminCLI.testAll

Error Message:
org.apache.hadoop.cli.util.CLICommand.getExecutor(Ljava/lang/String;Lorg/apache/hadoop/conf/Configuration;)Lorg/apache/hadoop/cli/util/CommandExecutor;

Stack Trace:
java.lang.NoSuchMethodError: org.apache.hadoop.cli.util.CLICommand.getExecutor(Ljava/lang/String;Lorg/apache/hadoop/conf/Configuration;)Lorg/apache/hadoop/cli/util/CommandExecutor;
	at org.apache.hadoop.cli.TestCacheAdminCLI.execute(TestCacheAdminCLI.java:134)


REGRESSION:  org.apache.hadoop.cli.TestCacheAdminCLI.testAll

Error Message:
One of the tests failed. See the Detailed results to identify the command that failed

Stack Trace:
java.lang.AssertionError: One of the tests failed. See the Detailed results to identify the
command that failed
	at org.junit.Assert.fail(Assert.java:88)
	at org.junit.Assert.assertTrue(Assert.java:41)
	at org.apache.hadoop.cli.CLITestHelper.displayResults(CLITestHelper.java:263)
	at org.apache.hadoop.cli.CLITestHelper.tearDown(CLITestHelper.java:125)
	at org.apache.hadoop.cli.TestCacheAdminCLI.tearDown(TestCacheAdminCLI.java:84)


REGRESSION:  org.apache.hadoop.cli.TestCryptoAdminCLI.testAll

Error Message:
org.apache.hadoop.cli.util.CLICommand.getExecutor(Ljava/lang/String;Lorg/apache/hadoop/conf/Configuration;)Lorg/apache/hadoop/cli/util/CommandExecutor;

Stack Trace:
java.lang.NoSuchMethodError: org.apache.hadoop.cli.util.CLICommand.getExecutor(Ljava/lang/String;Lorg/apache/hadoop/conf/Configuration;)Lorg/apache/hadoop/cli/util/CommandExecutor;
	at org.apache.hadoop.cli.TestCryptoAdminCLI.execute(TestCryptoAdminCLI.java:163)


REGRESSION:  org.apache.hadoop.cli.TestCryptoAdminCLI.testAll

Error Message:
One of the tests failed. See the Detailed results to identify the command that failed

Stack Trace:
java.lang.AssertionError: One of the tests failed. See the Detailed results to identify the
command that failed
	at org.junit.Assert.fail(Assert.java:88)
	at org.junit.Assert.assertTrue(Assert.java:41)
	at org.apache.hadoop.cli.CLITestHelper.displayResults(CLITestHelper.java:263)
	at org.apache.hadoop.cli.CLITestHelper.tearDown(CLITestHelper.java:125)
	at org.apache.hadoop.cli.TestCryptoAdminCLI.tearDown(TestCryptoAdminCLI.java:94)


REGRESSION:  org.apache.hadoop.cli.TestDeleteCLI.testAll

Error Message:
org.apache.hadoop.cli.util.CLICommand.getExecutor(Ljava/lang/String;Lorg/apache/hadoop/conf/Configuration;)Lorg/apache/hadoop/cli/util/CommandExecutor;

Stack Trace:
java.lang.NoSuchMethodError: org.apache.hadoop.cli.util.CLICommand.getExecutor(Ljava/lang/String;Lorg/apache/hadoop/conf/Configuration;)Lorg/apache/hadoop/cli/util/CommandExecutor;
	at org.apache.hadoop.cli.TestDeleteCLI.execute(TestDeleteCLI.java:84)


REGRESSION:  org.apache.hadoop.cli.TestDeleteCLI.testAll

Error Message:
One of the tests failed. See the Detailed results to identify the command that failed

Stack Trace:
java.lang.AssertionError: One of the tests failed. See the Detailed results to identify the
command that failed
	at org.junit.Assert.fail(Assert.java:88)
	at org.junit.Assert.assertTrue(Assert.java:41)
	at org.apache.hadoop.cli.CLITestHelper.displayResults(CLITestHelper.java:263)
	at org.apache.hadoop.cli.CLITestHelper.tearDown(CLITestHelper.java:125)
	at org.apache.hadoop.cli.TestDeleteCLI.tearDown(TestDeleteCLI.java:66)


REGRESSION:  org.apache.hadoop.cli.TestHDFSCLI.testAll

Error Message:
org.apache.hadoop.cli.util.CLICommand.getExecutor(Ljava/lang/String;Lorg/apache/hadoop/conf/Configuration;)Lorg/apache/hadoop/cli/util/CommandExecutor;

Stack Trace:
java.lang.NoSuchMethodError: org.apache.hadoop.cli.util.CLICommand.getExecutor(Ljava/lang/String;Lorg/apache/hadoop/conf/Configuration;)Lorg/apache/hadoop/cli/util/CommandExecutor;
	at org.apache.hadoop.cli.TestHDFSCLI.execute(TestHDFSCLI.java:98)


REGRESSION:  org.apache.hadoop.cli.TestHDFSCLI.testAll

Error Message:
One of the tests failed. See the Detailed results to identify the command that failed

Stack Trace:
java.lang.AssertionError: One of the tests failed. See the Detailed results to identify the
command that failed
	at org.junit.Assert.fail(Assert.java:88)
	at org.junit.Assert.assertTrue(Assert.java:41)
	at org.apache.hadoop.cli.CLITestHelper.displayResults(CLITestHelper.java:263)
	at org.apache.hadoop.cli.CLITestHelper.tearDown(CLITestHelper.java:125)
	at org.apache.hadoop.cli.TestHDFSCLI.tearDown(TestHDFSCLI.java:85)


REGRESSION:  org.apache.hadoop.cli.TestXAttrCLI.testAll

Error Message:
org.apache.hadoop.cli.util.CLICommand.getExecutor(Ljava/lang/String;Lorg/apache/hadoop/conf/Configuration;)Lorg/apache/hadoop/cli/util/CommandExecutor;

Stack Trace:
java.lang.NoSuchMethodError: org.apache.hadoop.cli.util.CLICommand.getExecutor(Ljava/lang/String;Lorg/apache/hadoop/conf/Configuration;)Lorg/apache/hadoop/cli/util/CommandExecutor;
	at org.apache.hadoop.cli.TestXAttrCLI.execute(TestXAttrCLI.java:90)


REGRESSION:  org.apache.hadoop.cli.TestXAttrCLI.testAll

Error Message:
One of the tests failed. See the Detailed results to identify the command that failed

Stack Trace:
java.lang.AssertionError: One of the tests failed. See the Detailed results to identify the
command that failed
	at org.junit.Assert.fail(Assert.java:88)
	at org.junit.Assert.assertTrue(Assert.java:41)
	at org.apache.hadoop.cli.CLITestHelper.displayResults(CLITestHelper.java:263)
	at org.apache.hadoop.cli.CLITestHelper.tearDown(CLITestHelper.java:125)
	at org.apache.hadoop.cli.TestXAttrCLI.tearDown(TestXAttrCLI.java:75)


REGRESSION:  org.apache.hadoop.hdfs.TestRollingUpgrade.testCheckpointWithMultipleNN

Error Message:
Test resulted in an unexpected exit

Stack Trace:
java.lang.AssertionError: Test resulted in an unexpected exit
	at org.apache.hadoop.hdfs.MiniDFSCluster.shutdown(MiniDFSCluster.java:1848)
	at org.apache.hadoop.hdfs.MiniDFSCluster.shutdown(MiniDFSCluster.java:1835)
	at org.apache.hadoop.hdfs.MiniDFSCluster.shutdown(MiniDFSCluster.java:1828)
	at org.apache.hadoop.hdfs.qjournal.MiniQJMHACluster.shutdown(MiniQJMHACluster.java:160)
	at org.apache.hadoop.hdfs.TestRollingUpgrade.testCheckpoint(TestRollingUpgrade.java:601)
	at org.apache.hadoop.hdfs.TestRollingUpgrade.testCheckpointWithMultipleNN(TestRollingUpgrade.java:565)


REGRESSION:  org.apache.hadoop.hdfs.TestRollingUpgrade.testDFSAdminRollingUpgradeCommands

Error Message:
expected null, but was:<javax.management.openmbean.CompositeDataSupport(compositeType=javax.management.openmbean.CompositeType(name=org.apache.hadoop.hdfs.protocol.RollingUpgradeInfo$Bean,items=((itemName=blockPoolId,itemType=javax.management.openmbean.SimpleType(name=java.lang.String)),(itemName=createdRollbackImages,itemType=javax.management.openmbean.SimpleType(name=java.lang.Boolean)),(itemName=finalizeTime,itemType=javax.management.openmbean.SimpleType(name=java.lang.Long)),(itemName=startTime,itemType=javax.management.openmbean.SimpleType(name=java.lang.Long)))),contents={blockPoolId=BP-1438387066-67.195.81.153-1442723549178,
createdRollbackImages=true, finalizeTime=0, startTime=1442723551375})>

Stack Trace:
java.lang.AssertionError: expected null, but was:<javax.management.openmbean.CompositeDataSupport(compositeType=javax.management.openmbean.CompositeType(name=org.apache.hadoop.hdfs.protocol.RollingUpgradeInfo$Bean,items=((itemName=blockPoolId,itemType=javax.management.openmbean.SimpleType(name=java.lang.String)),(itemName=createdRollbackImages,itemType=javax.management.openmbean.SimpleType(name=java.lang.Boolean)),(itemName=finalizeTime,itemType=javax.management.openmbean.SimpleType(name=java.lang.Long)),(itemName=startTime,itemType=javax.management.openmbean.SimpleType(name=java.lang.Long)))),contents={blockPoolId=BP-1438387066-67.195.81.153-1442723549178,
createdRollbackImages=true, finalizeTime=0, startTime=1442723551375})>
	at org.junit.Assert.fail(Assert.java:88)
	at org.junit.Assert.failNotNull(Assert.java:664)
	at org.junit.Assert.assertNull(Assert.java:646)
	at org.junit.Assert.assertNull(Assert.java:656)
	at org.apache.hadoop.hdfs.TestRollingUpgrade.checkMxBeanIsNull(TestRollingUpgrade.java:293)
	at org.apache.hadoop.hdfs.TestRollingUpgrade.testDFSAdminRollingUpgradeCommands(TestRollingUpgrade.java:101)


REGRESSION:  org.apache.hadoop.hdfs.TestRollingUpgrade.testQuery

Error Message:
Test resulted in an unexpected exit

Stack Trace:
java.lang.AssertionError: Test resulted in an unexpected exit
	at org.apache.hadoop.hdfs.MiniDFSCluster.shutdown(MiniDFSCluster.java:1848)
	at org.apache.hadoop.hdfs.MiniDFSCluster.shutdown(MiniDFSCluster.java:1835)
	at org.apache.hadoop.hdfs.MiniDFSCluster.shutdown(MiniDFSCluster.java:1828)
	at org.apache.hadoop.hdfs.qjournal.MiniQJMHACluster.shutdown(MiniQJMHACluster.java:160)
	at org.apache.hadoop.hdfs.TestRollingUpgrade.testQuery(TestRollingUpgrade.java:527)
	at org.apache.hadoop.hdfs.TestRollingUpgrade.testQuery(TestRollingUpgrade.java:483)


REGRESSION:  org.apache.hadoop.hdfs.TestRollingUpgrade.testRollback

Error Message:
Test resulted in an unexpected exit

Stack Trace:
java.lang.AssertionError: Test resulted in an unexpected exit
	at org.apache.hadoop.hdfs.MiniDFSCluster.shutdown(MiniDFSCluster.java:1848)
	at org.apache.hadoop.hdfs.MiniDFSCluster.shutdown(MiniDFSCluster.java:1835)
	at org.apache.hadoop.hdfs.MiniDFSCluster.shutdown(MiniDFSCluster.java:1828)
	at org.apache.hadoop.hdfs.TestRollingUpgrade.testRollback(TestRollingUpgrade.java:349)


REGRESSION:  org.apache.hadoop.hdfs.server.datanode.TestFsDatasetCache.testPageRounder

Error Message:
test timed out after 60000 milliseconds

Stack Trace:
java.lang.Exception: test timed out after 60000 milliseconds
	at java.lang.Thread.sleep(Native Method)
	at org.apache.hadoop.test.GenericTestUtils.waitFor(GenericTestUtils.java:164)
	at org.apache.hadoop.hdfs.DFSTestUtil.verifyExpectedCacheUsage(DFSTestUtil.java:1421)
	at org.apache.hadoop.hdfs.server.datanode.TestFsDatasetCache.testPageRounder(TestFsDatasetCache.java:472)


REGRESSION:  org.apache.hadoop.hdfs.server.namenode.ha.TestDFSUpgradeWithHA.testFinalizeWithJournalNodes

Error Message:
Unable to construct journal, qjournal://127.0.0.1:59417;127.0.0.1:51270;127.0.0.1:34896/ns1

Stack Trace:
java.lang.IllegalArgumentException: Unable to construct journal, qjournal://127.0.0.1:59417;127.0.0.1:51270;127.0.0.1:34896/ns1
	at java.net.URLClassLoader$1.run(URLClassLoader.java:366)
	at java.net.URLClassLoader$1.run(URLClassLoader.java:355)
	at java.security.AccessController.doPrivileged(Native Method)
	at java.net.URLClassLoader.findClass(URLClassLoader.java:354)
	at java.lang.ClassLoader.loadClass(ClassLoader.java:425)
	at sun.misc.Launcher$AppClassLoader.loadClass(Launcher.java:308)
	at java.lang.ClassLoader.loadClass(ClassLoader.java:358)
	at org.apache.hadoop.hdfs.qjournal.client.QuorumJournalManager.<init>(QuorumJournalManager.java:117)
	at org.apache.hadoop.hdfs.qjournal.client.QuorumJournalManager.<init>(QuorumJournalManager.java:105)
	at sun.reflect.NativeConstructorAccessorImpl.newInstance0(Native Method)
	at sun.reflect.NativeConstructorAccessorImpl.newInstance(NativeConstructorAccessorImpl.java:57)
	at sun.reflect.DelegatingConstructorAccessorImpl.newInstance(DelegatingConstructorAccessorImpl.java:45)
	at java.lang.reflect.Constructor.newInstance(Constructor.java:526)
	at org.apache.hadoop.hdfs.server.namenode.FSEditLog.createJournal(FSEditLog.java:1697)
	at org.apache.hadoop.hdfs.server.namenode.FSEditLog.initJournals(FSEditLog.java:281)
	at org.apache.hadoop.hdfs.server.namenode.FSEditLog.initJournalsForWrite(FSEditLog.java:246)
	at org.apache.hadoop.hdfs.server.namenode.NameNode.format(NameNode.java:1001)
	at org.apache.hadoop.hdfs.server.namenode.NameNode.format(NameNode.java:361)
	at org.apache.hadoop.hdfs.DFSTestUtil.formatNameNode(DFSTestUtil.java:220)
	at org.apache.hadoop.hdfs.MiniDFSCluster.configureNameService(MiniDFSCluster.java:966)
	at org.apache.hadoop.hdfs.MiniDFSCluster.createNameNodesAndSetConf(MiniDFSCluster.java:887)
	at org.apache.hadoop.hdfs.MiniDFSCluster.initMiniDFSCluster(MiniDFSCluster.java:819)
	at org.apache.hadoop.hdfs.MiniDFSCluster.<init>(MiniDFSCluster.java:478)
	at org.apache.hadoop.hdfs.MiniDFSCluster$Builder.build(MiniDFSCluster.java:437)
	at org.apache.hadoop.hdfs.qjournal.MiniQJMHACluster.<init>(MiniQJMHACluster.java:110)
	at org.apache.hadoop.hdfs.qjournal.MiniQJMHACluster.<init>(MiniQJMHACluster.java:37)
	at org.apache.hadoop.hdfs.qjournal.MiniQJMHACluster$Builder.build(MiniQJMHACluster.java:65)
	at org.apache.hadoop.hdfs.server.namenode.ha.TestDFSUpgradeWithHA.testFinalizeWithJournalNodes(TestDFSUpgradeWithHA.java:398)


REGRESSION:  org.apache.hadoop.hdfs.server.namenode.ha.TestDFSUpgradeWithHA.testFinalizeFromSecondNameNodeWithJournalNodes

Error Message:
Unable to construct journal, qjournal://127.0.0.1:50187;127.0.0.1:36191;127.0.0.1:43346/ns1

Stack Trace:
java.lang.IllegalArgumentException: Unable to construct journal, qjournal://127.0.0.1:50187;127.0.0.1:36191;127.0.0.1:43346/ns1
	at java.net.URLClassLoader$1.run(URLClassLoader.java:366)
	at java.net.URLClassLoader$1.run(URLClassLoader.java:355)
	at java.security.AccessController.doPrivileged(Native Method)
	at java.net.URLClassLoader.findClass(URLClassLoader.java:354)
	at java.lang.ClassLoader.loadClass(ClassLoader.java:425)
	at sun.misc.Launcher$AppClassLoader.loadClass(Launcher.java:308)
	at java.lang.ClassLoader.loadClass(ClassLoader.java:358)
	at org.apache.hadoop.hdfs.qjournal.client.QuorumJournalManager.<init>(QuorumJournalManager.java:117)
	at org.apache.hadoop.hdfs.qjournal.client.QuorumJournalManager.<init>(QuorumJournalManager.java:105)
	at sun.reflect.NativeConstructorAccessorImpl.newInstance0(Native Method)
	at sun.reflect.NativeConstructorAccessorImpl.newInstance(NativeConstructorAccessorImpl.java:57)
	at sun.reflect.DelegatingConstructorAccessorImpl.newInstance(DelegatingConstructorAccessorImpl.java:45)
	at java.lang.reflect.Constructor.newInstance(Constructor.java:526)
	at org.apache.hadoop.hdfs.server.namenode.FSEditLog.createJournal(FSEditLog.java:1697)
	at org.apache.hadoop.hdfs.server.namenode.FSEditLog.initJournals(FSEditLog.java:281)
	at org.apache.hadoop.hdfs.server.namenode.FSEditLog.initJournalsForWrite(FSEditLog.java:246)
	at org.apache.hadoop.hdfs.server.namenode.NameNode.format(NameNode.java:1001)
	at org.apache.hadoop.hdfs.server.namenode.NameNode.format(NameNode.java:361)
	at org.apache.hadoop.hdfs.DFSTestUtil.formatNameNode(DFSTestUtil.java:220)
	at org.apache.hadoop.hdfs.MiniDFSCluster.configureNameService(MiniDFSCluster.java:966)
	at org.apache.hadoop.hdfs.MiniDFSCluster.createNameNodesAndSetConf(MiniDFSCluster.java:887)
	at org.apache.hadoop.hdfs.MiniDFSCluster.initMiniDFSCluster(MiniDFSCluster.java:819)
	at org.apache.hadoop.hdfs.MiniDFSCluster.<init>(MiniDFSCluster.java:478)
	at org.apache.hadoop.hdfs.MiniDFSCluster$Builder.build(MiniDFSCluster.java:437)
	at org.apache.hadoop.hdfs.qjournal.MiniQJMHACluster.<init>(MiniQJMHACluster.java:110)
	at org.apache.hadoop.hdfs.qjournal.MiniQJMHACluster.<init>(MiniQJMHACluster.java:37)
	at org.apache.hadoop.hdfs.qjournal.MiniQJMHACluster$Builder.build(MiniQJMHACluster.java:65)
	at org.apache.hadoop.hdfs.server.namenode.ha.TestDFSUpgradeWithHA.testFinalizeFromSecondNameNodeWithJournalNodes(TestDFSUpgradeWithHA.java:467)


REGRESSION:  org.apache.hadoop.hdfs.server.namenode.ha.TestDFSUpgradeWithHA.testRollbackWithNfs

Error Message:
Problem in starting http server. Server handlers failed

Stack Trace:
java.io.IOException: Problem in starting http server. Server handlers failed
	at org.apache.hadoop.http.HttpServer2.start(HttpServer2.java:837)
	at org.apache.hadoop.hdfs.server.namenode.NameNodeHttpServer.start(NameNodeHttpServer.java:142)
	at org.apache.hadoop.hdfs.server.namenode.NameNode.startHttpServer(NameNode.java:769)
	at org.apache.hadoop.hdfs.server.namenode.NameNode.initialize(NameNode.java:620)
	at org.apache.hadoop.hdfs.server.namenode.NameNode.<init>(NameNode.java:826)
	at org.apache.hadoop.hdfs.server.namenode.NameNode.<init>(NameNode.java:810)
	at org.apache.hadoop.hdfs.server.namenode.NameNode.createNameNode(NameNode.java:1500)
	at org.apache.hadoop.hdfs.MiniDFSCluster.createNameNode(MiniDFSCluster.java:1213)
	at org.apache.hadoop.hdfs.MiniDFSCluster.configureNameService(MiniDFSCluster.java:976)
	at org.apache.hadoop.hdfs.MiniDFSCluster.createNameNodesAndSetConf(MiniDFSCluster.java:887)
	at org.apache.hadoop.hdfs.MiniDFSCluster.initMiniDFSCluster(MiniDFSCluster.java:819)
	at org.apache.hadoop.hdfs.MiniDFSCluster.<init>(MiniDFSCluster.java:478)
	at org.apache.hadoop.hdfs.MiniDFSCluster$Builder.build(MiniDFSCluster.java:437)
	at org.apache.hadoop.hdfs.server.namenode.ha.TestDFSUpgradeWithHA.testRollbackWithNfs(TestDFSUpgradeWithHA.java:556)


REGRESSION:  org.apache.hadoop.hdfs.server.namenode.ha.TestDFSUpgradeWithHA.testStartingWithUpgradeInProgressSucceeds

Error Message:
Problem in starting http server. Server handlers failed

Stack Trace:
java.io.IOException: Problem in starting http server. Server handlers failed
	at org.apache.hadoop.http.HttpServer2.start(HttpServer2.java:837)
	at org.apache.hadoop.hdfs.server.namenode.NameNodeHttpServer.start(NameNodeHttpServer.java:142)
	at org.apache.hadoop.hdfs.server.namenode.NameNode.startHttpServer(NameNode.java:769)
	at org.apache.hadoop.hdfs.server.namenode.NameNode.initialize(NameNode.java:620)
	at org.apache.hadoop.hdfs.server.namenode.NameNode.<init>(NameNode.java:826)
	at org.apache.hadoop.hdfs.server.namenode.NameNode.<init>(NameNode.java:810)
	at org.apache.hadoop.hdfs.server.namenode.NameNode.createNameNode(NameNode.java:1500)
	at org.apache.hadoop.hdfs.MiniDFSCluster.createNameNode(MiniDFSCluster.java:1213)
	at org.apache.hadoop.hdfs.MiniDFSCluster.configureNameService(MiniDFSCluster.java:976)
	at org.apache.hadoop.hdfs.MiniDFSCluster.createNameNodesAndSetConf(MiniDFSCluster.java:887)
	at org.apache.hadoop.hdfs.MiniDFSCluster.initMiniDFSCluster(MiniDFSCluster.java:819)
	at org.apache.hadoop.hdfs.MiniDFSCluster.<init>(MiniDFSCluster.java:478)
	at org.apache.hadoop.hdfs.MiniDFSCluster$Builder.build(MiniDFSCluster.java:437)
	at org.apache.hadoop.hdfs.server.namenode.ha.TestDFSUpgradeWithHA.testStartingWithUpgradeInProgressSucceeds(TestDFSUpgradeWithHA.java:526)


REGRESSION:  org.apache.hadoop.hdfs.server.namenode.ha.TestDFSUpgradeWithHA.testNfsUpgrade

Error Message:
Problem in starting http server. Server handlers failed

Stack Trace:
java.io.IOException: Problem in starting http server. Server handlers failed
	at org.apache.hadoop.http.HttpServer2.start(HttpServer2.java:837)
	at org.apache.hadoop.hdfs.server.namenode.NameNodeHttpServer.start(NameNodeHttpServer.java:142)
	at org.apache.hadoop.hdfs.server.namenode.NameNode.startHttpServer(NameNode.java:769)
	at org.apache.hadoop.hdfs.server.namenode.NameNode.initialize(NameNode.java:620)
	at org.apache.hadoop.hdfs.server.namenode.NameNode.<init>(NameNode.java:826)
	at org.apache.hadoop.hdfs.server.namenode.NameNode.<init>(NameNode.java:810)
	at org.apache.hadoop.hdfs.server.namenode.NameNode.createNameNode(NameNode.java:1500)
	at org.apache.hadoop.hdfs.MiniDFSCluster.createNameNode(MiniDFSCluster.java:1213)
	at org.apache.hadoop.hdfs.MiniDFSCluster.configureNameService(MiniDFSCluster.java:976)
	at org.apache.hadoop.hdfs.MiniDFSCluster.createNameNodesAndSetConf(MiniDFSCluster.java:887)
	at org.apache.hadoop.hdfs.MiniDFSCluster.initMiniDFSCluster(MiniDFSCluster.java:819)
	at org.apache.hadoop.hdfs.MiniDFSCluster.<init>(MiniDFSCluster.java:478)
	at org.apache.hadoop.hdfs.MiniDFSCluster$Builder.build(MiniDFSCluster.java:437)
	at org.apache.hadoop.hdfs.server.namenode.ha.TestDFSUpgradeWithHA.testNfsUpgrade(TestDFSUpgradeWithHA.java:238)


REGRESSION:  org.apache.hadoop.hdfs.server.namenode.ha.TestDFSUpgradeWithHA.testUpgradeWithJournalNodes

Error Message:
Unable to construct journal, qjournal://127.0.0.1:41902;127.0.0.1:40641;127.0.0.1:45207/ns1

Stack Trace:
java.lang.IllegalArgumentException: Unable to construct journal, qjournal://127.0.0.1:41902;127.0.0.1:40641;127.0.0.1:45207/ns1
	at java.net.URLClassLoader$1.run(URLClassLoader.java:366)
	at java.net.URLClassLoader$1.run(URLClassLoader.java:355)
	at java.security.AccessController.doPrivileged(Native Method)
	at java.net.URLClassLoader.findClass(URLClassLoader.java:354)
	at java.lang.ClassLoader.loadClass(ClassLoader.java:425)
	at sun.misc.Launcher$AppClassLoader.loadClass(Launcher.java:308)
	at java.lang.ClassLoader.loadClass(ClassLoader.java:358)
	at org.apache.hadoop.hdfs.qjournal.client.QuorumJournalManager.<init>(QuorumJournalManager.java:117)
	at org.apache.hadoop.hdfs.qjournal.client.QuorumJournalManager.<init>(QuorumJournalManager.java:105)
	at sun.reflect.NativeConstructorAccessorImpl.newInstance0(Native Method)
	at sun.reflect.NativeConstructorAccessorImpl.newInstance(NativeConstructorAccessorImpl.java:57)
	at sun.reflect.DelegatingConstructorAccessorImpl.newInstance(DelegatingConstructorAccessorImpl.java:45)
	at java.lang.reflect.Constructor.newInstance(Constructor.java:526)
	at org.apache.hadoop.hdfs.server.namenode.FSEditLog.createJournal(FSEditLog.java:1697)
	at org.apache.hadoop.hdfs.server.namenode.FSEditLog.initJournals(FSEditLog.java:281)
	at org.apache.hadoop.hdfs.server.namenode.FSEditLog.initJournalsForWrite(FSEditLog.java:246)
	at org.apache.hadoop.hdfs.server.namenode.NameNode.format(NameNode.java:1001)
	at org.apache.hadoop.hdfs.server.namenode.NameNode.format(NameNode.java:361)
	at org.apache.hadoop.hdfs.DFSTestUtil.formatNameNode(DFSTestUtil.java:220)
	at org.apache.hadoop.hdfs.MiniDFSCluster.configureNameService(MiniDFSCluster.java:966)
	at org.apache.hadoop.hdfs.MiniDFSCluster.createNameNodesAndSetConf(MiniDFSCluster.java:887)
	at org.apache.hadoop.hdfs.MiniDFSCluster.initMiniDFSCluster(MiniDFSCluster.java:819)
	at org.apache.hadoop.hdfs.MiniDFSCluster.<init>(MiniDFSCluster.java:478)
	at org.apache.hadoop.hdfs.MiniDFSCluster$Builder.build(MiniDFSCluster.java:437)
	at org.apache.hadoop.hdfs.qjournal.MiniQJMHACluster.<init>(MiniQJMHACluster.java:110)
	at org.apache.hadoop.hdfs.qjournal.MiniQJMHACluster.<init>(MiniQJMHACluster.java:37)
	at org.apache.hadoop.hdfs.qjournal.MiniQJMHACluster$Builder.build(MiniQJMHACluster.java:65)
	at org.apache.hadoop.hdfs.server.namenode.ha.TestDFSUpgradeWithHA.testUpgradeWithJournalNodes(TestDFSUpgradeWithHA.java:323)


REGRESSION:  org.apache.hadoop.hdfs.server.namenode.ha.TestDFSUpgradeWithHA.testRollbackWithJournalNodes

Error Message:
Unable to construct journal, qjournal://127.0.0.1:35606;127.0.0.1:36843;127.0.0.1:39015/ns1

Stack Trace:
java.lang.IllegalArgumentException: Unable to construct journal, qjournal://127.0.0.1:35606;127.0.0.1:36843;127.0.0.1:39015/ns1
	at java.net.URLClassLoader$1.run(URLClassLoader.java:366)
	at java.net.URLClassLoader$1.run(URLClassLoader.java:355)
	at java.security.AccessController.doPrivileged(Native Method)
	at java.net.URLClassLoader.findClass(URLClassLoader.java:354)
	at java.lang.ClassLoader.loadClass(ClassLoader.java:425)
	at sun.misc.Launcher$AppClassLoader.loadClass(Launcher.java:308)
	at java.lang.ClassLoader.loadClass(ClassLoader.java:358)
	at org.apache.hadoop.hdfs.qjournal.client.QuorumJournalManager.<init>(QuorumJournalManager.java:117)
	at org.apache.hadoop.hdfs.qjournal.client.QuorumJournalManager.<init>(QuorumJournalManager.java:105)
	at sun.reflect.NativeConstructorAccessorImpl.newInstance0(Native Method)
	at sun.reflect.NativeConstructorAccessorImpl.newInstance(NativeConstructorAccessorImpl.java:57)
	at sun.reflect.DelegatingConstructorAccessorImpl.newInstance(DelegatingConstructorAccessorImpl.java:45)
	at java.lang.reflect.Constructor.newInstance(Constructor.java:526)
	at org.apache.hadoop.hdfs.server.namenode.FSEditLog.createJournal(FSEditLog.java:1697)
	at org.apache.hadoop.hdfs.server.namenode.FSEditLog.initJournals(FSEditLog.java:281)
	at org.apache.hadoop.hdfs.server.namenode.FSEditLog.initJournalsForWrite(FSEditLog.java:246)
	at org.apache.hadoop.hdfs.server.namenode.NameNode.format(NameNode.java:1001)
	at org.apache.hadoop.hdfs.server.namenode.NameNode.format(NameNode.java:361)
	at org.apache.hadoop.hdfs.DFSTestUtil.formatNameNode(DFSTestUtil.java:220)
	at org.apache.hadoop.hdfs.MiniDFSCluster.configureNameService(MiniDFSCluster.java:966)
	at org.apache.hadoop.hdfs.MiniDFSCluster.createNameNodesAndSetConf(MiniDFSCluster.java:887)
	at org.apache.hadoop.hdfs.MiniDFSCluster.initMiniDFSCluster(MiniDFSCluster.java:819)
	at org.apache.hadoop.hdfs.MiniDFSCluster.<init>(MiniDFSCluster.java:478)
	at org.apache.hadoop.hdfs.MiniDFSCluster$Builder.build(MiniDFSCluster.java:437)
	at org.apache.hadoop.hdfs.qjournal.MiniQJMHACluster.<init>(MiniQJMHACluster.java:110)
	at org.apache.hadoop.hdfs.qjournal.MiniQJMHACluster.<init>(MiniQJMHACluster.java:37)
	at org.apache.hadoop.hdfs.qjournal.MiniQJMHACluster$Builder.build(MiniQJMHACluster.java:65)
	at org.apache.hadoop.hdfs.server.namenode.ha.TestDFSUpgradeWithHA.testRollbackWithJournalNodes(TestDFSUpgradeWithHA.java:631)


REGRESSION:  org.apache.hadoop.hdfs.server.namenode.ha.TestDFSUpgradeWithHA.testCannotUpgradeSecondNameNode

Error Message:
Problem in starting http server. Server handlers failed

Stack Trace:
java.io.IOException: Problem in starting http server. Server handlers failed
	at org.apache.hadoop.http.HttpServer2.start(HttpServer2.java:837)
	at org.apache.hadoop.hdfs.server.namenode.NameNodeHttpServer.start(NameNodeHttpServer.java:142)
	at org.apache.hadoop.hdfs.server.namenode.NameNode.startHttpServer(NameNode.java:769)
	at org.apache.hadoop.hdfs.server.namenode.NameNode.initialize(NameNode.java:620)
	at org.apache.hadoop.hdfs.server.namenode.NameNode.<init>(NameNode.java:826)
	at org.apache.hadoop.hdfs.server.namenode.NameNode.<init>(NameNode.java:810)
	at org.apache.hadoop.hdfs.server.namenode.NameNode.createNameNode(NameNode.java:1500)
	at org.apache.hadoop.hdfs.MiniDFSCluster.createNameNode(MiniDFSCluster.java:1213)
	at org.apache.hadoop.hdfs.MiniDFSCluster.configureNameService(MiniDFSCluster.java:976)
	at org.apache.hadoop.hdfs.MiniDFSCluster.createNameNodesAndSetConf(MiniDFSCluster.java:887)
	at org.apache.hadoop.hdfs.MiniDFSCluster.initMiniDFSCluster(MiniDFSCluster.java:819)
	at org.apache.hadoop.hdfs.MiniDFSCluster.<init>(MiniDFSCluster.java:478)
	at org.apache.hadoop.hdfs.MiniDFSCluster$Builder.build(MiniDFSCluster.java:437)
	at org.apache.hadoop.hdfs.server.namenode.ha.TestDFSUpgradeWithHA.testCannotUpgradeSecondNameNode(TestDFSUpgradeWithHA.java:714)


REGRESSION:  org.apache.hadoop.hdfs.server.namenode.ha.TestDFSUpgradeWithHA.testCannotFinalizeIfNoActive

Error Message:
Problem in starting http server. Server handlers failed

Stack Trace:
java.io.IOException: Problem in starting http server. Server handlers failed
	at org.apache.hadoop.http.HttpServer2.start(HttpServer2.java:837)
	at org.apache.hadoop.hdfs.server.namenode.NameNodeHttpServer.start(NameNodeHttpServer.java:142)
	at org.apache.hadoop.hdfs.server.namenode.NameNode.startHttpServer(NameNode.java:769)
	at org.apache.hadoop.hdfs.server.namenode.NameNode.initialize(NameNode.java:620)
	at org.apache.hadoop.hdfs.server.namenode.NameNode.<init>(NameNode.java:826)
	at org.apache.hadoop.hdfs.server.namenode.NameNode.<init>(NameNode.java:810)
	at org.apache.hadoop.hdfs.server.namenode.NameNode.createNameNode(NameNode.java:1500)
	at org.apache.hadoop.hdfs.MiniDFSCluster.createNameNode(MiniDFSCluster.java:1213)
	at org.apache.hadoop.hdfs.MiniDFSCluster.configureNameService(MiniDFSCluster.java:976)
	at org.apache.hadoop.hdfs.MiniDFSCluster.createNameNodesAndSetConf(MiniDFSCluster.java:887)
	at org.apache.hadoop.hdfs.MiniDFSCluster.initMiniDFSCluster(MiniDFSCluster.java:819)
	at org.apache.hadoop.hdfs.MiniDFSCluster.<init>(MiniDFSCluster.java:478)
	at org.apache.hadoop.hdfs.MiniDFSCluster$Builder.build(MiniDFSCluster.java:437)
	at org.apache.hadoop.hdfs.server.namenode.ha.TestDFSUpgradeWithHA.testCannotFinalizeIfNoActive(TestDFSUpgradeWithHA.java:156)


REGRESSION:  org.apache.hadoop.hdfs.server.namenode.ha.TestFailureToReadEdits.testFailuretoReadEdits[0]

Error Message:
org/apache/hadoop/ipc/ProtobufHelper

Stack Trace:
java.lang.NoClassDefFoundError: org/apache/hadoop/ipc/ProtobufHelper
	at java.net.URLClassLoader$1.run(URLClassLoader.java:366)
	at java.net.URLClassLoader$1.run(URLClassLoader.java:355)
	at java.security.AccessController.doPrivileged(Native Method)
	at java.net.URLClassLoader.findClass(URLClassLoader.java:354)
	at java.lang.ClassLoader.loadClass(ClassLoader.java:425)
	at sun.misc.Launcher$AppClassLoader.loadClass(Launcher.java:308)
	at java.lang.ClassLoader.loadClass(ClassLoader.java:358)
	at org.apache.hadoop.hdfs.protocolPB.ClientNamenodeProtocolTranslatorPB.delete(ClientNamenodeProtocolTranslatorPB.java:543)
	at sun.reflect.NativeMethodAccessorImpl.invoke0(Native Method)
	at sun.reflect.NativeMethodAccessorImpl.invoke(NativeMethodAccessorImpl.java:57)
	at sun.reflect.DelegatingMethodAccessorImpl.invoke(DelegatingMethodAccessorImpl.java:43)
	at java.lang.reflect.Method.invoke(Method.java:606)
	at org.apache.hadoop.io.retry.RetryInvocationHandler.invokeMethod(RetryInvocationHandler.java:251)
	at org.apache.hadoop.io.retry.RetryInvocationHandler.invoke(RetryInvocationHandler.java:103)
	at com.sun.proxy.$Proxy22.delete(Unknown Source)
	at org.apache.hadoop.hdfs.DFSClient.delete(DFSClient.java:1603)
	at org.apache.hadoop.hdfs.DistributedFileSystem$15.doCall(DistributedFileSystem.java:704)
	at org.apache.hadoop.hdfs.DistributedFileSystem$15.doCall(DistributedFileSystem.java:700)
	at org.apache.hadoop.fs.FileSystemLinkResolver.resolve(FileSystemLinkResolver.java:81)
	at org.apache.hadoop.hdfs.DistributedFileSystem.delete(DistributedFileSystem.java:700)
	at org.apache.hadoop.hdfs.server.namenode.ha.TestFailureToReadEdits.testFailuretoReadEdits(TestFailureToReadEdits.java:158)


REGRESSION:  org.apache.hadoop.hdfs.server.namenode.ha.TestFailureToReadEdits.testFailureToReadEditsOnTransitionToActive[0]

Error Message:
org/apache/hadoop/test/GenericTestUtils

Stack Trace:
java.lang.NoClassDefFoundError: org/apache/hadoop/test/GenericTestUtils
	at java.net.URLClassLoader$1.run(URLClassLoader.java:366)
	at java.net.URLClassLoader$1.run(URLClassLoader.java:355)
	at java.security.AccessController.doPrivileged(Native Method)
	at java.net.URLClassLoader.findClass(URLClassLoader.java:354)
	at java.lang.ClassLoader.loadClass(ClassLoader.java:425)
	at sun.misc.Launcher$AppClassLoader.loadClass(Launcher.java:308)
	at java.lang.ClassLoader.loadClass(ClassLoader.java:358)
	at org.apache.hadoop.hdfs.server.namenode.ha.TestFailureToReadEdits.testFailureToReadEditsOnTransitionToActive(TestFailureToReadEdits.java:296)


REGRESSION:  org.apache.hadoop.hdfs.server.namenode.ha.TestFailureToReadEdits.testCheckpointStartingMidEditsFile[1]

Error Message:
org/apache/hadoop/util/DiskChecker

Stack Trace:
java.lang.NoClassDefFoundError: org/apache/hadoop/util/DiskChecker
	at java.net.URLClassLoader$1.run(URLClassLoader.java:366)
	at java.net.URLClassLoader$1.run(URLClassLoader.java:355)
	at java.security.AccessController.doPrivileged(Native Method)
	at java.net.URLClassLoader.findClass(URLClassLoader.java:354)
	at java.lang.ClassLoader.loadClass(ClassLoader.java:425)
	at sun.misc.Launcher$AppClassLoader.loadClass(Launcher.java:308)
	at java.lang.ClassLoader.loadClass(ClassLoader.java:358)
	at org.apache.hadoop.hdfs.qjournal.server.JournalNode.validateAndCreateJournalDir(JournalNode.java:116)
	at org.apache.hadoop.hdfs.qjournal.server.JournalNode.start(JournalNode.java:136)
	at org.apache.hadoop.hdfs.qjournal.MiniJournalCluster.<init>(MiniJournalCluster.java:106)
	at org.apache.hadoop.hdfs.qjournal.MiniJournalCluster.<init>(MiniJournalCluster.java:39)
	at org.apache.hadoop.hdfs.qjournal.MiniJournalCluster$Builder.build(MiniJournalCluster.java:66)
	at org.apache.hadoop.hdfs.qjournal.MiniQJMHACluster.<init>(MiniQJMHACluster.java:99)
	at org.apache.hadoop.hdfs.qjournal.MiniQJMHACluster.<init>(MiniQJMHACluster.java:37)
	at org.apache.hadoop.hdfs.qjournal.MiniQJMHACluster$Builder.build(MiniQJMHACluster.java:65)
	at org.apache.hadoop.hdfs.server.namenode.ha.TestFailureToReadEdits.setUpCluster(TestFailureToReadEdits.java:117)


REGRESSION:  org.apache.hadoop.hdfs.server.namenode.ha.TestFailureToReadEdits.testFailuretoReadEdits[1]

Error Message:
org/apache/hadoop/util/DiskChecker

Stack Trace:
java.lang.NoClassDefFoundError: org/apache/hadoop/util/DiskChecker
	at org.apache.hadoop.hdfs.qjournal.server.JournalNode.validateAndCreateJournalDir(JournalNode.java:116)
	at org.apache.hadoop.hdfs.qjournal.server.JournalNode.start(JournalNode.java:136)
	at org.apache.hadoop.hdfs.qjournal.MiniJournalCluster.<init>(MiniJournalCluster.java:106)
	at org.apache.hadoop.hdfs.qjournal.MiniJournalCluster.<init>(MiniJournalCluster.java:39)
	at org.apache.hadoop.hdfs.qjournal.MiniJournalCluster$Builder.build(MiniJournalCluster.java:66)
	at org.apache.hadoop.hdfs.qjournal.MiniQJMHACluster.<init>(MiniQJMHACluster.java:99)
	at org.apache.hadoop.hdfs.qjournal.MiniQJMHACluster.<init>(MiniQJMHACluster.java:37)
	at org.apache.hadoop.hdfs.qjournal.MiniQJMHACluster$Builder.build(MiniQJMHACluster.java:65)
	at org.apache.hadoop.hdfs.server.namenode.ha.TestFailureToReadEdits.setUpCluster(TestFailureToReadEdits.java:117)


REGRESSION:  org.apache.hadoop.hdfs.server.namenode.ha.TestFailureToReadEdits.testFailureToReadEditsOnTransitionToActive[1]

Error Message:
org/apache/hadoop/util/DiskChecker

Stack Trace:
java.lang.NoClassDefFoundError: org/apache/hadoop/util/DiskChecker
	at org.apache.hadoop.hdfs.qjournal.server.JournalNode.validateAndCreateJournalDir(JournalNode.java:116)
	at org.apache.hadoop.hdfs.qjournal.server.JournalNode.start(JournalNode.java:136)
	at org.apache.hadoop.hdfs.qjournal.MiniJournalCluster.<init>(MiniJournalCluster.java:106)
	at org.apache.hadoop.hdfs.qjournal.MiniJournalCluster.<init>(MiniJournalCluster.java:39)
	at org.apache.hadoop.hdfs.qjournal.MiniJournalCluster$Builder.build(MiniJournalCluster.java:66)
	at org.apache.hadoop.hdfs.qjournal.MiniQJMHACluster.<init>(MiniQJMHACluster.java:99)
	at org.apache.hadoop.hdfs.qjournal.MiniQJMHACluster.<init>(MiniQJMHACluster.java:37)
	at org.apache.hadoop.hdfs.qjournal.MiniQJMHACluster$Builder.build(MiniQJMHACluster.java:65)
	at org.apache.hadoop.hdfs.server.namenode.ha.TestFailureToReadEdits.setUpCluster(TestFailureToReadEdits.java:117)



Mime
  • Unnamed multipart/mixed (inline, None, 0 bytes)
View raw message