hadoop-hdfs-dev mailing list archives

Site index · List index
Message view « Date » · « Thread »
Top « Date » · « Thread »
From Apache Jenkins Server <jenk...@builds.apache.org>
Subject Hadoop-Hdfs-trunk - Build # 2372 - Still Failing
Date Tue, 29 Sep 2015 05:05:33 GMT
See https://builds.apache.org/job/Hadoop-Hdfs-trunk/2372/

###################################################################################
########################## LAST 60 LINES OF THE CONSOLE ###########################
[...truncated 7488 lines...]
[INFO] 
[INFO] --- maven-source-plugin:2.3:test-jar-no-fork (hadoop-java-sources) @ hadoop-hdfs-project
---
[INFO] 
[INFO] --- maven-enforcer-plugin:1.3.1:enforce (dist-enforce) @ hadoop-hdfs-project ---
[INFO] 
[INFO] --- maven-site-plugin:3.4:attach-descriptor (attach-descriptor) @ hadoop-hdfs-project
---
[INFO] 
[INFO] --- maven-javadoc-plugin:2.8.1:jar (module-javadocs) @ hadoop-hdfs-project ---
[INFO] Skipping javadoc generation
[INFO] 
[INFO] --- maven-enforcer-plugin:1.3.1:enforce (depcheck) @ hadoop-hdfs-project ---
[INFO] 
[INFO] --- maven-checkstyle-plugin:2.15:checkstyle (default-cli) @ hadoop-hdfs-project ---
[INFO] 
[INFO] --- findbugs-maven-plugin:3.0.0:findbugs (default-cli) @ hadoop-hdfs-project ---
[INFO] ------------------------------------------------------------------------
[INFO] Reactor Summary:
[INFO] 
[INFO] Apache Hadoop HDFS Client ......................... SUCCESS [03:22 min]
[INFO] Apache Hadoop HDFS ................................ FAILURE [  02:45 h]
[INFO] Apache Hadoop HttpFS .............................. SKIPPED
[INFO] Apache Hadoop HDFS BookKeeper Journal ............. SKIPPED
[INFO] Apache Hadoop HDFS-NFS ............................ SKIPPED
[INFO] Apache Hadoop HDFS Project ........................ SUCCESS [  0.061 s]
[INFO] ------------------------------------------------------------------------
[INFO] BUILD FAILURE
[INFO] ------------------------------------------------------------------------
[INFO] Total time: 02:48 h
[INFO] Finished at: 2015-09-29T05:05:22+00:00
[INFO] Final Memory: 56M/616M
[INFO] ------------------------------------------------------------------------
[ERROR] Failed to execute goal org.apache.maven.plugins:maven-surefire-plugin:2.17:test (default-test)
on project hadoop-hdfs: There are test failures.
[ERROR] 
[ERROR] Please refer to /home/jenkins/jenkins-slave/workspace/Hadoop-Hdfs-trunk/hadoop-hdfs-project/hadoop-hdfs/target/surefire-reports
for the individual test results.
[ERROR] -> [Help 1]
[ERROR] 
[ERROR] To see the full stack trace of the errors, re-run Maven with the -e switch.
[ERROR] Re-run Maven using the -X switch to enable full debug logging.
[ERROR] 
[ERROR] For more information about the errors and possible solutions, please read the following
articles:
[ERROR] [Help 1] http://cwiki.apache.org/confluence/display/MAVEN/MojoFailureException
[ERROR] 
[ERROR] After correcting the problems, you can resume the build with the command
[ERROR]   mvn <goals> -rf :hadoop-hdfs
Build step 'Execute shell' marked build as failure
Archiving artifacts
Sending artifact delta relative to Hadoop-Hdfs-trunk #2342
Archived 1 artifacts
Archive block size is 32768
Received 0 blocks and 4798391 bytes
Compression is 0.0%
Took 2.3 sec
Recording test results
Updating HDFS-9092
Updating HADOOP-12440
Updating YARN-4180
Sending e-mails to: hdfs-dev@hadoop.apache.org
Email was triggered for: Failure
Sending email for trigger: Failure



###################################################################################
############################## FAILED TESTS (if any) ##############################
8 tests failed.
REGRESSION:  org.apache.hadoop.hdfs.server.datanode.TestBpServiceActorScheduler.testScheduleBlockReportImmediate

Error Message:
org/apache/hadoop/util/Time

Stack Trace:
java.lang.NoClassDefFoundError: org/apache/hadoop/util/Time
	at java.net.URLClassLoader$1.run(URLClassLoader.java:366)
	at java.net.URLClassLoader$1.run(URLClassLoader.java:355)
	at java.security.AccessController.doPrivileged(Native Method)
	at java.net.URLClassLoader.findClass(URLClassLoader.java:354)
	at java.lang.ClassLoader.loadClass(ClassLoader.java:425)
	at sun.misc.Launcher$AppClassLoader.loadClass(Launcher.java:308)
	at java.lang.ClassLoader.loadClass(ClassLoader.java:358)
	at org.apache.hadoop.hdfs.server.datanode.BPServiceActor$Scheduler.monotonicNow(BPServiceActor.java:1136)
	at org.apache.hadoop.hdfs.server.datanode.BPServiceActor$Scheduler.<init>(BPServiceActor.java:1032)
	at org.apache.hadoop.hdfs.server.datanode.TestBpServiceActorScheduler.makeMockScheduler(TestBpServiceActorScheduler.java:149)
	at org.apache.hadoop.hdfs.server.datanode.TestBpServiceActorScheduler.testScheduleBlockReportImmediate(TestBpServiceActorScheduler.java:67)


REGRESSION:  org.apache.hadoop.hdfs.server.datanode.TestBpServiceActorScheduler.testInit

Error Message:
org/apache/hadoop/util/Time

Stack Trace:
java.lang.NoClassDefFoundError: org/apache/hadoop/util/Time
	at org.apache.hadoop.hdfs.server.datanode.BPServiceActor$Scheduler.monotonicNow(BPServiceActor.java:1136)
	at org.apache.hadoop.hdfs.server.datanode.BPServiceActor$Scheduler.<init>(BPServiceActor.java:1032)
	at org.apache.hadoop.hdfs.server.datanode.TestBpServiceActorScheduler.makeMockScheduler(TestBpServiceActorScheduler.java:149)
	at org.apache.hadoop.hdfs.server.datanode.TestBpServiceActorScheduler.testInit(TestBpServiceActorScheduler.java:58)


REGRESSION:  org.apache.hadoop.hdfs.server.datanode.TestBpServiceActorScheduler.testScheduleHeartbeat

Error Message:
org/apache/hadoop/util/Time

Stack Trace:
java.lang.NoClassDefFoundError: org/apache/hadoop/util/Time
	at org.apache.hadoop.hdfs.server.datanode.BPServiceActor$Scheduler.monotonicNow(BPServiceActor.java:1136)
	at org.apache.hadoop.hdfs.server.datanode.BPServiceActor$Scheduler.<init>(BPServiceActor.java:1032)
	at org.apache.hadoop.hdfs.server.datanode.TestBpServiceActorScheduler.makeMockScheduler(TestBpServiceActorScheduler.java:149)
	at org.apache.hadoop.hdfs.server.datanode.TestBpServiceActorScheduler.testScheduleHeartbeat(TestBpServiceActorScheduler.java:139)


REGRESSION:  org.apache.hadoop.hdfs.server.datanode.TestBpServiceActorScheduler.testScheduleNextBlockReport2

Error Message:
org/apache/hadoop/util/Time

Stack Trace:
java.lang.NoClassDefFoundError: org/apache/hadoop/util/Time
	at org.apache.hadoop.hdfs.server.datanode.BPServiceActor$Scheduler.monotonicNow(BPServiceActor.java:1136)
	at org.apache.hadoop.hdfs.server.datanode.BPServiceActor$Scheduler.<init>(BPServiceActor.java:1032)
	at org.apache.hadoop.hdfs.server.datanode.TestBpServiceActorScheduler.makeMockScheduler(TestBpServiceActorScheduler.java:149)
	at org.apache.hadoop.hdfs.server.datanode.TestBpServiceActorScheduler.testScheduleNextBlockReport2(TestBpServiceActorScheduler.java:107)


REGRESSION:  org.apache.hadoop.hdfs.server.datanode.TestBpServiceActorScheduler.testScheduleNextBlockReport3

Error Message:
org/apache/hadoop/util/Time

Stack Trace:
java.lang.NoClassDefFoundError: org/apache/hadoop/util/Time
	at org.apache.hadoop.hdfs.server.datanode.BPServiceActor$Scheduler.monotonicNow(BPServiceActor.java:1136)
	at org.apache.hadoop.hdfs.server.datanode.BPServiceActor$Scheduler.<init>(BPServiceActor.java:1032)
	at org.apache.hadoop.hdfs.server.datanode.TestBpServiceActorScheduler.makeMockScheduler(TestBpServiceActorScheduler.java:149)
	at org.apache.hadoop.hdfs.server.datanode.TestBpServiceActorScheduler.testScheduleNextBlockReport3(TestBpServiceActorScheduler.java:121)


REGRESSION:  org.apache.hadoop.hdfs.server.datanode.TestBpServiceActorScheduler.testScheduleBlockReportDelayed

Error Message:
org/apache/hadoop/util/Time

Stack Trace:
java.lang.NoClassDefFoundError: org/apache/hadoop/util/Time
	at org.apache.hadoop.hdfs.server.datanode.BPServiceActor$Scheduler.monotonicNow(BPServiceActor.java:1136)
	at org.apache.hadoop.hdfs.server.datanode.BPServiceActor$Scheduler.<init>(BPServiceActor.java:1032)
	at org.apache.hadoop.hdfs.server.datanode.TestBpServiceActorScheduler.makeMockScheduler(TestBpServiceActorScheduler.java:149)
	at org.apache.hadoop.hdfs.server.datanode.TestBpServiceActorScheduler.testScheduleBlockReportDelayed(TestBpServiceActorScheduler.java:77)


REGRESSION:  org.apache.hadoop.hdfs.server.datanode.TestBpServiceActorScheduler.testScheduleNextBlockReport

Error Message:
org/apache/hadoop/util/Time

Stack Trace:
java.lang.NoClassDefFoundError: org/apache/hadoop/util/Time
	at org.apache.hadoop.hdfs.server.datanode.BPServiceActor$Scheduler.monotonicNow(BPServiceActor.java:1136)
	at org.apache.hadoop.hdfs.server.datanode.BPServiceActor$Scheduler.<init>(BPServiceActor.java:1032)
	at org.apache.hadoop.hdfs.server.datanode.TestBpServiceActorScheduler.makeMockScheduler(TestBpServiceActorScheduler.java:149)
	at org.apache.hadoop.hdfs.server.datanode.TestBpServiceActorScheduler.testScheduleNextBlockReport(TestBpServiceActorScheduler.java:93)


FAILED:  org.apache.hadoop.hdfs.server.datanode.TestDirectoryScanner.testThrottling

Error Message:
Throttle is too permissive

Stack Trace:
java.lang.AssertionError: Throttle is too permissive
	at org.junit.Assert.fail(Assert.java:88)
	at org.junit.Assert.assertTrue(Assert.java:41)
	at org.apache.hadoop.hdfs.server.datanode.TestDirectoryScanner.testThrottling(TestDirectoryScanner.java:613)



Mime
  • Unnamed multipart/mixed (inline, None, 0 bytes)
View raw message