hadoop-hdfs-dev mailing list archives

Site index · List index
Message view « Date » · « Thread »
Top « Date » · « Thread »
From Apache Jenkins Server <jenk...@builds.apache.org>
Subject Build failed in Jenkins: Hadoop-Hdfs-trunk-Java8 #340
Date Tue, 08 Sep 2015 03:26:06 GMT
See <https://builds.apache.org/job/Hadoop-Hdfs-trunk-Java8/340/changes>

Changes:

[xgong] Modify the CHANGES.txt to move YARN-2019 Commit log from branch 2.8 to

------------------------------------------
[...truncated 21181 lines...]
  TestEncryptedTransfer.testEncryptedAppendRequiringBlockTransfer:595 » NoSuchMethod
  TestEncryptedTransfer.testEncryptedReadAfterNameNodeRestart:297 » NoSuchMethod
  TestEncryptedTransfer.testClientThatDoesNotSupportEncryption:354 » NoSuchMethod
  TestEncryptedTransfer.testLongLivedClient:479 » NoSuchMethod org.apache.hadoop...
  TestEncryptedTransfer.testEncryptedReadWithAES:257 » NoSuchMethod org.apache.h...
  TestEncryptedTransfer.testEncryptedReadWithRC4:202 » NoSuchMethod org.apache.h...
  TestEncryptedTransfer.testLongLivedReadClientAfterRestart:397 » NoSuchMethod o...
  TestEncryptedTransfer.testEncryptedRead:147 » NoSuchMethod org.apache.hadoop.u...
  TestRemoteBlockReader2>TestBlockReaderBase.shutdown:71 » NoSuchMethod org.apac...
  TestFileConcurrentReader.testImmediateReadOfNewFile:211->init:94 » NoSuchMethod
  TestFileConcurrentReader.tearDown:88 » NoSuchMethod org.apache.hadoop.util.Shu...
  TestFileConcurrentReader.testUnfinishedBlockCRCErrorTransferToVerySmallWrite:288->runTestUnfinishedBlockCRCError:319->runTestUnfinishedBlockCRCError:332->init:94
» NoSuchMethod
  TestFileConcurrentReader.tearDown:88 » NoSuchMethod org.apache.hadoop.util.Shu...
  TestFileConcurrentReader.tearDown:88 » NoSuchMethod org.apache.hadoop.util.Shu...
  TestFileConcurrentReader.tearDown:88 » NoSuchMethod org.apache.hadoop.util.Shu...
  TestFileConcurrentReader.testUnfinishedBlockCRCErrorTransferTo:282->runTestUnfinishedBlockCRCError:319->runTestUnfinishedBlockCRCError:332->init:94
» NoSuchMethod
  TestFileConcurrentReader.tearDown:88 » NoSuchMethod org.apache.hadoop.util.Shu...
  TestFileConcurrentReader.testUnfinishedBlockCRCErrorNormalTransfer:300->runTestUnfinishedBlockCRCError:319->runTestUnfinishedBlockCRCError:332->init:94
» NoSuchMethod
  TestFileConcurrentReader.tearDown:88 » NoSuchMethod org.apache.hadoop.util.Shu...
  TestFileConcurrentReader.testUnfinishedBlockCRCErrorNormalTransferVerySmallWrite:306->runTestUnfinishedBlockCRCError:319->runTestUnfinishedBlockCRCError:332->init:94
» NoSuchMethod
  TestFileConcurrentReader.tearDown:88 » NoSuchMethod org.apache.hadoop.util.Shu...
  TestDFSPermission.tearDown:124 » NoSuchMethod org.apache.hadoop.util.ShutdownH...
  TestDFSPermission.tearDown:124 » NoSuchMethod org.apache.hadoop.util.ShutdownH...
  TestDFSPermission.tearDown:124 » NoSuchMethod org.apache.hadoop.util.ShutdownH...
  TestDFSPermission.tearDown:124 » NoSuchMethod org.apache.hadoop.util.ShutdownH...
  TestDFSPermission.tearDown:124 » NoSuchMethod org.apache.hadoop.util.ShutdownH...
  TestDFSPermission.tearDown:124 » NoSuchMethod org.apache.hadoop.util.ShutdownH...
  TestDFSPermission.tearDown:124 » NoSuchMethod org.apache.hadoop.util.ShutdownH...
  TestModTime.testModTimePersistsAfterRestart:217 » NoSuchMethod org.apache.hado...
  TestModTime.testModTime:178 » NoSuchMethod org.apache.hadoop.util.ShutdownHook...
  TestDataTransferKeepalive.teardown:72 » NoSuchMethod org.apache.hadoop.util.Sh...
  TestDataTransferKeepalive.teardown:72 » NoSuchMethod org.apache.hadoop.util.Sh...
  TestDataTransferKeepalive.teardown:72 » NoSuchMethod org.apache.hadoop.util.Sh...
  TestDataTransferKeepalive.teardown:72 » NoSuchMethod org.apache.hadoop.util.Sh...
  TestDatanodeStartupFixesLegacyStorageIDs.testUpgradeFrom22via26FixesStorageIDs:125->runLayoutUpgradeTest:70->upgradeAndVerify:103
» NoSuchMethod
  TestDatanodeStartupFixesLegacyStorageIDs.testUpgradeFrom26PreservesStorageIDs:136->runLayoutUpgradeTest:70->upgradeAndVerify:103
» NoSuchMethod
  TestDatanodeStartupFixesLegacyStorageIDs.testUpgradeFrom22FixesStorageIDs:115->runLayoutUpgradeTest:70->upgradeAndVerify:103
» NoSuchMethod
  TestShortCircuitLocalRead.testReadFromAnOffset:332->doTestShortCircuitRead:240->doTestShortCircuitReadImpl:292
» NoSuchMethod
  TestShortCircuitLocalRead.testSkipWithVerifyChecksum:427 » NoSuchMethod org.ap...
  TestShortCircuitLocalRead.testSmallFileLocalRead:308->doTestShortCircuitRead:240->doTestShortCircuitReadImpl:292
» NoSuchMethod
  TestShortCircuitLocalRead.testLongFile:338->doTestShortCircuitRead:240->doTestShortCircuitReadImpl:292
» NoSuchMethod
  TestShortCircuitLocalRead.testReadWithRemoteBlockReader:582->doTestShortCircuitReadWithRemoteBlockReader:624
» NoSuchMethod
  TestShortCircuitLocalRead.testFileLocalReadNoChecksum:298->doTestShortCircuitRead:240->doTestShortCircuitReadImpl:292
» NoSuchMethod
  TestShortCircuitLocalRead.testLocalReadLegacy:316->doTestShortCircuitReadLegacy:234->doTestShortCircuitReadImpl:292
» NoSuchMethod
  TestShortCircuitLocalRead.testLocalReadFallback:327->doTestShortCircuitReadLegacy:234->doTestShortCircuitReadImpl:292
» NoSuchMethod
  TestShortCircuitLocalRead.testFileLocalReadChecksum:303->doTestShortCircuitRead:240->doTestShortCircuitReadImpl:292
» NoSuchMethod
  TestShortCircuitLocalRead.testHandleTruncatedBlockFile:506 » NoSuchMethod org....
  TestShortCircuitLocalRead.testDeprecatedGetBlockLocalPathInfoRpc:381 » NoSuchMethod
  TestShortCircuitCache.testUnlinkingReplicasInFileDescriptorCache:622 » NoSuchMethod
  TestShortCircuitCache.testAllocShm:474 » NoSuchMethod org.apache.hadoop.util.S...
  TestShortCircuitCache.testDataXceiverHandlesRequestShortCircuitShmFailure:743 » NoSuchMethod
  TestShortCircuitCache.testShmBasedStaleness:528 » NoSuchMethod org.apache.hado...
  TestShortCircuitCache.testDataXceiverCleansUpSlotsOnFailure:684 » NoSuchMethod
  TestShortCircuitCache.testPreReceiptVerificationDfsClientCanDoScr:787 » NoSuchMethod
  TestRestartDFS.testRestartDualPortDFS:127->runTests:63 » NoSuchMethod org.apac...
  TestRestartDFS.testRestartDFS:118->runTests:63 » NoSuchMethod org.apache.hadoo...
  TestLeaseRecovery.shutdown:62 » NoSuchMethod org.apache.hadoop.util.ShutdownHo...
  TestLeaseRecovery.shutdown:62 » NoSuchMethod org.apache.hadoop.util.ShutdownHo...
  TestLeaseRecovery.testLeaseRecoveryAndAppend:256 » NoSuchMethod org.apache.had...
  TestLeaseRecovery.shutdown:62 » NoSuchMethod org.apache.hadoop.util.ShutdownHo...
  TestSetTimes.testTimes:216 » NoSuchMethod org.apache.hadoop.util.ShutdownHookM...
  TestSetTimes.testGetBlockLocationsOnlyUsesReadLock:308 » NoSuchMethod org.apac...
  TestSetTimes.testTimesAtClose:277 » NoSuchMethod org.apache.hadoop.util.Shutdo...
  TestParallelShortCircuitLegacyRead.teardownCluster:45->TestParallelReadUtil.teardownCluster:393
» NoSuchMethod
  TestClose.testWriteAfterClose:59 » NoSuchMethod org.apache.hadoop.util.Shutdow...
  TestDFSMkdirs.testMkdirRpcNonCanonicalPath:152 » NoSuchMethod org.apache.hadoo...
  TestDFSMkdirs.testMkdir:127 » NoSuchMethod org.apache.hadoop.util.ShutdownHook...
  TestDFSMkdirs.testDFSMkdirs:84 » NoSuchMethod org.apache.hadoop.util.ShutdownH...
  TestFileCreationEmpty.testLeaseExpireEmptyFiles:81 » NoSuchMethod org.apache.h...
  TestWriteRead.shutdown:89 » NoSuchMethod org.apache.hadoop.util.ShutdownHookMa...
  TestWriteRead.shutdown:89 » NoSuchMethod org.apache.hadoop.util.ShutdownHookMa...
  TestWriteRead.shutdown:89 » NoSuchMethod org.apache.hadoop.util.ShutdownHookMa...
  TestMiniDFSCluster.testDualClusters:103 » NoSuchMethod org.apache.hadoop.util....
  TestMiniDFSCluster.testClusterSetDatanodeHostname:143 » NoSuchMethod org.apach...
  TestMiniDFSCluster.testClusterNoStorageTypeSetForDatanodes:182 » NoSuchMethod ...
  TestMiniDFSCluster.testIsClusterUpAfterShutdown:118 » NoSuchMethod org.apache....
  TestMiniDFSCluster.testClusterSetDatanodeDifferentStorageType:164 » NoSuchMethod
  TestMiniDFSCluster.testClusterWithoutSystemProperties:74 » NoSuchMethod org.ap...
  TestDFSFinalize.testFinalize:111 » NoSuchMethod org.apache.hadoop.util.Shutdow...
  TestHDFSFileSystemContract.tearDown:48 » NoSuchMethod org.apache.hadoop.util.S...
  TestHDFSFileSystemContract.tearDown:48 » NoSuchMethod org.apache.hadoop.util.S...
  TestHDFSFileSystemContract.tearDown:48 » NoSuchMethod org.apache.hadoop.util.S...
  TestHDFSFileSystemContract.tearDown:48 » NoSuchMethod org.apache.hadoop.util.S...
  TestHDFSFileSystemContract.tearDown:48 » NoSuchMethod org.apache.hadoop.util.S...
  TestHDFSFileSystemContract.tearDown:48 » NoSuchMethod org.apache.hadoop.util.S...
  TestHDFSFileSystemContract.tearDown:48 » NoSuchMethod org.apache.hadoop.util.S...
  TestHDFSFileSystemContract.tearDown:48 » NoSuchMethod org.apache.hadoop.util.S...
  TestHDFSFileSystemContract.tearDown:48 » NoSuchMethod org.apache.hadoop.util.S...
  TestHDFSFileSystemContract.tearDown:48 » NoSuchMethod org.apache.hadoop.util.S...
  TestHDFSFileSystemContract.tearDown:48 » NoSuchMethod org.apache.hadoop.util.S...
  TestHDFSFileSystemContract.tearDown:48 » NoSuchMethod org.apache.hadoop.util.S...
  TestHDFSFileSystemContract.tearDown:48 » NoSuchMethod org.apache.hadoop.util.S...
  TestHDFSFileSystemContract.tearDown:48 » NoSuchMethod org.apache.hadoop.util.S...
  TestHDFSFileSystemContract.tearDown:48 » NoSuchMethod org.apache.hadoop.util.S...
  TestHDFSFileSystemContract.tearDown:48 » NoSuchMethod org.apache.hadoop.util.S...
  TestHDFSFileSystemContract.tearDown:48 » NoSuchMethod org.apache.hadoop.util.S...
  TestHDFSFileSystemContract.tearDown:48 » NoSuchMethod org.apache.hadoop.util.S...
  TestHDFSFileSystemContract.tearDown:48 » NoSuchMethod org.apache.hadoop.util.S...
  TestHDFSFileSystemContract.tearDown:48 » NoSuchMethod org.apache.hadoop.util.S...
  TestHDFSFileSystemContract.tearDown:48 » NoSuchMethod org.apache.hadoop.util.S...
  TestHDFSFileSystemContract.tearDown:48 » NoSuchMethod org.apache.hadoop.util.S...
  TestHDFSFileSystemContract.tearDown:48 » NoSuchMethod org.apache.hadoop.util.S...
  TestHDFSFileSystemContract.tearDown:48 » NoSuchMethod org.apache.hadoop.util.S...
  TestHDFSFileSystemContract.tearDown:48 » NoSuchMethod org.apache.hadoop.util.S...
  TestHDFSFileSystemContract.tearDown:48 » NoSuchMethod org.apache.hadoop.util.S...
  TestHDFSFileSystemContract.tearDown:48 » NoSuchMethod org.apache.hadoop.util.S...
  TestHDFSFileSystemContract.tearDown:48 » NoSuchMethod org.apache.hadoop.util.S...
  TestHDFSFileSystemContract.tearDown:48 » NoSuchMethod org.apache.hadoop.util.S...
  TestHDFSFileSystemContract.tearDown:48 » NoSuchMethod org.apache.hadoop.util.S...
  TestHDFSFileSystemContract.tearDown:48 » NoSuchMethod org.apache.hadoop.util.S...
  TestHDFSFileSystemContract.tearDown:48 » NoSuchMethod org.apache.hadoop.util.S...
  TestHDFSFileSystemContract.tearDown:48 » NoSuchMethod org.apache.hadoop.util.S...
  TestHDFSFileSystemContract.tearDown:48 » NoSuchMethod org.apache.hadoop.util.S...
  TestHDFSFileSystemContract.tearDown:48 » NoSuchMethod org.apache.hadoop.util.S...
  TestHDFSFileSystemContract.tearDown:48 » NoSuchMethod org.apache.hadoop.util.S...
  TestHDFSFileSystemContract.tearDown:48 » NoSuchMethod org.apache.hadoop.util.S...
  TestHDFSFileSystemContract.tearDown:48 » NoSuchMethod org.apache.hadoop.util.S...
  TestHDFSFileSystemContract.tearDown:48 » NoSuchMethod org.apache.hadoop.util.S...
  TestHDFSFileSystemContract.tearDown:48 » NoSuchMethod org.apache.hadoop.util.S...
  TestHDFSFileSystemContract.tearDown:48 » NoSuchMethod org.apache.hadoop.util.S...
  TestHDFSFileSystemContract.tearDown:48 » NoSuchMethod org.apache.hadoop.util.S...
  TestHDFSFileSystemContract.tearDown:48 » NoSuchMethod org.apache.hadoop.util.S...
  TestHDFSFileSystemContract.tearDown:48 » NoSuchMethod org.apache.hadoop.util.S...
  TestEncryptionZones.teardown:169 » NoSuchMethod org.apache.hadoop.util.Shutdow...
  TestEncryptionZones.teardown:169 » NoSuchMethod org.apache.hadoop.util.Shutdow...
  TestEncryptionZones.teardown:169 » NoSuchMethod org.apache.hadoop.util.Shutdow...
  TestEncryptionZones.teardown:169 » NoSuchMethod org.apache.hadoop.util.Shutdow...
  TestEncryptionZones.teardown:169 » NoSuchMethod org.apache.hadoop.util.Shutdow...
  TestEncryptionZones.teardown:169 » NoSuchMethod org.apache.hadoop.util.Shutdow...
  TestEncryptionZones.teardown:169 » NoSuchMethod org.apache.hadoop.util.Shutdow...
  TestEncryptionZones.teardown:169 » NoSuchMethod org.apache.hadoop.util.Shutdow...
  TestEncryptionZones.teardown:169 » NoSuchMethod org.apache.hadoop.util.Shutdow...
  TestEncryptionZones.teardown:169 » NoSuchMethod org.apache.hadoop.util.Shutdow...
  TestEncryptionZones.teardown:169 » NoSuchMethod org.apache.hadoop.util.Shutdow...
  TestEncryptionZones.teardown:169 » NoSuchMethod org.apache.hadoop.util.Shutdow...
  TestEncryptionZones.teardown:169 » NoSuchMethod org.apache.hadoop.util.Shutdow...
  TestEncryptionZones.teardown:169 » NoSuchMethod org.apache.hadoop.util.Shutdow...
  TestEncryptionZones.teardown:169 » NoSuchMethod org.apache.hadoop.util.Shutdow...
  TestEncryptionZones.teardown:169 » NoSuchMethod org.apache.hadoop.util.Shutdow...
  TestEncryptionZones.testEncryptionZonesOnRelativePath:1326->Object.wait:502->Object.wait:-2
» 
  TestEncryptionZones.teardown:169 » NoSuchMethod org.apache.hadoop.util.Shutdow...
  TestEncryptionZones.testEncryptionZonesWithSymlinks:1220->Object.wait:502->Object.wait:-2
» 
  TestEncryptionZones.teardown:169 » NoSuchMethod org.apache.hadoop.util.Shutdow...
  TestEncryptionZones.testIsEncryptedMethod:814->doTestIsEncryptedMethod:820->dTIEM:833->Object.wait:502->Object.wait:-2
» 
  TestEncryptionZones.teardown:169 » NoSuchMethod org.apache.hadoop.util.Shutdow...
  TestRollingUpgradeDowngrade.testRejectNewFsImage »  Unexpected exception, expe...
  TestRollingUpgradeDowngrade.testDowngrade »  Unexpected exception, expected<ja...
  TestParallelShortCircuitReadUnCached.teardownCluster:78->TestParallelReadUtil.teardownCluster:393
» NoSuchMethod
  TestClientProtocolForPipelineRecovery.testGetNewStamp:116 » NoSuchMethod org.a...
  TestClientProtocolForPipelineRecovery.testPipelineRecoveryForLastBlock:158 » NoSuchMethod
  TestClientProtocolForPipelineRecovery.testPipelineRecoveryOnRestartFailure:255 » NoSuchMethod
  TestClientProtocolForPipelineRecovery.testPipelineRecoveryOnOOB:201 » NoSuchMethod
  TestEncryptionZonesWithHA.shutdownCluster:89 » NoSuchMethod org.apache.hadoop....
  TestWriteBlockGetsBlockLengthHint.blockLengthHintIsPropagated:68 » NoSuchMethod
  TestDFSUpgrade.initialize:216 » NoSuchMethod org.apache.hadoop.util.ShutdownHo...
  TestSnapshotCommands.clusterShutdown:56 » NoSuchMethod org.apache.hadoop.util....
  TestDataTransferProtocol.testOpWrite:330 » NoSuchMethod org.apache.hadoop.util...
  TestDataTransferProtocol.testDataTransferProtocol:491 » NoSuchMethod org.apach...
  TestFileCreation.testConcurrentFileCreation:923 » NoSuchMethod org.apache.hado...
  TestFileCreation.testFileCreationWithOverwrite:1313 » NoSuchMethod org.apache....
  TestFileCreation.testFsCloseAfterClusterShutdown:1100 » NoSuchMethod org.apach...
  TestFileCreation.testFileCreationUsingHostname:194->checkFileCreation:306 » NoSuchMethod
  TestFileCreation.testFileCreationSimulated:890->testFileCreation:187->checkFileCreation:306
» NoSuchMethod
  TestFileCreation.testFsClose:1054 » NoSuchMethod org.apache.hadoop.util.Shutdo...

Tests run: 3371, Failures: 1, Errors: 600, Skipped: 14

[INFO]                                                                         
[INFO] ------------------------------------------------------------------------
[INFO] Skipping Apache Hadoop HttpFS
[INFO] This project has been banned from the build due to previous failures.
[INFO] ------------------------------------------------------------------------
[INFO]                                                                         
[INFO] ------------------------------------------------------------------------
[INFO] Skipping Apache Hadoop HDFS BookKeeper Journal
[INFO] This project has been banned from the build due to previous failures.
[INFO] ------------------------------------------------------------------------
[INFO]                                                                         
[INFO] ------------------------------------------------------------------------
[INFO] Skipping Apache Hadoop HDFS-NFS
[INFO] This project has been banned from the build due to previous failures.
[INFO] ------------------------------------------------------------------------
[INFO]                                                                         
[INFO] ------------------------------------------------------------------------
[INFO] Building Apache Hadoop HDFS Project 3.0.0-SNAPSHOT
[INFO] ------------------------------------------------------------------------
[INFO] 
[INFO] --- maven-clean-plugin:2.5:clean (default-clean) @ hadoop-hdfs-project ---
[INFO] Deleting <https://builds.apache.org/job/Hadoop-Hdfs-trunk-Java8/ws/hadoop-hdfs-project/target>
[INFO] 
[INFO] --- maven-antrun-plugin:1.7:run (create-testdirs) @ hadoop-hdfs-project ---
[INFO] Executing tasks

main:
    [mkdir] Created dir: <https://builds.apache.org/job/Hadoop-Hdfs-trunk-Java8/ws/hadoop-hdfs-project/target/test-dir>
[INFO] Executed tasks
[INFO] 
[INFO] --- maven-source-plugin:2.3:jar-no-fork (hadoop-java-sources) @ hadoop-hdfs-project
---
[INFO] 
[INFO] --- maven-source-plugin:2.3:test-jar-no-fork (hadoop-java-sources) @ hadoop-hdfs-project
---
[INFO] 
[INFO] --- maven-enforcer-plugin:1.3.1:enforce (dist-enforce) @ hadoop-hdfs-project ---
[INFO] 
[INFO] --- maven-site-plugin:3.4:attach-descriptor (attach-descriptor) @ hadoop-hdfs-project
---
[INFO] 
[INFO] --- maven-javadoc-plugin:2.8.1:jar (module-javadocs) @ hadoop-hdfs-project ---
[INFO] Not executing Javadoc as the project is not a Java classpath-capable package
[INFO] 
[INFO] --- maven-enforcer-plugin:1.3.1:enforce (depcheck) @ hadoop-hdfs-project ---
[INFO] 
[INFO] --- maven-checkstyle-plugin:2.15:checkstyle (default-cli) @ hadoop-hdfs-project ---
[INFO] 
[INFO] --- findbugs-maven-plugin:3.0.0:findbugs (default-cli) @ hadoop-hdfs-project ---
[INFO] ------------------------------------------------------------------------
[INFO] Reactor Summary:
[INFO] 
[INFO] Apache Hadoop HDFS Client ......................... SUCCESS [03:11 min]
[INFO] Apache Hadoop HDFS ................................ FAILURE [  02:33 h]
[INFO] Apache Hadoop HttpFS .............................. SKIPPED
[INFO] Apache Hadoop HDFS BookKeeper Journal ............. SKIPPED
[INFO] Apache Hadoop HDFS-NFS ............................ SKIPPED
[INFO] Apache Hadoop HDFS Project ........................ SUCCESS [  0.054 s]
[INFO] ------------------------------------------------------------------------
[INFO] BUILD FAILURE
[INFO] ------------------------------------------------------------------------
[INFO] Total time: 02:36 h
[INFO] Finished at: 2015-09-08T03:25:15+00:00
[INFO] Final Memory: 75M/726M
[INFO] ------------------------------------------------------------------------
[ERROR] Failed to execute goal org.apache.maven.plugins:maven-surefire-plugin:2.17:test (default-test)
on project hadoop-hdfs: ExecutionException: org.apache.maven.surefire.booter.SurefireBooterForkException:
Error occurred in starting fork, check output in log -> [Help 1]
[ERROR] 
[ERROR] To see the full stack trace of the errors, re-run Maven with the -e switch.
[ERROR] Re-run Maven using the -X switch to enable full debug logging.
[ERROR] 
[ERROR] For more information about the errors and possible solutions, please read the following
articles:
[ERROR] [Help 1] http://cwiki.apache.org/confluence/display/MAVEN/MojoFailureException
[ERROR] 
[ERROR] After correcting the problems, you can resume the build with the command
[ERROR]   mvn <goals> -rf :hadoop-hdfs
Build step 'Execute shell' marked build as failure
Archiving artifacts
Sending artifact delta relative to Hadoop-Hdfs-trunk-Java8 #222
Archived 1 artifacts
Archive block size is 32768
Received 0 blocks and 5352399 bytes
Compression is 0.0%
Took 2.7 sec
Recording test results
Updating YARN-2019

Mime
View raw message