hadoop-hdfs-dev mailing list archives

Site index · List index
Message view « Date » · « Thread »
Top « Date » · « Thread »
From Apache Jenkins Server <jenk...@builds.apache.org>
Subject Hadoop-Hdfs-trunk - Build # 2317 - Still Failing
Date Wed, 16 Sep 2015 08:05:00 GMT
See https://builds.apache.org/job/Hadoop-Hdfs-trunk/2317/

###################################################################################
########################## LAST 60 LINES OF THE CONSOLE ###########################
[...truncated 7465 lines...]
[INFO] 
[INFO] --- maven-source-plugin:2.3:jar-no-fork (hadoop-java-sources) @ hadoop-hdfs-project
---
[INFO] 
[INFO] --- maven-source-plugin:2.3:test-jar-no-fork (hadoop-java-sources) @ hadoop-hdfs-project
---
[INFO] 
[INFO] --- maven-enforcer-plugin:1.3.1:enforce (dist-enforce) @ hadoop-hdfs-project ---
[INFO] 
[INFO] --- maven-site-plugin:3.4:attach-descriptor (attach-descriptor) @ hadoop-hdfs-project
---
[INFO] 
[INFO] --- maven-javadoc-plugin:2.8.1:jar (module-javadocs) @ hadoop-hdfs-project ---
[INFO] Skipping javadoc generation
[INFO] 
[INFO] --- maven-enforcer-plugin:1.3.1:enforce (depcheck) @ hadoop-hdfs-project ---
[INFO] 
[INFO] --- maven-checkstyle-plugin:2.15:checkstyle (default-cli) @ hadoop-hdfs-project ---
[INFO] 
[INFO] --- findbugs-maven-plugin:3.0.0:findbugs (default-cli) @ hadoop-hdfs-project ---
[INFO] ------------------------------------------------------------------------
[INFO] Reactor Summary:
[INFO] 
[INFO] Apache Hadoop HDFS Client ......................... SUCCESS [03:34 min]
[INFO] Apache Hadoop HDFS ................................ FAILURE [  02:43 h]
[INFO] Apache Hadoop HttpFS .............................. SKIPPED
[INFO] Apache Hadoop HDFS BookKeeper Journal ............. SKIPPED
[INFO] Apache Hadoop HDFS-NFS ............................ SKIPPED
[INFO] Apache Hadoop HDFS Project ........................ SUCCESS [  0.062 s]
[INFO] ------------------------------------------------------------------------
[INFO] BUILD FAILURE
[INFO] ------------------------------------------------------------------------
[INFO] Total time: 02:47 h
[INFO] Finished at: 2015-09-16T08:04:50+00:00
[INFO] Final Memory: 59M/1194M
[INFO] ------------------------------------------------------------------------
[ERROR] Failed to execute goal org.apache.maven.plugins:maven-surefire-plugin:2.17:test (default-test)
on project hadoop-hdfs: There are test failures.
[ERROR] 
[ERROR] Please refer to /home/jenkins/jenkins-slave/workspace/Hadoop-Hdfs-trunk/hadoop-hdfs-project/hadoop-hdfs/target/surefire-reports
for the individual test results.
[ERROR] -> [Help 1]
[ERROR] 
[ERROR] To see the full stack trace of the errors, re-run Maven with the -e switch.
[ERROR] Re-run Maven using the -X switch to enable full debug logging.
[ERROR] 
[ERROR] For more information about the errors and possible solutions, please read the following
articles:
[ERROR] [Help 1] http://cwiki.apache.org/confluence/display/MAVEN/MojoFailureException
[ERROR] 
[ERROR] After correcting the problems, you can resume the build with the command
[ERROR]   mvn <goals> -rf :hadoop-hdfs
Build step 'Execute shell' marked build as failure
Archiving artifacts
Sending artifact delta relative to Hadoop-Hdfs-trunk #2295
Archived 1 artifacts
Archive block size is 32768
Received 0 blocks and 4569856 bytes
Compression is 0.0%
Took 2.1 sec
Recording test results
Updating HADOOP-12374
Sending e-mails to: hdfs-dev@hadoop.apache.org
Email was triggered for: Failure
Sending email for trigger: Failure



###################################################################################
############################## FAILED TESTS (if any) ##############################
4 tests failed.
REGRESSION:  org.apache.hadoop.hdfs.server.datanode.TestBPOfferService.testBasicFunctionality

Error Message:

Wanted but not invoked:
datanodeProtocolClientSideTranslatorPB.registerDatanode(
    <any>
);
-> at org.apache.hadoop.hdfs.server.datanode.TestBPOfferService.testBasicFunctionality(TestBPOfferService.java:189)
Actually, there were zero interactions with this mock.


Stack Trace:
org.mockito.exceptions.verification.WantedButNotInvoked: 
Wanted but not invoked:
datanodeProtocolClientSideTranslatorPB.registerDatanode(
    <any>
);
-> at org.apache.hadoop.hdfs.server.datanode.TestBPOfferService.testBasicFunctionality(TestBPOfferService.java:189)
Actually, there were zero interactions with this mock.

	at org.apache.hadoop.hdfs.server.datanode.TestBPOfferService.testBasicFunctionality(TestBPOfferService.java:189)


FAILED:  org.apache.hadoop.hdfs.server.namenode.TestFSNamesystem.testFSLockGetWaiterCount

Error Message:
Expected number of blocked thread not found expected:<3> but was:<1>

Stack Trace:
java.lang.AssertionError: Expected number of blocked thread not found expected:<3> but
was:<1>
	at org.junit.Assert.fail(Assert.java:88)
	at org.junit.Assert.failNotEquals(Assert.java:743)
	at org.junit.Assert.assertEquals(Assert.java:118)
	at org.junit.Assert.assertEquals(Assert.java:555)
	at org.apache.hadoop.hdfs.server.namenode.TestFSNamesystem.testFSLockGetWaiterCount(TestFSNamesystem.java:266)


FAILED:  org.apache.hadoop.hdfs.server.datanode.fsdataset.impl.TestLazyPersistLockedMemory.testReleaseOnEviction

Error Message:
expected:<1> but was:<0>

Stack Trace:
java.lang.AssertionError: expected:<1> but was:<0>
	at org.junit.Assert.fail(Assert.java:88)
	at org.junit.Assert.failNotEquals(Assert.java:743)
	at org.junit.Assert.assertEquals(Assert.java:118)
	at org.junit.Assert.assertEquals(Assert.java:555)
	at org.junit.Assert.assertEquals(Assert.java:542)
	at org.apache.hadoop.hdfs.server.datanode.fsdataset.impl.LazyPersistTestCase.verifyRamDiskJMXMetric(LazyPersistTestCase.java:483)
	at org.apache.hadoop.hdfs.server.datanode.fsdataset.impl.TestLazyPersistLockedMemory.testReleaseOnEviction(TestLazyPersistLockedMemory.java:122)


FAILED:  org.apache.hadoop.hdfs.server.datanode.fsdataset.impl.TestLazyPersistReplicaPlacement.testSynchronousEviction

Error Message:
expected:<1> but was:<0>

Stack Trace:
java.lang.AssertionError: expected:<1> but was:<0>
	at org.junit.Assert.fail(Assert.java:88)
	at org.junit.Assert.failNotEquals(Assert.java:743)
	at org.junit.Assert.assertEquals(Assert.java:118)
	at org.junit.Assert.assertEquals(Assert.java:555)
	at org.junit.Assert.assertEquals(Assert.java:542)
	at org.apache.hadoop.hdfs.server.datanode.fsdataset.impl.LazyPersistTestCase.verifyRamDiskJMXMetric(LazyPersistTestCase.java:483)
	at org.apache.hadoop.hdfs.server.datanode.fsdataset.impl.TestLazyPersistReplicaPlacement.testSynchronousEviction(TestLazyPersistReplicaPlacement.java:92)



Mime
  • Unnamed multipart/mixed (inline, None, 0 bytes)
View raw message