hadoop-hdfs-dev mailing list archives

Site index · List index
Message view « Date » · « Thread »
Top « Date » · « Thread »
From Apache Jenkins Server <jenk...@builds.apache.org>
Subject Build failed in Jenkins: Hadoop-Hdfs-trunk #2280
Date Tue, 08 Sep 2015 05:58:04 GMT
See <https://builds.apache.org/job/Hadoop-Hdfs-trunk/2280/changes>

Changes:

[xgong] YARN-4087. Followup fixes after YARN-2019 regarding RM behavior when

[jianhe] YARN-2884. Added a proxy service in NM to proxy the the communication between AM
and RM. Contributed by Kishore Chaliparambil

------------------------------------------
[...truncated 6746 lines...]
Tests run: 13, Failures: 0, Errors: 0, Skipped: 0, Time elapsed: 124.482 sec - in org.apache.hadoop.hdfs.server.namenode.metrics.TestNameNodeMetrics
Running org.apache.hadoop.hdfs.server.namenode.metrics.TestNNMetricFilesInGetListingOps
Tests run: 1, Failures: 0, Errors: 0, Skipped: 0, Time elapsed: 7.852 sec - in org.apache.hadoop.hdfs.server.namenode.metrics.TestNNMetricFilesInGetListingOps
Running org.apache.hadoop.hdfs.server.namenode.TestFSImage
Tests run: 6, Failures: 0, Errors: 0, Skipped: 0, Time elapsed: 24.802 sec - in org.apache.hadoop.hdfs.server.namenode.TestFSImage
Running org.apache.hadoop.hdfs.server.namenode.TestMalformedURLs
Tests run: 1, Failures: 0, Errors: 0, Skipped: 0, Time elapsed: 4.494 sec - in org.apache.hadoop.hdfs.server.namenode.TestMalformedURLs
Running org.apache.hadoop.hdfs.server.namenode.TestDefaultBlockPlacementPolicy
Tests run: 4, Failures: 0, Errors: 0, Skipped: 0, Time elapsed: 13.162 sec - in org.apache.hadoop.hdfs.server.namenode.TestDefaultBlockPlacementPolicy
Running org.apache.hadoop.hdfs.server.namenode.TestFSPermissionChecker
Tests run: 15, Failures: 0, Errors: 0, Skipped: 0, Time elapsed: 1.885 sec - in org.apache.hadoop.hdfs.server.namenode.TestFSPermissionChecker
Running org.apache.hadoop.hdfs.server.namenode.TestNameNodeMXBean
Tests run: 6, Failures: 0, Errors: 0, Skipped: 0, Time elapsed: 21.109 sec - in org.apache.hadoop.hdfs.server.namenode.TestNameNodeMXBean
Running org.apache.hadoop.hdfs.server.namenode.TestXAttrConfigFlag
Tests run: 5, Failures: 0, Errors: 0, Skipped: 0, Time elapsed: 13.584 sec - in org.apache.hadoop.hdfs.server.namenode.TestXAttrConfigFlag
Running org.apache.hadoop.hdfs.server.namenode.TestEditLog
Tests run: 24, Failures: 0, Errors: 0, Skipped: 0, Time elapsed: 84.379 sec - in org.apache.hadoop.hdfs.server.namenode.TestEditLog
Running org.apache.hadoop.hdfs.server.namenode.TestINodeAttributeProvider
Tests run: 2, Failures: 0, Errors: 0, Skipped: 0, Time elapsed: 5.75 sec - in org.apache.hadoop.hdfs.server.namenode.TestINodeAttributeProvider
Running org.apache.hadoop.hdfs.server.namenode.TestNNThroughputBenchmark
Tests run: 1, Failures: 0, Errors: 0, Skipped: 0, Time elapsed: 6.613 sec - in org.apache.hadoop.hdfs.server.namenode.TestNNThroughputBenchmark
Running org.apache.hadoop.hdfs.server.namenode.TestINodeFile
Tests run: 26, Failures: 0, Errors: 0, Skipped: 0, Time elapsed: 47.375 sec - in org.apache.hadoop.hdfs.server.namenode.TestINodeFile
Running org.apache.hadoop.hdfs.server.namenode.TestNameCache
Tests run: 1, Failures: 0, Errors: 0, Skipped: 0, Time elapsed: 0.199 sec - in org.apache.hadoop.hdfs.server.namenode.TestNameCache
Running org.apache.hadoop.hdfs.server.namenode.TestFileContextAcl
Tests run: 64, Failures: 0, Errors: 0, Skipped: 0, Time elapsed: 25.389 sec - in org.apache.hadoop.hdfs.server.namenode.TestFileContextAcl
Running org.apache.hadoop.hdfs.server.namenode.TestFSNamesystem
Tests run: 9, Failures: 0, Errors: 0, Skipped: 0, Time elapsed: 2.871 sec - in org.apache.hadoop.hdfs.server.namenode.TestFSNamesystem
Running org.apache.hadoop.hdfs.server.namenode.TestHostsFiles
Tests run: 2, Failures: 0, Errors: 0, Skipped: 0, Time elapsed: 14.883 sec - in org.apache.hadoop.hdfs.server.namenode.TestHostsFiles
Running org.apache.hadoop.hdfs.server.namenode.TestNNStorageRetentionManager
Tests run: 9, Failures: 0, Errors: 0, Skipped: 0, Time elapsed: 1.327 sec - in org.apache.hadoop.hdfs.server.namenode.TestNNStorageRetentionManager
Running org.apache.hadoop.hdfs.server.namenode.TestAllowFormat
Tests run: 2, Failures: 0, Errors: 0, Skipped: 0, Time elapsed: 5.054 sec - in org.apache.hadoop.hdfs.server.namenode.TestAllowFormat
Running org.apache.hadoop.hdfs.server.namenode.TestNameNodeRespectsBindHostKeys
Tests run: 4, Failures: 0, Errors: 0, Skipped: 0, Time elapsed: 10.776 sec - in org.apache.hadoop.hdfs.server.namenode.TestNameNodeRespectsBindHostKeys
Running org.apache.hadoop.hdfs.server.namenode.TestSecureNameNodeWithExternalKdc
Tests run: 1, Failures: 0, Errors: 0, Skipped: 1, Time elapsed: 0.101 sec - in org.apache.hadoop.hdfs.server.namenode.TestSecureNameNodeWithExternalKdc
Running org.apache.hadoop.hdfs.server.namenode.TestDeduplicationMap
Tests run: 1, Failures: 0, Errors: 0, Skipped: 0, Time elapsed: 0.091 sec - in org.apache.hadoop.hdfs.server.namenode.TestDeduplicationMap
Running org.apache.hadoop.hdfs.server.namenode.TestSecondaryWebUi
Tests run: 1, Failures: 0, Errors: 0, Skipped: 0, Time elapsed: 4.288 sec - in org.apache.hadoop.hdfs.server.namenode.TestSecondaryWebUi
Running org.apache.hadoop.hdfs.server.namenode.TestBlockPlacementPolicyRackFaultTolerant
Tests run: 1, Failures: 0, Errors: 0, Skipped: 0, Time elapsed: 9.783 sec - in org.apache.hadoop.hdfs.server.namenode.TestBlockPlacementPolicyRackFaultTolerant
Running org.apache.hadoop.hdfs.server.namenode.TestFSImageWithSnapshot
Tests run: 6, Failures: 0, Errors: 0, Skipped: 0, Time elapsed: 40.812 sec - in org.apache.hadoop.hdfs.server.namenode.TestFSImageWithSnapshot
Running org.apache.hadoop.hdfs.server.namenode.TestNameNodeRpcServer
Tests run: 1, Failures: 0, Errors: 0, Skipped: 0, Time elapsed: 5.209 sec - in org.apache.hadoop.hdfs.server.namenode.TestNameNodeRpcServer
Running org.apache.hadoop.hdfs.server.namenode.TestStartupOptionUpgrade
Tests run: 10, Failures: 0, Errors: 0, Skipped: 0, Time elapsed: 2.154 sec - in org.apache.hadoop.hdfs.server.namenode.TestStartupOptionUpgrade
Running org.apache.hadoop.hdfs.server.namenode.TestNameNodeRecovery
Tests run: 11, Failures: 0, Errors: 0, Skipped: 0, Time elapsed: 23.497 sec - in org.apache.hadoop.hdfs.server.namenode.TestNameNodeRecovery
Running org.apache.hadoop.hdfs.server.namenode.TestTransferFsImage
Tests run: 4, Failures: 0, Errors: 0, Skipped: 0, Time elapsed: 10.214 sec - in org.apache.hadoop.hdfs.server.namenode.TestTransferFsImage
Running org.apache.hadoop.hdfs.server.namenode.TestDecommissioningStatus
Tests run: 3, Failures: 0, Errors: 0, Skipped: 0, Time elapsed: 14.293 sec - in org.apache.hadoop.hdfs.server.namenode.TestDecommissioningStatus
Running org.apache.hadoop.hdfs.server.namenode.TestDeadDatanode
Tests run: 2, Failures: 0, Errors: 0, Skipped: 0, Time elapsed: 35.084 sec - in org.apache.hadoop.hdfs.server.namenode.TestDeadDatanode
Running org.apache.hadoop.hdfs.server.namenode.TestQuotaByStorageType
Tests run: 20, Failures: 0, Errors: 0, Skipped: 0, Time elapsed: 57.455 sec - in org.apache.hadoop.hdfs.server.namenode.TestQuotaByStorageType
Running org.apache.hadoop.hdfs.server.namenode.TestFsck
Tests run: 22, Failures: 0, Errors: 0, Skipped: 0, Time elapsed: 94.478 sec - in org.apache.hadoop.hdfs.server.namenode.TestFsck
Running org.apache.hadoop.hdfs.server.namenode.TestLeaseManager
Tests run: 3, Failures: 0, Errors: 0, Skipped: 0, Time elapsed: 0.782 sec - in org.apache.hadoop.hdfs.server.namenode.TestLeaseManager
Running org.apache.hadoop.hdfs.server.namenode.TestNameNodeXAttr
Tests run: 13, Failures: 0, Errors: 0, Skipped: 0, Time elapsed: 17.711 sec - in org.apache.hadoop.hdfs.server.namenode.TestNameNodeXAttr
Running org.apache.hadoop.hdfs.server.namenode.TestPathComponents
Tests run: 1, Failures: 0, Errors: 0, Skipped: 0, Time elapsed: 0.277 sec - in org.apache.hadoop.hdfs.server.namenode.TestPathComponents
Running org.apache.hadoop.hdfs.server.namenode.TestTruncateQuotaUpdate
Tests run: 3, Failures: 0, Errors: 0, Skipped: 0, Time elapsed: 0.411 sec - in org.apache.hadoop.hdfs.server.namenode.TestTruncateQuotaUpdate
Running org.apache.hadoop.hdfs.server.namenode.TestFSDirectory
Tests run: 5, Failures: 0, Errors: 0, Skipped: 0, Time elapsed: 17.192 sec - in org.apache.hadoop.hdfs.server.namenode.TestFSDirectory
Running org.apache.hadoop.hdfs.server.namenode.TestFileLimit
Tests run: 4, Failures: 0, Errors: 0, Skipped: 0, Time elapsed: 12.969 sec - in org.apache.hadoop.hdfs.server.namenode.TestFileLimit
Running org.apache.hadoop.hdfs.server.namenode.TestMetaSave
Tests run: 3, Failures: 0, Errors: 0, Skipped: 0, Time elapsed: 36.17 sec - in org.apache.hadoop.hdfs.server.namenode.TestMetaSave
Running org.apache.hadoop.hdfs.server.namenode.TestEditLogAutoroll
Tests run: 1, Failures: 0, Errors: 0, Skipped: 0, Time elapsed: 6.163 sec - in org.apache.hadoop.hdfs.server.namenode.TestEditLogAutoroll
Running org.apache.hadoop.hdfs.server.namenode.TestFSNamesystemMBean
Tests run: 3, Failures: 0, Errors: 0, Skipped: 0, Time elapsed: 8.43 sec - in org.apache.hadoop.hdfs.server.namenode.TestFSNamesystemMBean
Running org.apache.hadoop.hdfs.server.namenode.TestCheckpoint
Tests run: 38, Failures: 0, Errors: 0, Skipped: 0, Time elapsed: 133.526 sec - in org.apache.hadoop.hdfs.server.namenode.TestCheckpoint
Running org.apache.hadoop.hdfs.server.namenode.TestNameNodeHttpServer
Tests run: 3, Failures: 0, Errors: 0, Skipped: 0, Time elapsed: 3.025 sec - in org.apache.hadoop.hdfs.server.namenode.TestNameNodeHttpServer
Running org.apache.hadoop.hdfs.server.namenode.TestNameNodeResourcePolicy
Tests run: 5, Failures: 0, Errors: 0, Skipped: 0, Time elapsed: 0.457 sec - in org.apache.hadoop.hdfs.server.namenode.TestNameNodeResourcePolicy
Running org.apache.hadoop.hdfs.server.namenode.TestSecurityTokenEditLog
Tests run: 2, Failures: 0, Errors: 0, Skipped: 0, Time elapsed: 18.554 sec - in org.apache.hadoop.hdfs.server.namenode.TestSecurityTokenEditLog
Running org.apache.hadoop.hdfs.server.namenode.TestFSImageWithAcl
Tests run: 4, Failures: 0, Errors: 0, Skipped: 0, Time elapsed: 65.117 sec - in org.apache.hadoop.hdfs.server.namenode.TestFSImageWithAcl
Running org.apache.hadoop.hdfs.server.namenode.TestGenericJournalConf
Tests run: 4, Failures: 0, Errors: 0, Skipped: 0, Time elapsed: 5.172 sec - in org.apache.hadoop.hdfs.server.namenode.TestGenericJournalConf
Running org.apache.hadoop.hdfs.server.namenode.TestAddBlock
Tests run: 2, Failures: 0, Errors: 0, Skipped: 0, Time elapsed: 17.401 sec - in org.apache.hadoop.hdfs.server.namenode.TestAddBlock
Running org.apache.hadoop.hdfs.server.namenode.TestAclConfigFlag
Tests run: 8, Failures: 0, Errors: 0, Skipped: 0, Time elapsed: 20.214 sec - in org.apache.hadoop.hdfs.server.namenode.TestAclConfigFlag
Running org.apache.hadoop.hdfs.server.namenode.TestAclTransformation
Tests run: 55, Failures: 0, Errors: 0, Skipped: 0, Time elapsed: 0.46 sec - in org.apache.hadoop.hdfs.server.namenode.TestAclTransformation
Running org.apache.hadoop.hdfs.server.namenode.TestFSImageWithXAttr
Tests run: 2, Failures: 0, Errors: 0, Skipped: 0, Time elapsed: 40.539 sec - in org.apache.hadoop.hdfs.server.namenode.TestFSImageWithXAttr
Running org.apache.hadoop.hdfs.server.namenode.TestCreateEditsLog
Tests run: 1, Failures: 0, Errors: 0, Skipped: 0, Time elapsed: 5.967 sec - in org.apache.hadoop.hdfs.server.namenode.TestCreateEditsLog
Running org.apache.hadoop.hdfs.server.namenode.TestXAttrFeature
Tests run: 1, Failures: 0, Errors: 0, Skipped: 0, Time elapsed: 0.278 sec - in org.apache.hadoop.hdfs.server.namenode.TestXAttrFeature
Running org.apache.hadoop.hdfs.server.namenode.TestGetBlockLocations
Tests run: 3, Failures: 0, Errors: 0, Skipped: 0, Time elapsed: 2.412 sec - in org.apache.hadoop.hdfs.server.namenode.TestGetBlockLocations
Running org.apache.hadoop.hdfs.server.namenode.TestProtectedDirectories
Tests run: 6, Failures: 0, Errors: 0, Skipped: 0, Time elapsed: 19.1 sec - in org.apache.hadoop.hdfs.server.namenode.TestProtectedDirectories
Running org.apache.hadoop.hdfs.server.namenode.TestDiskspaceQuotaUpdate
Tests run: 7, Failures: 0, Errors: 0, Skipped: 0, Time elapsed: 51.818 sec - in org.apache.hadoop.hdfs.server.namenode.TestDiskspaceQuotaUpdate
Running org.apache.hadoop.hdfs.server.namenode.top.window.TestRollingWindowManager
Tests run: 1, Failures: 0, Errors: 0, Skipped: 0, Time elapsed: 0.601 sec - in org.apache.hadoop.hdfs.server.namenode.top.window.TestRollingWindowManager
Running org.apache.hadoop.hdfs.server.namenode.top.window.TestRollingWindow
Tests run: 2, Failures: 0, Errors: 0, Skipped: 0, Time elapsed: 0.206 sec - in org.apache.hadoop.hdfs.server.namenode.top.window.TestRollingWindow
Running org.apache.hadoop.hdfs.server.namenode.TestSnapshotPathINodes
Tests run: 6, Failures: 0, Errors: 0, Skipped: 0, Time elapsed: 6.829 sec - in org.apache.hadoop.hdfs.server.namenode.TestSnapshotPathINodes
Running org.apache.hadoop.hdfs.server.namenode.TestNameNodeMetricsLogger
Tests run: 4, Failures: 0, Errors: 0, Skipped: 0, Time elapsed: 3.262 sec - in org.apache.hadoop.hdfs.server.namenode.TestNameNodeMetricsLogger
Running org.apache.hadoop.hdfs.server.namenode.TestFsLimits
Tests run: 9, Failures: 0, Errors: 0, Skipped: 0, Time elapsed: 2.345 sec - in org.apache.hadoop.hdfs.server.namenode.TestFsLimits
Running org.apache.hadoop.hdfs.server.namenode.TestNameNodeRetryCacheMetrics
Tests run: 1, Failures: 0, Errors: 0, Skipped: 0, Time elapsed: 9.555 sec - in org.apache.hadoop.hdfs.server.namenode.TestNameNodeRetryCacheMetrics
Running org.apache.hadoop.hdfs.server.namenode.TestStartup
Tests run: 10, Failures: 0, Errors: 0, Skipped: 0, Time elapsed: 37.021 sec - in org.apache.hadoop.hdfs.server.namenode.TestStartup
Running org.apache.hadoop.hdfs.server.namenode.TestListCorruptFileBlocks
Tests run: 5, Failures: 0, Errors: 0, Skipped: 0, Time elapsed: 42.117 sec - in org.apache.hadoop.hdfs.server.namenode.TestListCorruptFileBlocks
Running org.apache.hadoop.hdfs.server.namenode.TestHDFSConcat
Tests run: 6, Failures: 0, Errors: 0, Skipped: 0, Time elapsed: 25.818 sec - in org.apache.hadoop.hdfs.server.namenode.TestHDFSConcat
Running org.apache.hadoop.hdfs.server.namenode.TestSaveNamespace
Tests run: 14, Failures: 0, Errors: 0, Skipped: 0, Time elapsed: 25.934 sec - in org.apache.hadoop.hdfs.server.namenode.TestSaveNamespace
Running org.apache.hadoop.hdfs.server.namenode.TestFsckWithMultipleNameNodes
Tests run: 1, Failures: 0, Errors: 0, Skipped: 0, Time elapsed: 9.457 sec - in org.apache.hadoop.hdfs.server.namenode.TestFsckWithMultipleNameNodes
Running org.apache.hadoop.hdfs.server.namenode.TestEditLogJournalFailures
Tests run: 6, Failures: 0, Errors: 0, Skipped: 0, Time elapsed: 13.178 sec - in org.apache.hadoop.hdfs.server.namenode.TestEditLogJournalFailures
Running org.apache.hadoop.hdfs.server.namenode.TestBlockUnderConstruction
Tests run: 2, Failures: 0, Errors: 0, Skipped: 0, Time elapsed: 6.972 sec - in org.apache.hadoop.hdfs.server.namenode.TestBlockUnderConstruction
Running org.apache.hadoop.hdfs.server.namenode.TestCheckPointForSecurityTokens
Tests run: 1, Failures: 0, Errors: 0, Skipped: 0, Time elapsed: 11.602 sec - in org.apache.hadoop.hdfs.server.namenode.TestCheckPointForSecurityTokens
Running org.apache.hadoop.hdfs.server.namenode.ha.TestHAAppend
Tests run: 1, Failures: 0, Errors: 0, Skipped: 0, Time elapsed: 12.091 sec - in org.apache.hadoop.hdfs.server.namenode.ha.TestHAAppend
Running org.apache.hadoop.hdfs.server.namenode.ha.TestBootstrapStandby
Tests run: 5, Failures: 0, Errors: 0, Skipped: 0, Time elapsed: 19.581 sec - in org.apache.hadoop.hdfs.server.namenode.ha.TestBootstrapStandby
Running org.apache.hadoop.hdfs.server.namenode.ha.TestDNFencing
Tests run: 6, Failures: 0, Errors: 0, Skipped: 0, Time elapsed: 51.46 sec - in org.apache.hadoop.hdfs.server.namenode.ha.TestDNFencing
Running org.apache.hadoop.hdfs.server.namenode.ha.TestDNFencingWithReplication
Tests run: 1, Failures: 0, Errors: 0, Skipped: 0, Time elapsed: 72.733 sec - in org.apache.hadoop.hdfs.server.namenode.ha.TestDNFencingWithReplication
Running org.apache.hadoop.hdfs.server.namenode.ha.TestLossyRetryInvocationHandler
Tests run: 1, Failures: 0, Errors: 0, Skipped: 0, Time elapsed: 4.989 sec - in org.apache.hadoop.hdfs.server.namenode.ha.TestLossyRetryInvocationHandler
Running org.apache.hadoop.hdfs.server.namenode.ha.TestStandbyIsHot
Tests run: 2, Failures: 0, Errors: 0, Skipped: 0, Time elapsed: 20.646 sec - in org.apache.hadoop.hdfs.server.namenode.ha.TestStandbyIsHot
Running org.apache.hadoop.hdfs.server.namenode.ha.TestHarFileSystemWithHA
Tests run: 1, Failures: 0, Errors: 0, Skipped: 0, Time elapsed: 6.395 sec - in org.apache.hadoop.hdfs.server.namenode.ha.TestHarFileSystemWithHA
Running org.apache.hadoop.hdfs.server.namenode.ha.TestFailureOfSharedDir
Tests run: 4, Failures: 0, Errors: 0, Skipped: 0, Time elapsed: 9.209 sec - in org.apache.hadoop.hdfs.server.namenode.ha.TestFailureOfSharedDir
Running org.apache.hadoop.hdfs.server.namenode.ha.TestHAMetrics
Tests run: 1, Failures: 0, Errors: 0, Skipped: 0, Time elapsed: 10.093 sec - in org.apache.hadoop.hdfs.server.namenode.ha.TestHAMetrics

Results :

Tests run: 2057, Failures: 0, Errors: 0, Skipped: 6

Running org.apache.hadoop.hdfs.server.namenode.ha.TestHASafeMode
[INFO]                                                                         
[INFO] ------------------------------------------------------------------------
[INFO] Skipping Apache Hadoop HttpFS
[INFO] This project has been banned from the build due to previous failures.
[INFO] ------------------------------------------------------------------------
[INFO]                                                                         
[INFO] ------------------------------------------------------------------------
[INFO] Skipping Apache Hadoop HDFS BookKeeper Journal
[INFO] This project has been banned from the build due to previous failures.
[INFO] ------------------------------------------------------------------------
[INFO]                                                                         
[INFO] ------------------------------------------------------------------------
[INFO] Skipping Apache Hadoop HDFS-NFS
[INFO] This project has been banned from the build due to previous failures.
[INFO] ------------------------------------------------------------------------
[INFO]                                                                         
[INFO] ------------------------------------------------------------------------
[INFO] Building Apache Hadoop HDFS Project 3.0.0-SNAPSHOT
[INFO] ------------------------------------------------------------------------
[INFO] 
[INFO] --- maven-clean-plugin:2.5:clean (default-clean) @ hadoop-hdfs-project ---
[INFO] Deleting <https://builds.apache.org/job/Hadoop-Hdfs-trunk/ws/hadoop-hdfs-project/target>
[INFO] 
[INFO] --- maven-antrun-plugin:1.7:run (create-testdirs) @ hadoop-hdfs-project ---
[INFO] Executing tasks

main:
    [mkdir] Created dir: <https://builds.apache.org/job/Hadoop-Hdfs-trunk/ws/hadoop-hdfs-project/target/test-dir>
[INFO] Executed tasks
[INFO] 
[INFO] --- maven-source-plugin:2.3:jar-no-fork (hadoop-java-sources) @ hadoop-hdfs-project
---
[INFO] 
[INFO] --- maven-source-plugin:2.3:test-jar-no-fork (hadoop-java-sources) @ hadoop-hdfs-project
---
[INFO] 
[INFO] --- maven-enforcer-plugin:1.3.1:enforce (dist-enforce) @ hadoop-hdfs-project ---
[INFO] 
[INFO] --- maven-site-plugin:3.4:attach-descriptor (attach-descriptor) @ hadoop-hdfs-project
---
[INFO] 
[INFO] --- maven-javadoc-plugin:2.8.1:jar (module-javadocs) @ hadoop-hdfs-project ---
[INFO] Skipping javadoc generation
[INFO] 
[INFO] --- maven-enforcer-plugin:1.3.1:enforce (depcheck) @ hadoop-hdfs-project ---
[INFO] 
[INFO] --- maven-checkstyle-plugin:2.15:checkstyle (default-cli) @ hadoop-hdfs-project ---
[INFO] 
[INFO] --- findbugs-maven-plugin:3.0.0:findbugs (default-cli) @ hadoop-hdfs-project ---
[INFO] ------------------------------------------------------------------------
[INFO] Reactor Summary:
[INFO] 
[INFO] Apache Hadoop HDFS Client ......................... SUCCESS [03:17 min]
[INFO] Apache Hadoop HDFS ................................ FAILURE [  01:51 h]
[INFO] Apache Hadoop HttpFS .............................. SKIPPED
[INFO] Apache Hadoop HDFS BookKeeper Journal ............. SKIPPED
[INFO] Apache Hadoop HDFS-NFS ............................ SKIPPED
[INFO] Apache Hadoop HDFS Project ........................ SUCCESS [  0.075 s]
[INFO] ------------------------------------------------------------------------
[INFO] BUILD FAILURE
[INFO] ------------------------------------------------------------------------
[INFO] Total time: 01:55 h
[INFO] Finished at: 2015-09-08T05:57:53+00:00
[INFO] Final Memory: 74M/902M
[INFO] ------------------------------------------------------------------------
[ERROR] Failed to execute goal org.apache.maven.plugins:maven-surefire-plugin:2.17:test (default-test)
on project hadoop-hdfs: ExecutionException: java.lang.RuntimeException: The forked VM terminated
without properly saying goodbye. VM crash or System.exit called?
[ERROR] Command was /bin/sh -c cd <https://builds.apache.org/job/Hadoop-Hdfs-trunk/ws/hadoop-hdfs-project/hadoop-hdfs>
&& /home/jenkins/tools/java/jdk1.7.0_55/jre/bin/java -Xmx4096m -XX:MaxPermSize=768m
-XX:+HeapDumpOnOutOfMemoryError -jar <https://builds.apache.org/job/Hadoop-Hdfs-trunk/ws/hadoop-hdfs-project/hadoop-hdfs/target/surefire/surefirebooter3846414195881891000.jar>
<https://builds.apache.org/job/Hadoop-Hdfs-trunk/ws/hadoop-hdfs-project/hadoop-hdfs/target/surefire/surefire1698162632077549246tmp>
<https://builds.apache.org/job/Hadoop-Hdfs-trunk/ws/hadoop-hdfs-project/hadoop-hdfs/target/surefire/surefire_1421388048289611233709tmp>
[ERROR] -> [Help 1]
[ERROR] 
[ERROR] To see the full stack trace of the errors, re-run Maven with the -e switch.
[ERROR] Re-run Maven using the -X switch to enable full debug logging.
[ERROR] 
[ERROR] For more information about the errors and possible solutions, please read the following
articles:
[ERROR] [Help 1] http://cwiki.apache.org/confluence/display/MAVEN/MojoFailureException
[ERROR] 
[ERROR] After correcting the problems, you can resume the build with the command
[ERROR]   mvn <goals> -rf :hadoop-hdfs
Build step 'Execute shell' marked build as failure
Archiving artifacts
Sending artifact delta relative to Hadoop-Hdfs-trunk #2277
Archived 1 artifacts
Archive block size is 32768
Received 0 blocks and 4550674 bytes
Compression is 0.0%
Took 2.2 sec
Recording test results
Updating YARN-2884
Updating YARN-2019
Updating YARN-4087

Mime
View raw message