hadoop-hdfs-dev mailing list archives

Site index · List index
Message view « Date » · « Thread »
Top « Date » · « Thread »
From Apache Jenkins Server <jenk...@builds.apache.org>
Subject Build failed in Jenkins: Hadoop-Hdfs-trunk #2353
Date Thu, 24 Sep 2015 17:42:10 GMT
See <https://builds.apache.org/job/Hadoop-Hdfs-trunk/2353/changes>

Changes:

[zxu] MAPREDUCE-6484. Yarn Client uses local address instead of RM address as token renewer
in a secure cluster when RM HA is enabled. Contributed by Zhihai Xu

[wheat9] HDFS-7529. Consolidate encryption zone related implementation into a single class.
Contributed by Rakesh R.

------------------------------------------
[...truncated 23674 lines...]
  TestNameNodeRespectsBindHostKeys.testServiceRpcBindHostKey:126 » NoSuchMethod ...
  TestFileContextAcl>FSAclBaseTest.testRemoveDefaultAclStickyBit:541->FSAclBaseTest.restartCluster:1621->FSAclBaseTest.shutdown:94
» NoSuchMethod
  TestFileContextAcl>FSAclBaseTest.testDefaultAclNewFileIntermediate:982 » EOF E...
  TestFileContextAcl>FSAclBaseTest.testSetAclOnlyDefault:669 » Connect Call From...
  TestFileContextAcl.testModifyAclEntriesPathNotFound »  Unexpected exception, e...
  TestFileContextAcl>FSAclBaseTest.testRemoveDefaultAclOnlyAccess:464 » Connect ...
  TestFileContextAcl>FSAclBaseTest.testRemoveAclEntriesStickyBit:405 » Connect C...
  TestFileContextAcl>FSAclBaseTest.testRemoveDefaultAclMinimal:508 » Connect Cal...
  TestFileContextAcl>FSAclBaseTest.testSetAclOnlyAccess:650 » Connect Call From ...
  TestFileContextAcl>FSAclBaseTest.testOnlyAccessAclNewDir:947 » Connect Call Fr...
  TestFileContextAcl>FSAclBaseTest.testSetAclStickyBit:747 » Connect Call From a...
  TestFileContextAcl>FSAclBaseTest.testDefaultAclNewSymlinkIntermediate:1043 » Connect
  TestFileContextAcl>FSAclBaseTest.testRemoveAclMustBeOwnerOrSuper:1248 » Connect
  TestFileContextAcl>FSAclBaseTest.testDefaultAclRenamedFile:1126 » Connect Call...
  TestFileContextAcl>FSAclBaseTest.testSetAclMustBeOwnerOrSuper:1262 » Connect C...
  TestFileContextAcl>FSAclBaseTest.testRemoveDefaultAclMustBeOwnerOrSuper:1234 » Connect
  TestFileContextAcl>FSAclBaseTest.testRemoveAclEntries:283 » Connect Call From ...
  TestFileContextAcl>FSAclBaseTest.testEffectiveAccess:1355 » Connect Call From ...
  TestFileContextAcl.testSetAclDefaultOnFile »  Unexpected exception, expected<o...
  TestFileContextAcl>FSAclBaseTest.testGetAclStatusRequiresTraverseOrSuper:1281 » Connect
  TestFileContextAcl>FSAclBaseTest.testRemoveAclEntriesMustBeOwnerOrSuper:1218 » Connect
  TestFileContextAcl.testSetAclPathNotFound »  Unexpected exception, expected<ja...
  TestFileContextAcl.testRemoveAclPathNotFound »  Unexpected exception, expected...
  TestFileContextAcl>FSAclBaseTest.testSetAclMinimal:687 » Connect Call From asf...
  TestFileContextAcl>FSAclBaseTest.testDeDuplication:1408->FSAclBaseTest.shutdown:94
» NoSuchMethod
  TestFileContextAcl.testModifyAclEntriesDefaultOnFile »  Unexpected exception, ...
  TestFileContextAcl>FSAclBaseTest.testDefaultAclRenamedDir:1146 » Connect Call ...
  TestFileContextAcl>FSAclBaseTest.testRemoveAclEntriesMinimal:357 » Connect Cal...
  TestFileContextAcl>FSAclBaseTest.testDefaultMinimalAclNewFile:908 » Connect Ca...
  TestFileContextAcl>FSAclBaseTest.testDefaultAclNewFile:876 » Connect Call From...
  TestFileContextAcl>FSAclBaseTest.testModifyAclEntriesCustomMask:218 » Connect ...
  TestFileContextAcl>FSAclBaseTest.testRemoveAclMinimalAcl:573 » Connect Call Fr...
  TestFileContextAcl.testRemoveAclEntriesPathNotFound »  Unexpected exception, e...
  TestFileContextAcl>FSAclBaseTest.testRemoveDefaultAcl:439 » Connect Call From ...
  TestFileContextAcl>FSAclBaseTest.testSkipAclEnforcementSuper:1186 » Connect Ca...
  TestFileContextAcl>FSAclBaseTest.testRemoveAclOnlyDefault:603 » Connect Call F...
  TestFileContextAcl.testRemoveDefaultAclPathNotFound »  Unexpected exception, e...
  TestFileContextAcl>FSAclBaseTest.testDefaultAclNewFileWithMode:1081 » Connect ...
  TestFileContextAcl>FSAclBaseTest.testRemoveAclEntriesOnlyDefault:332 » Connect
  TestFileContextAcl>FSAclBaseTest.testAccess:1299 » Connect Call From asf901.gq...
  TestFileContextAcl>FSAclBaseTest.testRemoveAclStickyBit:585 » Connect Call Fro...
  TestFileContextAcl>FSAclBaseTest.testRemoveAclEntriesOnlyAccess:309 » Connect ...
  TestFileContextAcl>FSAclBaseTest.testSetPermissionCannotSetAclBit:858 » Connect
  TestFileContextAcl>FSAclBaseTest.testSkipAclEnforcementPermsDisabled:1166 » Connect
  TestFileContextAcl>FSAclBaseTest.testOnlyAccessAclNewFile:893 » Connect Call F...
  TestFileContextAcl>FSAclBaseTest.testDefaultMinimalAclNewDir:962 » Connect Cal...
  TestFileContextAcl>FSAclBaseTest.testSetAclCustomMask:727 » Connect Call From ...
  TestFileContextAcl>FSAclBaseTest.testRemoveAclEntriesMinimalDefault:379 » Connect
  TestFileContextAcl>FSAclBaseTest.testModifyAclEntriesMinimalDefault:200 » Connect
  TestFileContextAcl>FSAclBaseTest.testRemoveDefaultAclOnlyDefault:489 » Connect
  TestFileContextAcl>FSAclBaseTest.testSetPermissionOnlyAccess:816 » Connect Cal...
  TestFileContextAcl>FSAclBaseTest.testDefaultAclNewDir:925 » Connect Call From ...
  TestFileContextAcl>FSAclBaseTest.testModifyAclEntriesStickyBit:235 » Connect C...
  TestFileContextAcl>FSAclBaseTest.testSetAcl:626 » Connect Call From asf901.gq1...
  TestFileContextAcl>FSAclBaseTest.testModifyAclEntriesOnlyAccess:141 » Connect ...
  TestFileContextAcl>FSAclBaseTest.testDefaultAclNewDirWithMode:1103 » Connect C...
  TestFileContextAcl>FSAclBaseTest.testSetPermission:791 » Connect Call From asf...
  TestFileContextAcl>FSAclBaseTest.testSetAclMinimalDefault:709 » Connect Call F...
  TestFileContextAcl>FSAclBaseTest.testModifyAclEntriesMustBeOwnerOrSuper:1202 » Connect
  TestFileContextAcl>FSAclBaseTest.testSetPermissionOnlyDefault:836 » Connect Ca...
  TestFileContextAcl>FSAclBaseTest.testRemoveAcl:555 » Connect Call From asf901....
  TestFileContextAcl>FSAclBaseTest.testModifyAclEntries:113 » Connect Call From ...
  TestFileContextAcl>FSAclBaseTest.testModifyAclEntriesMinimal:184 » Connect Cal...
  TestFileContextAcl>FSAclBaseTest.testDefaultAclNewDirIntermediate:1014 » Connect
  TestFileContextAcl>FSAclBaseTest.shutdown:94 » NoSuchMethod org.apache.hadoop....
  TestNameNodeRecovery.testRecoverTruncatedEditLog:631->testNameNodeRecoveryImpl:554 »
NoSuchMethod
  TestNameNodeRecovery.testRecoverZeroPaddedEditLog:647->testNameNodeRecoveryImpl:554 »
NoSuchMethod
  TestNameNodeRecovery.testRecoverPaddedEditLog:639->testNameNodeRecoveryImpl:554 » NoSuchMethod
  TestNameNodeRecovery.testRecoverNegativeOnePaddedEditLog:655->testNameNodeRecoveryImpl:554
» NoSuchMethod
  TestFavoredNodesEndToEnd.tearDownAfterClass:80 » NoSuchMethod org.apache.hadoo...
  TestNameNodeAcl>FSAclBaseTest.testRemoveDefaultAclStickyBit:541->FSAclBaseTest.restartCluster:1621->FSAclBaseTest.shutdown:94
» NoSuchMethod
  TestNameNodeAcl>FSAclBaseTest.testDefaultAclNewFileIntermediate:982 » EOF End ...
  TestNameNodeAcl>FSAclBaseTest.testSetAclOnlyDefault:669 » Connect Call From as...
  TestNameNodeAcl.testModifyAclEntriesPathNotFound »  Unexpected exception, expe...
  TestNameNodeAcl>FSAclBaseTest.testRemoveDefaultAclOnlyAccess:464 » Connect Cal...
  TestNameNodeAcl>FSAclBaseTest.testRemoveAclEntriesStickyBit:405 » Connect Call...
  TestNameNodeAcl>FSAclBaseTest.testRemoveDefaultAclMinimal:508 » Connect Call F...
  TestNameNodeAcl>FSAclBaseTest.testSetAclOnlyAccess:650 » Connect Call From asf...
  TestNameNodeAcl>FSAclBaseTest.testOnlyAccessAclNewDir:947 » Connect Call From ...
  TestNameNodeAcl>FSAclBaseTest.testSetAclStickyBit:747 » Connect Call From asf9...
  TestNameNodeAcl>FSAclBaseTest.testDefaultAclNewSymlinkIntermediate:1043 » Connect
  TestNameNodeAcl>FSAclBaseTest.testRemoveAclMustBeOwnerOrSuper:1248 » Connect C...
  TestNameNodeAcl>FSAclBaseTest.testDefaultAclRenamedFile:1126 » Connect Call Fr...
  TestNameNodeAcl>FSAclBaseTest.testSetAclMustBeOwnerOrSuper:1262 » Connect Call...
  TestNameNodeAcl>FSAclBaseTest.testRemoveDefaultAclMustBeOwnerOrSuper:1234 » Connect
  TestNameNodeAcl>FSAclBaseTest.testRemoveAclEntries:283 » Connect Call From asf...
  TestNameNodeAcl>FSAclBaseTest.testEffectiveAccess:1355 » Connect Call From asf...
  TestNameNodeAcl.testSetAclDefaultOnFile »  Unexpected exception, expected<org....
  TestNameNodeAcl>FSAclBaseTest.testGetAclStatusRequiresTraverseOrSuper:1281 » Connect
  TestNameNodeAcl>FSAclBaseTest.testRemoveAclEntriesMustBeOwnerOrSuper:1218 » Connect
  TestNameNodeAcl.testSetAclPathNotFound »  Unexpected exception, expected<java....
  TestNameNodeAcl.testRemoveAclPathNotFound »  Unexpected exception, expected<ja...
  TestNameNodeAcl>FSAclBaseTest.testSetAclMinimal:687 » Connect Call From asf901...
  TestNameNodeAcl>FSAclBaseTest.testDeDuplication:1408->FSAclBaseTest.shutdown:94 »
NoSuchMethod
  TestNameNodeAcl.testModifyAclEntriesDefaultOnFile »  Unexpected exception, exp...
  TestNameNodeAcl>FSAclBaseTest.testDefaultAclRenamedDir:1146 » Connect Call Fro...
  TestNameNodeAcl>FSAclBaseTest.testRemoveAclEntriesMinimal:357 » Connect Call F...
  TestNameNodeAcl>FSAclBaseTest.testDefaultMinimalAclNewFile:908 » Connect Call ...
  TestNameNodeAcl>FSAclBaseTest.testDefaultAclNewFile:876 » Connect Call From as...
  TestNameNodeAcl>FSAclBaseTest.testModifyAclEntriesCustomMask:218 » Connect Cal...
  TestNameNodeAcl>FSAclBaseTest.testRemoveAclMinimalAcl:573 » Connect Call From ...
  TestNameNodeAcl.testRemoveAclEntriesPathNotFound »  Unexpected exception, expe...
  TestNameNodeAcl>FSAclBaseTest.testRemoveDefaultAcl:439 » Connect Call From asf...
  TestNameNodeAcl>FSAclBaseTest.testSkipAclEnforcementSuper:1186 » Connect Call ...
  TestNameNodeAcl>FSAclBaseTest.testRemoveAclOnlyDefault:603 » Connect Call From...
  TestNameNodeAcl.testRemoveDefaultAclPathNotFound »  Unexpected exception, expe...
  TestNameNodeAcl>FSAclBaseTest.testDefaultAclNewFileWithMode:1081 » Connect Cal...
  TestNameNodeAcl>FSAclBaseTest.testRemoveAclEntriesOnlyDefault:332 » Connect Ca...
  TestNameNodeAcl>FSAclBaseTest.testAccess:1299 » Connect Call From asf901.gq1.y...
  TestNameNodeAcl>FSAclBaseTest.testRemoveAclStickyBit:585 » Connect Call From a...
  TestNameNodeAcl>FSAclBaseTest.testRemoveAclEntriesOnlyAccess:309 » Connect Cal...
  TestNameNodeAcl>FSAclBaseTest.testSetPermissionCannotSetAclBit:858 » Connect C...
  TestNameNodeAcl>FSAclBaseTest.testSkipAclEnforcementPermsDisabled:1166 » Connect
  TestNameNodeAcl>FSAclBaseTest.testOnlyAccessAclNewFile:893 » Connect Call From...
  TestNameNodeAcl>FSAclBaseTest.testDefaultMinimalAclNewDir:962 » Connect Call F...
  TestNameNodeAcl>FSAclBaseTest.testSetAclCustomMask:727 » Connect Call From asf...
  TestNameNodeAcl>FSAclBaseTest.testRemoveAclEntriesMinimalDefault:379 » Connect
  TestNameNodeAcl>FSAclBaseTest.testModifyAclEntriesMinimalDefault:200 » Connect
  TestNameNodeAcl>FSAclBaseTest.testRemoveDefaultAclOnlyDefault:489 » Connect Ca...
  TestNameNodeAcl>FSAclBaseTest.testSetPermissionOnlyAccess:816 » Connect Call F...
  TestNameNodeAcl>FSAclBaseTest.testDefaultAclNewDir:925 » Connect Call From asf...
  TestNameNodeAcl>FSAclBaseTest.testModifyAclEntriesStickyBit:235 » Connect Call...
  TestNameNodeAcl>FSAclBaseTest.testSetAcl:626 » Connect Call From asf901.gq1.yg...
  TestNameNodeAcl>FSAclBaseTest.testModifyAclEntriesOnlyAccess:141 » Connect Cal...
  TestNameNodeAcl>FSAclBaseTest.testDefaultAclNewDirWithMode:1103 » Connect Call...
  TestNameNodeAcl>FSAclBaseTest.testSetPermission:791 » Connect Call From asf901...
  TestNameNodeAcl>FSAclBaseTest.testSetAclMinimalDefault:709 » Connect Call From...
  TestNameNodeAcl>FSAclBaseTest.testModifyAclEntriesMustBeOwnerOrSuper:1202 » Connect
  TestNameNodeAcl>FSAclBaseTest.testSetPermissionOnlyDefault:836 » Connect Call ...
  TestNameNodeAcl>FSAclBaseTest.testRemoveAcl:555 » Connect Call From asf901.gq1...
  TestNameNodeAcl>FSAclBaseTest.testModifyAclEntries:113 » Connect Call From asf...
  TestNameNodeAcl>FSAclBaseTest.testModifyAclEntriesMinimal:184 » Connect Call F...
  TestNameNodeAcl>FSAclBaseTest.testDefaultAclNewDirIntermediate:1014 » Connect ...
  TestNameNodeAcl>FSAclBaseTest.shutdown:94 » NoSuchMethod org.apache.hadoop.uti...
  TestDisallowModifyROSnapshot.tearDown:79 » NoSuchMethod org.apache.hadoop.util...
  TestAclWithSnapshot.testOriginalAclEnforcedForSnapshotRootAfterChange:146->restart:931->shutdown:91
» NoSuchMethod
  TestAclWithSnapshot.testSetAclSnapshotPath:573 » IO Filesystem closed
  TestAclWithSnapshot.testRemoveAclSnapshotPath:565 » IO Filesystem closed
  TestAclWithSnapshot.testOriginalAclEnforcedForSnapshotContentsAfterChange:181 » IO
  TestAclWithSnapshot.testRemoveAclEntriesSnapshotPath:547 » IO Filesystem close...
  TestAclWithSnapshot.testRemoveDefaultAclSnapshotPath:557 » IO Filesystem close...
  TestAclWithSnapshot.testRemoveReadsCurrentState:483 » IO Filesystem closed
  TestAclWithSnapshot.testChangeAclExceedsQuota:585 » IO Filesystem closed
  TestAclWithSnapshot.testDeDuplication:667 » IO Filesystem closed
  TestAclWithSnapshot.testOriginalAclEnforcedForSnapshotRootAfterRemoval:289 » IO
  TestAclWithSnapshot.testOriginalAclEnforcedForSnapshotContentsAfterRemoval:357 » IO
  TestAclWithSnapshot.testDefaultAclNotCopiedToAccessAclOfNewSnapshot:505 » IO F...
  TestAclWithSnapshot.testRemoveAclExceedsQuota:620 » IO Filesystem closed
  TestAclWithSnapshot.testModifyAclEntriesSnapshotPath:537 » IO Filesystem close...
  TestAclWithSnapshot.testGetAclStatusDotSnapshotPath:653 » IO Filesystem closed
  TestAclWithSnapshot.testModifyReadsCurrentState:457 » IO Filesystem closed
  TestAclWithSnapshot.shutdown:91 » NoSuchMethod org.apache.hadoop.util.Shutdown...
  TestINodeFileUnderConstructionWithSnapshot.tearDown:93 » NoSuchMethod org.apac...
  TestINodeFileUnderConstructionWithSnapshot.tearDown:93 » NoSuchMethod org.apac...
  TestINodeFileUnderConstructionWithSnapshot.tearDown:93 » NoSuchMethod org.apac...
  TestINodeFileUnderConstructionWithSnapshot.tearDown:93 » NoSuchMethod org.apac...
  TestSnapshotListing.tearDown:63 » NoSuchMethod org.apache.hadoop.util.Shutdown...
  TestGetContentSummaryWithSnapshot.tearDown:72 » NoSuchMethod org.apache.hadoop...
  TestSnapshotBlocksMap.tearDown:86 » NoSuchMethod org.apache.hadoop.util.Shutdo...
  TestSnapshotBlocksMap.tearDown:86 » NoSuchMethod org.apache.hadoop.util.Shutdo...
  TestSnapshotBlocksMap.tearDown:86 » NoSuchMethod org.apache.hadoop.util.Shutdo...

Tests run: 1858, Failures: 0, Errors: 339, Skipped: 11

[INFO]                                                                         
[INFO] ------------------------------------------------------------------------
[INFO] Skipping Apache Hadoop HttpFS
[INFO] This project has been banned from the build due to previous failures.
[INFO] ------------------------------------------------------------------------
[INFO]                                                                         
[INFO] ------------------------------------------------------------------------
[INFO] Skipping Apache Hadoop HDFS BookKeeper Journal
[INFO] This project has been banned from the build due to previous failures.
[INFO] ------------------------------------------------------------------------
[INFO]                                                                         
[INFO] ------------------------------------------------------------------------
[INFO] Skipping Apache Hadoop HDFS-NFS
[INFO] This project has been banned from the build due to previous failures.
[INFO] ------------------------------------------------------------------------
[INFO]                                                                         
[INFO] ------------------------------------------------------------------------
[INFO] Building Apache Hadoop HDFS Project 3.0.0-SNAPSHOT
[INFO] ------------------------------------------------------------------------
[INFO] 
[INFO] --- maven-clean-plugin:2.5:clean (default-clean) @ hadoop-hdfs-project ---
[INFO] Deleting <https://builds.apache.org/job/Hadoop-Hdfs-trunk/ws/hadoop-hdfs-project/target>
[INFO] 
[INFO] --- maven-antrun-plugin:1.7:run (create-testdirs) @ hadoop-hdfs-project ---
[INFO] Executing tasks

main:
    [mkdir] Created dir: <https://builds.apache.org/job/Hadoop-Hdfs-trunk/ws/hadoop-hdfs-project/target/test-dir>
[INFO] Executed tasks
[INFO] 
[INFO] --- maven-source-plugin:2.3:jar-no-fork (hadoop-java-sources) @ hadoop-hdfs-project
---
[INFO] 
[INFO] --- maven-source-plugin:2.3:test-jar-no-fork (hadoop-java-sources) @ hadoop-hdfs-project
---
[INFO] 
[INFO] --- maven-enforcer-plugin:1.3.1:enforce (dist-enforce) @ hadoop-hdfs-project ---
[INFO] 
[INFO] --- maven-site-plugin:3.4:attach-descriptor (attach-descriptor) @ hadoop-hdfs-project
---
[INFO] 
[INFO] --- maven-javadoc-plugin:2.8.1:jar (module-javadocs) @ hadoop-hdfs-project ---
[INFO] Skipping javadoc generation
[INFO] 
[INFO] --- maven-enforcer-plugin:1.3.1:enforce (depcheck) @ hadoop-hdfs-project ---
[INFO] 
[INFO] --- maven-checkstyle-plugin:2.15:checkstyle (default-cli) @ hadoop-hdfs-project ---
[INFO] 
[INFO] --- findbugs-maven-plugin:3.0.0:findbugs (default-cli) @ hadoop-hdfs-project ---
[INFO] ------------------------------------------------------------------------
[INFO] Reactor Summary:
[INFO] 
[INFO] Apache Hadoop HDFS Client ......................... SUCCESS [03:29 min]
[INFO] Apache Hadoop HDFS ................................ FAILURE [  01:13 h]
[INFO] Apache Hadoop HttpFS .............................. SKIPPED
[INFO] Apache Hadoop HDFS BookKeeper Journal ............. SKIPPED
[INFO] Apache Hadoop HDFS-NFS ............................ SKIPPED
[INFO] Apache Hadoop HDFS Project ........................ SUCCESS [  0.069 s]
[INFO] ------------------------------------------------------------------------
[INFO] BUILD FAILURE
[INFO] ------------------------------------------------------------------------
[INFO] Total time: 01:17 h
[INFO] Finished at: 2015-09-24T17:41:35+00:00
[INFO] Final Memory: 79M/893M
[INFO] ------------------------------------------------------------------------
[ERROR] Failed to execute goal org.apache.maven.plugins:maven-surefire-plugin:2.17:test (default-test)
on project hadoop-hdfs: ExecutionException: java.lang.RuntimeException: The forked VM terminated
without properly saying goodbye. VM crash or System.exit called?
[ERROR] Command was /bin/sh -c cd <https://builds.apache.org/job/Hadoop-Hdfs-trunk/ws/hadoop-hdfs-project/hadoop-hdfs>
&& /home/jenkins/tools/java/jdk1.7.0_55/jre/bin/java -Xmx4096m -XX:MaxPermSize=768m
-XX:+HeapDumpOnOutOfMemoryError -jar <https://builds.apache.org/job/Hadoop-Hdfs-trunk/ws/hadoop-hdfs-project/hadoop-hdfs/target/surefire/surefirebooter7984235330343504685.jar>
<https://builds.apache.org/job/Hadoop-Hdfs-trunk/ws/hadoop-hdfs-project/hadoop-hdfs/target/surefire/surefire2916981566922743520tmp>
<https://builds.apache.org/job/Hadoop-Hdfs-trunk/ws/hadoop-hdfs-project/hadoop-hdfs/target/surefire/surefire_7670148921375581118tmp>
[ERROR] -> [Help 1]
[ERROR] 
[ERROR] To see the full stack trace of the errors, re-run Maven with the -e switch.
[ERROR] Re-run Maven using the -X switch to enable full debug logging.
[ERROR] 
[ERROR] For more information about the errors and possible solutions, please read the following
articles:
[ERROR] [Help 1] http://cwiki.apache.org/confluence/display/MAVEN/MojoFailureException
[ERROR] 
[ERROR] After correcting the problems, you can resume the build with the command
[ERROR]   mvn <goals> -rf :hadoop-hdfs
Build step 'Execute shell' marked build as failure
Archiving artifacts
Sending artifact delta relative to Hadoop-Hdfs-trunk #2342
Archived 1 artifacts
Archive block size is 32768
Received 0 blocks and 4451676 bytes
Compression is 0.0%
Took 1.5 sec
Recording test results
Updating HDFS-7529
Updating MAPREDUCE-6484

Mime
View raw message