hadoop-hdfs-dev mailing list archives

Site index · List index
Message view « Date » · « Thread »
Top « Date » · « Thread »
From Apache Jenkins Server <jenk...@builds.apache.org>
Subject Hadoop-Hdfs-trunk-Java8 - Build # 419 - Still Failing
Date Sat, 26 Sep 2015 04:43:10 GMT
See https://builds.apache.org/job/Hadoop-Hdfs-trunk-Java8/419/

###################################################################################
########################## LAST 60 LINES OF THE CONSOLE ###########################
[...truncated 8128 lines...]
[INFO] 
[INFO] --- maven-source-plugin:2.3:test-jar-no-fork (hadoop-java-sources) @ hadoop-hdfs-project
---
[INFO] 
[INFO] --- maven-enforcer-plugin:1.3.1:enforce (dist-enforce) @ hadoop-hdfs-project ---
[INFO] 
[INFO] --- maven-site-plugin:3.4:attach-descriptor (attach-descriptor) @ hadoop-hdfs-project
---
[INFO] 
[INFO] --- maven-javadoc-plugin:2.8.1:jar (module-javadocs) @ hadoop-hdfs-project ---
[INFO] Not executing Javadoc as the project is not a Java classpath-capable package
[INFO] 
[INFO] --- maven-enforcer-plugin:1.3.1:enforce (depcheck) @ hadoop-hdfs-project ---
[INFO] 
[INFO] --- maven-checkstyle-plugin:2.15:checkstyle (default-cli) @ hadoop-hdfs-project ---
[INFO] 
[INFO] --- findbugs-maven-plugin:3.0.0:findbugs (default-cli) @ hadoop-hdfs-project ---
[INFO] ------------------------------------------------------------------------
[INFO] Reactor Summary:
[INFO] 
[INFO] Apache Hadoop HDFS Client ......................... SUCCESS [03:21 min]
[INFO] Apache Hadoop HDFS ................................ FAILURE [  02:58 h]
[INFO] Apache Hadoop HttpFS .............................. SKIPPED
[INFO] Apache Hadoop HDFS BookKeeper Journal ............. SKIPPED
[INFO] Apache Hadoop HDFS-NFS ............................ SKIPPED
[INFO] Apache Hadoop HDFS Project ........................ SUCCESS [  0.094 s]
[INFO] ------------------------------------------------------------------------
[INFO] BUILD FAILURE
[INFO] ------------------------------------------------------------------------
[INFO] Total time: 03:01 h
[INFO] Finished at: 2015-09-26T04:43:15+00:00
[INFO] Final Memory: 55M/644M
[INFO] ------------------------------------------------------------------------
[ERROR] Failed to execute goal org.apache.maven.plugins:maven-surefire-plugin:2.17:test (default-test)
on project hadoop-hdfs: There are test failures.
[ERROR] 
[ERROR] Please refer to /home/jenkins/jenkins-slave/workspace/Hadoop-Hdfs-trunk-Java8/hadoop-hdfs-project/hadoop-hdfs/target/surefire-reports
for the individual test results.
[ERROR] -> [Help 1]
[ERROR] 
[ERROR] To see the full stack trace of the errors, re-run Maven with the -e switch.
[ERROR] Re-run Maven using the -X switch to enable full debug logging.
[ERROR] 
[ERROR] For more information about the errors and possible solutions, please read the following
articles:
[ERROR] [Help 1] http://cwiki.apache.org/confluence/display/MAVEN/MojoFailureException
[ERROR] 
[ERROR] After correcting the problems, you can resume the build with the command
[ERROR]   mvn <goals> -rf :hadoop-hdfs
Build step 'Execute shell' marked build as failure
Archiving artifacts
Sending artifact delta relative to Hadoop-Hdfs-trunk-Java8 #222
Archived 1 artifacts
Archive block size is 32768
Received 0 blocks and 5328313 bytes
Compression is 0.0%
Took 3.9 sec
Recording test results
Updating HDFS-9132
Updating HDFS-9133
Updating HDFS-9107
Sending e-mails to: hdfs-dev@hadoop.apache.org
Email was triggered for: Failure
Sending email for trigger: Failure



###################################################################################
############################## FAILED TESTS (if any) ##############################
7 tests failed.
REGRESSION:  org.apache.hadoop.hdfs.TestLeaseRecovery2.testHardLeaseRecoveryWithRenameAfterNameNodeRestart

Error Message:
org.apache.hadoop.util.ExitUtil$ExitException: Could not sync enough journals to persistent
storage due to No journals available to flush. Unsynced transactions: 1
 at org.apache.hadoop.util.ExitUtil.terminate(ExitUtil.java:126)
 at org.apache.hadoop.hdfs.server.namenode.FSEditLog.logSync(FSEditLog.java:637)
 at org.apache.hadoop.hdfs.server.namenode.FSEditLog.endCurrentLogSegment(FSEditLog.java:1316)
 at org.apache.hadoop.hdfs.server.namenode.FSEditLog.close(FSEditLog.java:362)
 at org.apache.hadoop.hdfs.server.namenode.FSNamesystem.stopActiveServices(FSNamesystem.java:1199)
 at org.apache.hadoop.hdfs.server.namenode.NameNode$NameNodeHAContext.stopActiveServices(NameNode.java:1735)
 at org.apache.hadoop.hdfs.server.namenode.ha.ActiveState.exitState(ActiveState.java:70)
 at org.apache.hadoop.hdfs.server.namenode.NameNode.stop(NameNode.java:880)
 at org.apache.hadoop.hdfs.MiniDFSCluster.shutdownNameNode(MiniDFSCluster.java:1912)
 at org.apache.hadoop.hdfs.MiniDFSCluster.restartNameNode(MiniDFSCluster.java:1963)
 at org.apache.hadoop.hdfs.MiniDFSCluster.restartNameNode(MiniDFSCluster.java:1944)
 at org.apache.hadoop.hdfs.TestLeaseRecovery2.hardLeaseRecoveryRestartHelper(TestLeaseRecovery2.java:494)
 at org.apache.hadoop.hdfs.TestLeaseRecovery2.testHardLeaseRecoveryWithRenameAfterNameNodeRestart(TestLeaseRecovery2.java:433)
 at sun.reflect.NativeMethodAccessorImpl.invoke0(Native Method)
 at sun.reflect.NativeMethodAccessorImpl.invoke(NativeMethodAccessorImpl.java:62)
 at sun.reflect.DelegatingMethodAccessorImpl.invoke(DelegatingMethodAccessorImpl.java:43)
 at java.lang.reflect.Method.invoke(Method.java:483)
 at org.junit.runners.model.FrameworkMethod$1.runReflectiveCall(FrameworkMethod.java:47)
 at org.junit.internal.runners.model.ReflectiveCallable.run(ReflectiveCallable.java:12)
 at org.junit.runners.model.FrameworkMethod.invokeExplosively(FrameworkMethod.java:44)
 at org.junit.internal.runners.statements.InvokeMethod.evaluate(InvokeMethod.java:17)
 at org.junit.runners.ParentRunner.runLeaf(ParentRunner.java:271)
 at org.junit.runners.BlockJUnit4ClassRunner.runChild(BlockJUnit4ClassRunner.java:70)
 at org.junit.runners.BlockJUnit4ClassRunner.runChild(BlockJUnit4ClassRunner.java:50)
 at org.junit.runners.ParentRunner$3.run(ParentRunner.java:238)
 at org.junit.runners.ParentRunner$1.schedule(ParentRunner.java:63)
 at org.junit.runners.ParentRunner.runChildren(ParentRunner.java:236)
 at org.junit.runners.ParentRunner.access$000(ParentRunner.java:53)
 at org.junit.runners.ParentRunner$2.evaluate(ParentRunner.java:229)
 at org.junit.internal.runners.statements.RunBefores.evaluate(RunBefores.java:26)
 at org.junit.internal.runners.statements.RunAfters.evaluate(RunAfters.java:27)
 at org.junit.runners.ParentRunner.run(ParentRunner.java:309)
 at org.apache.maven.surefire.junit4.JUnit4Provider.execute(JUnit4Provider.java:264)
 at org.apache.maven.surefire.junit4.JUnit4Provider.executeTestSet(JUnit4Provider.java:153)
 at org.apache.maven.surefire.junit4.JUnit4Provider.invoke(JUnit4Provider.java:124)
 at org.apache.maven.surefire.booter.ForkedBooter.invokeProviderInSameClassLoader(ForkedBooter.java:200)
 at org.apache.maven.surefire.booter.ForkedBooter.runSuitesInProcess(ForkedBooter.java:153)
 at org.apache.maven.surefire.booter.ForkedBooter.main(ForkedBooter.java:103)


Stack Trace:
org.apache.hadoop.util.ExitUtil$ExitException: org.apache.hadoop.util.ExitUtil$ExitException:
Could not sync enough journals to persistent storage due to No journals available to flush.
Unsynced transactions: 1
	at org.apache.hadoop.util.ExitUtil.terminate(ExitUtil.java:126)
	at org.apache.hadoop.hdfs.server.namenode.FSEditLog.logSync(FSEditLog.java:637)
	at org.apache.hadoop.hdfs.server.namenode.FSEditLog.endCurrentLogSegment(FSEditLog.java:1316)
	at org.apache.hadoop.hdfs.server.namenode.FSEditLog.close(FSEditLog.java:362)
	at org.apache.hadoop.hdfs.server.namenode.FSNamesystem.stopActiveServices(FSNamesystem.java:1199)
	at org.apache.hadoop.hdfs.server.namenode.NameNode$NameNodeHAContext.stopActiveServices(NameNode.java:1735)
	at org.apache.hadoop.hdfs.server.namenode.ha.ActiveState.exitState(ActiveState.java:70)
	at org.apache.hadoop.hdfs.server.namenode.NameNode.stop(NameNode.java:880)
	at org.apache.hadoop.hdfs.MiniDFSCluster.shutdownNameNode(MiniDFSCluster.java:1912)
	at org.apache.hadoop.hdfs.MiniDFSCluster.restartNameNode(MiniDFSCluster.java:1963)
	at org.apache.hadoop.hdfs.MiniDFSCluster.restartNameNode(MiniDFSCluster.java:1944)
	at org.apache.hadoop.hdfs.TestLeaseRecovery2.hardLeaseRecoveryRestartHelper(TestLeaseRecovery2.java:494)
	at org.apache.hadoop.hdfs.TestLeaseRecovery2.testHardLeaseRecoveryWithRenameAfterNameNodeRestart(TestLeaseRecovery2.java:433)
	at sun.reflect.NativeMethodAccessorImpl.invoke0(Native Method)
	at sun.reflect.NativeMethodAccessorImpl.invoke(NativeMethodAccessorImpl.java:62)
	at sun.reflect.DelegatingMethodAccessorImpl.invoke(DelegatingMethodAccessorImpl.java:43)
	at java.lang.reflect.Method.invoke(Method.java:483)
	at org.junit.runners.model.FrameworkMethod$1.runReflectiveCall(FrameworkMethod.java:47)
	at org.junit.internal.runners.model.ReflectiveCallable.run(ReflectiveCallable.java:12)
	at org.junit.runners.model.FrameworkMethod.invokeExplosively(FrameworkMethod.java:44)
	at org.junit.internal.runners.statements.InvokeMethod.evaluate(InvokeMethod.java:17)
	at org.junit.runners.ParentRunner.runLeaf(ParentRunner.java:271)
	at org.junit.runners.BlockJUnit4ClassRunner.runChild(BlockJUnit4ClassRunner.java:70)
	at org.junit.runners.BlockJUnit4ClassRunner.runChild(BlockJUnit4ClassRunner.java:50)
	at org.junit.runners.ParentRunner$3.run(ParentRunner.java:238)
	at org.junit.runners.ParentRunner$1.schedule(ParentRunner.java:63)
	at org.junit.runners.ParentRunner.runChildren(ParentRunner.java:236)
	at org.junit.runners.ParentRunner.access$000(ParentRunner.java:53)
	at org.junit.runners.ParentRunner$2.evaluate(ParentRunner.java:229)
	at org.junit.internal.runners.statements.RunBefores.evaluate(RunBefores.java:26)
	at org.junit.internal.runners.statements.RunAfters.evaluate(RunAfters.java:27)
	at org.junit.runners.ParentRunner.run(ParentRunner.java:309)
	at org.apache.maven.surefire.junit4.JUnit4Provider.execute(JUnit4Provider.java:264)
	at org.apache.maven.surefire.junit4.JUnit4Provider.executeTestSet(JUnit4Provider.java:153)
	at org.apache.maven.surefire.junit4.JUnit4Provider.invoke(JUnit4Provider.java:124)
	at org.apache.maven.surefire.booter.ForkedBooter.invokeProviderInSameClassLoader(ForkedBooter.java:200)
	at org.apache.maven.surefire.booter.ForkedBooter.runSuitesInProcess(ForkedBooter.java:153)
	at org.apache.maven.surefire.booter.ForkedBooter.main(ForkedBooter.java:103)

	at org.apache.hadoop.util.ExitUtil.terminate(ExitUtil.java:126)
	at org.apache.hadoop.util.ExitUtil.terminate(ExitUtil.java:170)
	at org.apache.hadoop.hdfs.server.namenode.NameNode.doImmediateShutdown(NameNode.java:1704)
	at org.apache.hadoop.hdfs.server.namenode.NameNode$NameNodeHAContext.stopActiveServices(NameNode.java:1739)
	at org.apache.hadoop.hdfs.server.namenode.ha.ActiveState.exitState(ActiveState.java:70)
	at org.apache.hadoop.hdfs.server.namenode.NameNode.stop(NameNode.java:880)
	at org.apache.hadoop.hdfs.MiniDFSCluster.shutdownNameNode(MiniDFSCluster.java:1912)
	at org.apache.hadoop.hdfs.MiniDFSCluster.restartNameNode(MiniDFSCluster.java:1963)
	at org.apache.hadoop.hdfs.MiniDFSCluster.restartNameNode(MiniDFSCluster.java:1944)
	at org.apache.hadoop.hdfs.TestLeaseRecovery2.hardLeaseRecoveryRestartHelper(TestLeaseRecovery2.java:494)
	at org.apache.hadoop.hdfs.TestLeaseRecovery2.testHardLeaseRecoveryWithRenameAfterNameNodeRestart(TestLeaseRecovery2.java:433)


REGRESSION:  org.apache.hadoop.hdfs.TestLeaseRecovery2.testLeaseRecoverByAnotherUser

Error Message:
Lease monitor is not running

Stack Trace:
java.lang.IllegalStateException: Lease monitor is not running
	at com.google.common.base.Preconditions.checkState(Preconditions.java:145)
	at org.apache.hadoop.hdfs.server.namenode.LeaseManager.triggerMonitorCheckNow(LeaseManager.java:449)
	at org.apache.hadoop.hdfs.server.namenode.NameNodeAdapter.setLeasePeriod(NameNodeAdapter.java:135)
	at org.apache.hadoop.hdfs.MiniDFSCluster.setLeasePeriod(MiniDFSCluster.java:2586)
	at org.apache.hadoop.hdfs.TestLeaseRecovery2.testLeaseRecoverByAnotherUser(TestLeaseRecovery2.java:159)


REGRESSION:  org.apache.hadoop.hdfs.TestLeaseRecovery2.testHardLeaseRecovery

Error Message:
End of File Exception between local host is: "asf906.gq1.ygridcore.net/67.195.81.150"; destination
host is: "localhost":40721; : java.io.EOFException; For more details see:  http://wiki.apache.org/hadoop/EOFException

Stack Trace:
java.io.EOFException: End of File Exception between local host is: "asf906.gq1.ygridcore.net/67.195.81.150";
destination host is: "localhost":40721; : java.io.EOFException; For more details see:  http://wiki.apache.org/hadoop/EOFException
	at sun.reflect.NativeConstructorAccessorImpl.newInstance0(Native Method)
	at sun.reflect.NativeConstructorAccessorImpl.newInstance(NativeConstructorAccessorImpl.java:62)
	at sun.reflect.DelegatingConstructorAccessorImpl.newInstance(DelegatingConstructorAccessorImpl.java:45)
	at java.lang.reflect.Constructor.newInstance(Constructor.java:408)
	at org.apache.hadoop.net.NetUtils.wrapWithMessage(NetUtils.java:792)
	at org.apache.hadoop.net.NetUtils.wrapException(NetUtils.java:765)
	at org.apache.hadoop.ipc.Client.call(Client.java:1449)
	at org.apache.hadoop.ipc.Client.call(Client.java:1376)
	at org.apache.hadoop.ipc.ProtobufRpcEngine$Invoker.invoke(ProtobufRpcEngine.java:229)
	at com.sun.proxy.$Proxy20.create(Unknown Source)
	at org.apache.hadoop.hdfs.protocolPB.ClientNamenodeProtocolTranslatorPB.create(ClientNamenodeProtocolTranslatorPB.java:297)
	at sun.reflect.NativeMethodAccessorImpl.invoke0(Native Method)
	at sun.reflect.NativeMethodAccessorImpl.invoke(NativeMethodAccessorImpl.java:62)
	at sun.reflect.DelegatingMethodAccessorImpl.invoke(DelegatingMethodAccessorImpl.java:43)
	at java.lang.reflect.Method.invoke(Method.java:483)
	at org.apache.hadoop.io.retry.RetryInvocationHandler.invokeMethod(RetryInvocationHandler.java:251)
	at org.apache.hadoop.io.retry.RetryInvocationHandler.invoke(RetryInvocationHandler.java:103)
	at com.sun.proxy.$Proxy25.create(Unknown Source)
	at org.apache.hadoop.hdfs.DFSOutputStream.newStreamForCreate(DFSOutputStream.java:241)
	at org.apache.hadoop.hdfs.DFSClient.create(DFSClient.java:1226)
	at org.apache.hadoop.hdfs.DFSClient.create(DFSClient.java:1157)
	at org.apache.hadoop.hdfs.DistributedFileSystem$7.doCall(DistributedFileSystem.java:420)
	at org.apache.hadoop.hdfs.DistributedFileSystem$7.doCall(DistributedFileSystem.java:416)
	at org.apache.hadoop.fs.FileSystemLinkResolver.resolve(FileSystemLinkResolver.java:81)
	at org.apache.hadoop.hdfs.DistributedFileSystem.create(DistributedFileSystem.java:431)
	at org.apache.hadoop.hdfs.DistributedFileSystem.create(DistributedFileSystem.java:359)
	at org.apache.hadoop.fs.FileSystem.create(FileSystem.java:913)
	at org.apache.hadoop.fs.FileSystem.create(FileSystem.java:894)
	at org.apache.hadoop.hdfs.TestLeaseRecovery2.testHardLeaseRecovery(TestLeaseRecovery2.java:276)
Caused by: java.io.EOFException: null
	at java.io.DataInputStream.readInt(DataInputStream.java:392)
	at org.apache.hadoop.ipc.Client$Connection.receiveRpcResponse(Client.java:1103)
	at org.apache.hadoop.ipc.Client$Connection.run(Client.java:998)


FAILED:  org.apache.hadoop.hdfs.TestLeaseRecovery2.org.apache.hadoop.hdfs.TestLeaseRecovery2

Error Message:
Test resulted in an unexpected exit

Stack Trace:
java.lang.AssertionError: Test resulted in an unexpected exit
	at org.apache.hadoop.hdfs.MiniDFSCluster.shutdown(MiniDFSCluster.java:1848)
	at org.apache.hadoop.hdfs.MiniDFSCluster.shutdown(MiniDFSCluster.java:1835)
	at org.apache.hadoop.hdfs.MiniDFSCluster.shutdown(MiniDFSCluster.java:1828)
	at org.apache.hadoop.hdfs.TestLeaseRecovery2.tearDown(TestLeaseRecovery2.java:105)


REGRESSION:  org.apache.hadoop.hdfs.server.datanode.TestBPOfferService.testPickActiveNameNode

Error Message:
expected same:<Mock for DatanodeProtocolClientSideTranslatorPB, hashCode: 1864869682>
was not:<null>

Stack Trace:
java.lang.AssertionError: expected same:<Mock for DatanodeProtocolClientSideTranslatorPB,
hashCode: 1864869682> was not:<null>
	at org.junit.Assert.fail(Assert.java:88)
	at org.junit.Assert.failNotSame(Assert.java:737)
	at org.junit.Assert.assertSame(Assert.java:680)
	at org.junit.Assert.assertSame(Assert.java:691)
	at org.apache.hadoop.hdfs.server.datanode.TestBPOfferService.testPickActiveNameNode(TestBPOfferService.java:284)


REGRESSION:  org.apache.hadoop.hdfs.web.TestWebHDFSOAuth2.listStatusReturnsAsExpected

Error Message:
Unable to load OAuth2 connection factory.

Stack Trace:
java.io.IOException: Unable to load OAuth2 connection factory.
	at java.io.FileInputStream.open(Native Method)
	at java.io.FileInputStream.<init>(FileInputStream.java:131)
	at org.apache.hadoop.security.ssl.ReloadingX509TrustManager.loadTrustManager(ReloadingX509TrustManager.java:164)
	at org.apache.hadoop.security.ssl.ReloadingX509TrustManager.<init>(ReloadingX509TrustManager.java:81)
	at org.apache.hadoop.security.ssl.FileBasedKeyStoresFactory.init(FileBasedKeyStoresFactory.java:215)
	at org.apache.hadoop.security.ssl.SSLFactory.init(SSLFactory.java:131)
	at org.apache.hadoop.hdfs.web.URLConnectionFactory.newSslConnConfigurator(URLConnectionFactory.java:135)
	at org.apache.hadoop.hdfs.web.URLConnectionFactory.newOAuth2URLConnectionFactory(URLConnectionFactory.java:111)
	at org.apache.hadoop.hdfs.web.WebHdfsFileSystem.initialize(WebHdfsFileSystem.java:159)
	at org.apache.hadoop.hdfs.web.TestWebHDFSOAuth2.listStatusReturnsAsExpected(TestWebHDFSOAuth2.java:147)


FAILED:  org.apache.hadoop.hdfs.server.namenode.ha.TestSeveralNameNodes.testCircularLinkedListWrites

Error Message:
Some writers didn't complete in expected runtime! Current writer state:[Circular Writer:
  directory: /test-0
  target length: 50
  current item: 5
  done: false
, Circular Writer:
  directory: /test-1
  target length: 50
  current item: 23
  done: false
] expected:<0> but was:<2>

Stack Trace:
java.lang.AssertionError: Some writers didn't complete in expected runtime! Current writer
state:[Circular Writer:
	 directory: /test-0
	 target length: 50
	 current item: 5
	 done: false
, Circular Writer:
	 directory: /test-1
	 target length: 50
	 current item: 23
	 done: false
] expected:<0> but was:<2>
	at org.junit.Assert.fail(Assert.java:88)
	at org.junit.Assert.failNotEquals(Assert.java:743)
	at org.junit.Assert.assertEquals(Assert.java:118)
	at org.junit.Assert.assertEquals(Assert.java:555)
	at org.apache.hadoop.hdfs.server.namenode.ha.TestSeveralNameNodes.testCircularLinkedListWrites(TestSeveralNameNodes.java:90)



Mime
  • Unnamed multipart/mixed (inline, None, 0 bytes)
View raw message