hadoop-hdfs-dev mailing list archives

Site index · List index
Message view « Date » · « Thread »
Top « Date » · « Thread »
From Apache Jenkins Server <jenk...@builds.apache.org>
Subject Hadoop-Hdfs-trunk-Java8 - Build # 399 - Still Failing
Date Mon, 21 Sep 2015 08:08:05 GMT
See https://builds.apache.org/job/Hadoop-Hdfs-trunk-Java8/399/

###################################################################################
########################## LAST 60 LINES OF THE CONSOLE ###########################
[...truncated 8105 lines...]
[INFO] 
[INFO] --- maven-source-plugin:2.3:jar-no-fork (hadoop-java-sources) @ hadoop-hdfs-project
---
[INFO] 
[INFO] --- maven-source-plugin:2.3:test-jar-no-fork (hadoop-java-sources) @ hadoop-hdfs-project
---
[INFO] 
[INFO] --- maven-enforcer-plugin:1.3.1:enforce (dist-enforce) @ hadoop-hdfs-project ---
[INFO] 
[INFO] --- maven-site-plugin:3.4:attach-descriptor (attach-descriptor) @ hadoop-hdfs-project
---
[INFO] 
[INFO] --- maven-javadoc-plugin:2.8.1:jar (module-javadocs) @ hadoop-hdfs-project ---
[INFO] Not executing Javadoc as the project is not a Java classpath-capable package
[INFO] 
[INFO] --- maven-enforcer-plugin:1.3.1:enforce (depcheck) @ hadoop-hdfs-project ---
[INFO] 
[INFO] --- maven-checkstyle-plugin:2.15:checkstyle (default-cli) @ hadoop-hdfs-project ---
[INFO] 
[INFO] --- findbugs-maven-plugin:3.0.0:findbugs (default-cli) @ hadoop-hdfs-project ---
[INFO] ------------------------------------------------------------------------
[INFO] Reactor Summary:
[INFO] 
[INFO] Apache Hadoop HDFS Client ......................... SUCCESS [03:11 min]
[INFO] Apache Hadoop HDFS ................................ FAILURE [  03:17 h]
[INFO] Apache Hadoop HttpFS .............................. SKIPPED
[INFO] Apache Hadoop HDFS BookKeeper Journal ............. SKIPPED
[INFO] Apache Hadoop HDFS-NFS ............................ SKIPPED
[INFO] Apache Hadoop HDFS Project ........................ SUCCESS [  0.105 s]
[INFO] ------------------------------------------------------------------------
[INFO] BUILD FAILURE
[INFO] ------------------------------------------------------------------------
[INFO] Total time: 03:20 h
[INFO] Finished at: 2015-09-21T08:08:07+00:00
[INFO] Final Memory: 55M/595M
[INFO] ------------------------------------------------------------------------
[ERROR] Failed to execute goal org.apache.maven.plugins:maven-surefire-plugin:2.17:test (default-test)
on project hadoop-hdfs: There are test failures.
[ERROR] 
[ERROR] Please refer to /home/jenkins/jenkins-slave/workspace/Hadoop-Hdfs-trunk-Java8/hadoop-hdfs-project/hadoop-hdfs/target/surefire-reports
for the individual test results.
[ERROR] -> [Help 1]
[ERROR] 
[ERROR] To see the full stack trace of the errors, re-run Maven with the -e switch.
[ERROR] Re-run Maven using the -X switch to enable full debug logging.
[ERROR] 
[ERROR] For more information about the errors and possible solutions, please read the following
articles:
[ERROR] [Help 1] http://cwiki.apache.org/confluence/display/MAVEN/MojoFailureException
[ERROR] 
[ERROR] After correcting the problems, you can resume the build with the command
[ERROR]   mvn <goals> -rf :hadoop-hdfs
Build step 'Execute shell' marked build as failure
Archiving artifacts
Sending artifact delta relative to Hadoop-Hdfs-trunk-Java8 #222
Archived 1 artifacts
Archive block size is 32768
Received 0 blocks and 5380874 bytes
Compression is 0.0%
Took 3.1 sec
Recording test results
Updating YARN-4167
Sending e-mails to: hdfs-dev@hadoop.apache.org
Email was triggered for: Failure
Sending email for trigger: Failure



###################################################################################
############################## FAILED TESTS (if any) ##############################
6 tests failed.
REGRESSION:  org.apache.hadoop.fs.viewfs.TestViewFileSystemAtHdfsRoot.testGetBlockLocations

Error Message:
expected:<9216,1024,127.0.0.1[]> but was:<9216,1024,127.0.0.1[,127.0.0.1]>

Stack Trace:
org.junit.ComparisonFailure: expected:<9216,1024,127.0.0.1[]> but was:<9216,1024,127.0.0.1[,127.0.0.1]>
	at org.junit.Assert.assertEquals(Assert.java:115)
	at org.junit.Assert.assertEquals(Assert.java:144)
	at org.apache.hadoop.fs.viewfs.ViewFileSystemBaseTest.compareBLs(ViewFileSystemBaseTest.java:404)
	at org.apache.hadoop.fs.viewfs.ViewFileSystemBaseTest.testGetBlockLocations(ViewFileSystemBaseTest.java:389)
	at sun.reflect.NativeMethodAccessorImpl.invoke0(Native Method)
	at sun.reflect.NativeMethodAccessorImpl.invoke(NativeMethodAccessorImpl.java:62)
	at sun.reflect.DelegatingMethodAccessorImpl.invoke(DelegatingMethodAccessorImpl.java:43)
	at java.lang.reflect.Method.invoke(Method.java:483)
	at org.junit.runners.model.FrameworkMethod$1.runReflectiveCall(FrameworkMethod.java:47)
	at org.junit.internal.runners.model.ReflectiveCallable.run(ReflectiveCallable.java:12)
	at org.junit.runners.model.FrameworkMethod.invokeExplosively(FrameworkMethod.java:44)
	at org.junit.internal.runners.statements.InvokeMethod.evaluate(InvokeMethod.java:17)
	at org.junit.internal.runners.statements.RunBefores.evaluate(RunBefores.java:26)
	at org.junit.internal.runners.statements.RunAfters.evaluate(RunAfters.java:27)
	at org.junit.runners.ParentRunner.runLeaf(ParentRunner.java:271)
	at org.junit.runners.BlockJUnit4ClassRunner.runChild(BlockJUnit4ClassRunner.java:70)
	at org.junit.runners.BlockJUnit4ClassRunner.runChild(BlockJUnit4ClassRunner.java:50)
	at org.junit.runners.ParentRunner$3.run(ParentRunner.java:238)
	at org.junit.runners.ParentRunner$1.schedule(ParentRunner.java:63)
	at org.junit.runners.ParentRunner.runChildren(ParentRunner.java:236)
	at org.junit.runners.ParentRunner.access$000(ParentRunner.java:53)
	at org.junit.runners.ParentRunner$2.evaluate(ParentRunner.java:229)
	at org.junit.internal.runners.statements.RunBefores.evaluate(RunBefores.java:26)
	at org.junit.internal.runners.statements.RunAfters.evaluate(RunAfters.java:27)
	at org.junit.runners.ParentRunner.run(ParentRunner.java:309)
	at org.apache.maven.surefire.junit4.JUnit4Provider.execute(JUnit4Provider.java:264)
	at org.apache.maven.surefire.junit4.JUnit4Provider.executeTestSet(JUnit4Provider.java:153)
	at org.apache.maven.surefire.junit4.JUnit4Provider.invoke(JUnit4Provider.java:124)
	at org.apache.maven.surefire.booter.ForkedBooter.invokeProviderInSameClassLoader(ForkedBooter.java:200)
	at org.apache.maven.surefire.booter.ForkedBooter.runSuitesInProcess(ForkedBooter.java:153)
	at org.apache.maven.surefire.booter.ForkedBooter.main(ForkedBooter.java:103)


REGRESSION:  org.apache.hadoop.hdfs.TestDistributedFileSystem.testDFSClientPeerWriteTimeout

Error Message:
write timedout too late in 1261 ms

Stack Trace:
java.lang.AssertionError: write timedout too late in 1261 ms
	at org.junit.Assert.fail(Assert.java:88)
	at org.junit.Assert.assertTrue(Assert.java:41)
	at org.apache.hadoop.hdfs.TestDistributedFileSystem.testDFSClientPeerWriteTimeout(TestDistributedFileSystem.java:1043)


REGRESSION:  org.apache.hadoop.hdfs.server.namenode.TestMetaSave.testMetasaveAfterDelete

Error Message:
org/apache/hadoop/fs/PathIsNotEmptyDirectoryException

Stack Trace:
java.lang.NoClassDefFoundError: org/apache/hadoop/fs/PathIsNotEmptyDirectoryException
	at java.net.URLClassLoader$1.run(URLClassLoader.java:372)
	at java.net.URLClassLoader$1.run(URLClassLoader.java:361)
	at java.security.AccessController.doPrivileged(Native Method)
	at java.net.URLClassLoader.findClass(URLClassLoader.java:360)
	at java.lang.ClassLoader.loadClass(ClassLoader.java:424)
	at sun.misc.Launcher$AppClassLoader.loadClass(Launcher.java:308)
	at java.lang.ClassLoader.loadClass(ClassLoader.java:357)
	at org.apache.hadoop.hdfs.server.namenode.FSNamesystem.delete(FSNamesystem.java:2689)
	at org.apache.hadoop.hdfs.server.namenode.NameNodeRpcServer.delete(NameNodeRpcServer.java:945)
	at org.apache.hadoop.hdfs.server.namenode.TestMetaSave.testMetasaveAfterDelete(TestMetaSave.java:130)


REGRESSION:  org.apache.hadoop.hdfs.server.namenode.TestMetaSave.testMetaSave

Error Message:
org/apache/hadoop/ipc/ProtobufHelper

Stack Trace:
java.lang.NoClassDefFoundError: org/apache/hadoop/ipc/ProtobufHelper
	at java.net.URLClassLoader$1.run(URLClassLoader.java:372)
	at java.net.URLClassLoader$1.run(URLClassLoader.java:361)
	at java.security.AccessController.doPrivileged(Native Method)
	at java.net.URLClassLoader.findClass(URLClassLoader.java:360)
	at java.lang.ClassLoader.loadClass(ClassLoader.java:424)
	at sun.misc.Launcher$AppClassLoader.loadClass(Launcher.java:308)
	at java.lang.ClassLoader.loadClass(ClassLoader.java:357)
	at org.apache.hadoop.hdfs.protocolPB.ClientNamenodeProtocolTranslatorPB.create(ClientNamenodeProtocolTranslatorPB.java:300)
	at sun.reflect.NativeMethodAccessorImpl.invoke0(Native Method)
	at sun.reflect.NativeMethodAccessorImpl.invoke(NativeMethodAccessorImpl.java:62)
	at sun.reflect.DelegatingMethodAccessorImpl.invoke(DelegatingMethodAccessorImpl.java:43)
	at java.lang.reflect.Method.invoke(Method.java:483)
	at org.apache.hadoop.io.retry.RetryInvocationHandler.invokeMethod(RetryInvocationHandler.java:251)
	at org.apache.hadoop.io.retry.RetryInvocationHandler.invoke(RetryInvocationHandler.java:103)
	at com.sun.proxy.$Proxy21.create(Unknown Source)
	at org.apache.hadoop.hdfs.DFSOutputStream.newStreamForCreate(DFSOutputStream.java:241)
	at org.apache.hadoop.hdfs.DFSClient.create(DFSClient.java:1224)
	at org.apache.hadoop.hdfs.DFSClient.create(DFSClient.java:1155)
	at org.apache.hadoop.hdfs.DistributedFileSystem$7.doCall(DistributedFileSystem.java:420)
	at org.apache.hadoop.hdfs.DistributedFileSystem$7.doCall(DistributedFileSystem.java:416)
	at org.apache.hadoop.fs.FileSystemLinkResolver.resolve(FileSystemLinkResolver.java:81)
	at org.apache.hadoop.hdfs.DistributedFileSystem.create(DistributedFileSystem.java:431)
	at org.apache.hadoop.fs.FileSystem.create(FileSystem.java:960)
	at org.apache.hadoop.hdfs.DFSTestUtil.createFile(DFSTestUtil.java:389)
	at org.apache.hadoop.hdfs.DFSTestUtil.createFile(DFSTestUtil.java:368)
	at org.apache.hadoop.hdfs.DFSTestUtil.createFile(DFSTestUtil.java:361)
	at org.apache.hadoop.hdfs.server.namenode.TestMetaSave.testMetaSave(TestMetaSave.java:79)


FAILED:  org.apache.hadoop.hdfs.server.namenode.TestMetaSave.org.apache.hadoop.hdfs.server.namenode.TestMetaSave

Error Message:
org/apache/hadoop/util/IntrusiveCollection$IntrusiveIterator

Stack Trace:
java.lang.NoClassDefFoundError: org/apache/hadoop/util/IntrusiveCollection$IntrusiveIterator
	at org.apache.hadoop.util.IntrusiveCollection.iterator(IntrusiveCollection.java:213)
	at org.apache.hadoop.util.IntrusiveCollection.clear(IntrusiveCollection.java:368)
	at org.apache.hadoop.hdfs.server.blockmanagement.DatanodeManager.clearPendingCachingCommands(DatanodeManager.java:1587)
	at org.apache.hadoop.hdfs.server.namenode.FSNamesystem.stopActiveServices(FSNamesystem.java:1212)
	at org.apache.hadoop.hdfs.server.namenode.FSNamesystem.close(FSNamesystem.java:1539)
	at org.apache.hadoop.hdfs.server.namenode.NameNode.stopCommonServices(NameNode.java:721)
	at org.apache.hadoop.hdfs.server.namenode.NameNode.stop(NameNode.java:886)
	at org.apache.hadoop.hdfs.MiniDFSCluster.shutdown(MiniDFSCluster.java:1866)
	at org.apache.hadoop.hdfs.MiniDFSCluster.shutdown(MiniDFSCluster.java:1835)
	at org.apache.hadoop.hdfs.MiniDFSCluster.shutdown(MiniDFSCluster.java:1828)
	at org.apache.hadoop.hdfs.server.namenode.TestMetaSave.tearDown(TestMetaSave.java:210)


FAILED:  org.apache.hadoop.hdfs.server.namenode.ha.TestSeveralNameNodes.testCircularLinkedListWrites

Error Message:
Some writers didn't complete in expected runtime! Current writer state:[Circular Writer:
  directory: /test-0
  target length: 50
  current item: 18
  done: false
, Circular Writer:
  directory: /test-1
  target length: 50
  current item: 18
  done: false
, Circular Writer:
  directory: /test-2
  target length: 50
  current item: 11
  done: false
] expected:<0> but was:<3>

Stack Trace:
java.lang.AssertionError: Some writers didn't complete in expected runtime! Current writer
state:[Circular Writer:
	 directory: /test-0
	 target length: 50
	 current item: 18
	 done: false
, Circular Writer:
	 directory: /test-1
	 target length: 50
	 current item: 18
	 done: false
, Circular Writer:
	 directory: /test-2
	 target length: 50
	 current item: 11
	 done: false
] expected:<0> but was:<3>
	at org.junit.Assert.fail(Assert.java:88)
	at org.junit.Assert.failNotEquals(Assert.java:743)
	at org.junit.Assert.assertEquals(Assert.java:118)
	at org.junit.Assert.assertEquals(Assert.java:555)
	at org.apache.hadoop.hdfs.server.namenode.ha.TestSeveralNameNodes.testCircularLinkedListWrites(TestSeveralNameNodes.java:90)



Mime
  • Unnamed multipart/mixed (inline, None, 0 bytes)
View raw message