hadoop-hdfs-dev mailing list archives

Site index · List index
Message view « Date » · « Thread »
Top « Date » · « Thread »
From Apache Jenkins Server <jenk...@builds.apache.org>
Subject Build failed in Jenkins: Hadoop-Hdfs-trunk-Java8 #326
Date Wed, 02 Sep 2015 22:16:35 GMT
See <https://builds.apache.org/job/Hadoop-Hdfs-trunk-Java8/326/changes>

Changes:

[cmccabe] HDFS-2070. Add more unit tests for FsShell getmerge (Daniel Templeton via Colin
P. McCabe)

[wang] HDFS-328. Improve fs -setrep error message for invalid replication factors. Contributed
by Daniel Templeton.

------------------------------------------
[...truncated 7011 lines...]
Java HotSpot(TM) 64-Bit Server VM warning: ignoring option MaxPermSize=768m; support was removed
in 8.0
Running org.apache.hadoop.hdfs.server.namenode.TestCheckpoint
Tests run: 38, Failures: 0, Errors: 0, Skipped: 0, Time elapsed: 70.433 sec - in org.apache.hadoop.hdfs.server.namenode.TestCheckpoint
Java HotSpot(TM) 64-Bit Server VM warning: ignoring option MaxPermSize=768m; support was removed
in 8.0
Running org.apache.hadoop.hdfs.server.namenode.TestParallelImageWrite
Tests run: 1, Failures: 0, Errors: 0, Skipped: 0, Time elapsed: 13.214 sec - in org.apache.hadoop.hdfs.server.namenode.TestParallelImageWrite
Java HotSpot(TM) 64-Bit Server VM warning: ignoring option MaxPermSize=768m; support was removed
in 8.0
Running org.apache.hadoop.hdfs.server.namenode.TestFileContextAcl
Tests run: 64, Failures: 0, Errors: 0, Skipped: 0, Time elapsed: 23.074 sec - in org.apache.hadoop.hdfs.server.namenode.TestFileContextAcl
Java HotSpot(TM) 64-Bit Server VM warning: ignoring option MaxPermSize=768m; support was removed
in 8.0
Running org.apache.hadoop.hdfs.server.namenode.TestAddBlockRetry
Tests run: 2, Failures: 0, Errors: 0, Skipped: 0, Time elapsed: 11.104 sec - in org.apache.hadoop.hdfs.server.namenode.TestAddBlockRetry
Java HotSpot(TM) 64-Bit Server VM warning: ignoring option MaxPermSize=768m; support was removed
in 8.0
Running org.apache.hadoop.hdfs.server.namenode.TestINodeFile
Tests run: 26, Failures: 0, Errors: 0, Skipped: 0, Time elapsed: 44.966 sec - in org.apache.hadoop.hdfs.server.namenode.TestINodeFile
Java HotSpot(TM) 64-Bit Server VM warning: ignoring option MaxPermSize=768m; support was removed
in 8.0
Running org.apache.hadoop.hdfs.server.namenode.TestNameNodeRetryCacheMetrics
Tests run: 1, Failures: 0, Errors: 0, Skipped: 0, Time elapsed: 7.517 sec - in org.apache.hadoop.hdfs.server.namenode.TestNameNodeRetryCacheMetrics
Java HotSpot(TM) 64-Bit Server VM warning: ignoring option MaxPermSize=768m; support was removed
in 8.0
Running org.apache.hadoop.hdfs.server.namenode.TestGetImageServlet
Tests run: 1, Failures: 0, Errors: 0, Skipped: 0, Time elapsed: 1.032 sec - in org.apache.hadoop.hdfs.server.namenode.TestGetImageServlet
Java HotSpot(TM) 64-Bit Server VM warning: ignoring option MaxPermSize=768m; support was removed
in 8.0
Running org.apache.hadoop.hdfs.server.namenode.TestAuditLogs
Tests run: 14, Failures: 0, Errors: 0, Skipped: 0, Time elapsed: 31.355 sec - in org.apache.hadoop.hdfs.server.namenode.TestAuditLogs
Java HotSpot(TM) 64-Bit Server VM warning: ignoring option MaxPermSize=768m; support was removed
in 8.0
Running org.apache.hadoop.hdfs.server.namenode.TestFSNamesystemMBean
Tests run: 3, Failures: 0, Errors: 0, Skipped: 0, Time elapsed: 6.343 sec - in org.apache.hadoop.hdfs.server.namenode.TestFSNamesystemMBean
Java HotSpot(TM) 64-Bit Server VM warning: ignoring option MaxPermSize=768m; support was removed
in 8.0
Running org.apache.hadoop.hdfs.server.namenode.snapshot.TestSnapshotFileLength
Tests run: 2, Failures: 0, Errors: 0, Skipped: 0, Time elapsed: 6.072 sec - in org.apache.hadoop.hdfs.server.namenode.snapshot.TestSnapshotFileLength
Java HotSpot(TM) 64-Bit Server VM warning: ignoring option MaxPermSize=768m; support was removed
in 8.0
Running org.apache.hadoop.hdfs.server.namenode.snapshot.TestXAttrWithSnapshot
Tests run: 8, Failures: 0, Errors: 0, Skipped: 0, Time elapsed: 8.618 sec - in org.apache.hadoop.hdfs.server.namenode.snapshot.TestXAttrWithSnapshot
Java HotSpot(TM) 64-Bit Server VM warning: ignoring option MaxPermSize=768m; support was removed
in 8.0
Running org.apache.hadoop.hdfs.server.namenode.snapshot.TestSnapshotDiffReport
Tests run: 8, Failures: 0, Errors: 0, Skipped: 0, Time elapsed: 16.786 sec - in org.apache.hadoop.hdfs.server.namenode.snapshot.TestSnapshotDiffReport
Java HotSpot(TM) 64-Bit Server VM warning: ignoring option MaxPermSize=768m; support was removed
in 8.0
Running org.apache.hadoop.hdfs.server.namenode.snapshot.TestSnapshotManager
Tests run: 1, Failures: 0, Errors: 0, Skipped: 0, Time elapsed: 0.517 sec - in org.apache.hadoop.hdfs.server.namenode.snapshot.TestSnapshotManager
Java HotSpot(TM) 64-Bit Server VM warning: ignoring option MaxPermSize=768m; support was removed
in 8.0
Running org.apache.hadoop.hdfs.server.namenode.snapshot.TestSnapshot
Tests run: 6, Failures: 0, Errors: 0, Skipped: 0, Time elapsed: 77.262 sec - in org.apache.hadoop.hdfs.server.namenode.snapshot.TestSnapshot
Java HotSpot(TM) 64-Bit Server VM warning: ignoring option MaxPermSize=768m; support was removed
in 8.0
Running org.apache.hadoop.hdfs.server.namenode.snapshot.TestSnapshotBlocksMap
Tests run: 7, Failures: 0, Errors: 0, Skipped: 0, Time elapsed: 24.672 sec - in org.apache.hadoop.hdfs.server.namenode.snapshot.TestSnapshotBlocksMap
Java HotSpot(TM) 64-Bit Server VM warning: ignoring option MaxPermSize=768m; support was removed
in 8.0
Running org.apache.hadoop.hdfs.server.namenode.snapshot.TestNestedSnapshots
Tests run: 5, Failures: 0, Errors: 0, Skipped: 0, Time elapsed: 53.62 sec - in org.apache.hadoop.hdfs.server.namenode.snapshot.TestNestedSnapshots
Java HotSpot(TM) 64-Bit Server VM warning: ignoring option MaxPermSize=768m; support was removed
in 8.0
Running org.apache.hadoop.hdfs.server.namenode.snapshot.TestUpdatePipelineWithSnapshots
Tests run: 1, Failures: 0, Errors: 0, Skipped: 0, Time elapsed: 9.762 sec - in org.apache.hadoop.hdfs.server.namenode.snapshot.TestUpdatePipelineWithSnapshots
Java HotSpot(TM) 64-Bit Server VM warning: ignoring option MaxPermSize=768m; support was removed
in 8.0
Running org.apache.hadoop.hdfs.server.namenode.snapshot.TestSnapshotDeletion
Tests run: 17, Failures: 0, Errors: 0, Skipped: 0, Time elapsed: 60.914 sec - in org.apache.hadoop.hdfs.server.namenode.snapshot.TestSnapshotDeletion
Java HotSpot(TM) 64-Bit Server VM warning: ignoring option MaxPermSize=768m; support was removed
in 8.0
Running org.apache.hadoop.hdfs.server.namenode.snapshot.TestRenameWithSnapshots
Tests run: 36, Failures: 0, Errors: 0, Skipped: 0, Time elapsed: 119.404 sec - in org.apache.hadoop.hdfs.server.namenode.snapshot.TestRenameWithSnapshots
Java HotSpot(TM) 64-Bit Server VM warning: ignoring option MaxPermSize=768m; support was removed
in 8.0
Running org.apache.hadoop.hdfs.server.namenode.snapshot.TestAclWithSnapshot
Tests run: 16, Failures: 0, Errors: 0, Skipped: 0, Time elapsed: 12.528 sec - in org.apache.hadoop.hdfs.server.namenode.snapshot.TestAclWithSnapshot
Java HotSpot(TM) 64-Bit Server VM warning: ignoring option MaxPermSize=768m; support was removed
in 8.0
Running org.apache.hadoop.hdfs.server.namenode.snapshot.TestDisallowModifyROSnapshot
Tests run: 11, Failures: 0, Errors: 0, Skipped: 0, Time elapsed: 4.006 sec - in org.apache.hadoop.hdfs.server.namenode.snapshot.TestDisallowModifyROSnapshot
Java HotSpot(TM) 64-Bit Server VM warning: ignoring option MaxPermSize=768m; support was removed
in 8.0
Running org.apache.hadoop.hdfs.server.namenode.snapshot.TestCheckpointsWithSnapshots
Tests run: 1, Failures: 0, Errors: 0, Skipped: 0, Time elapsed: 4.882 sec - in org.apache.hadoop.hdfs.server.namenode.snapshot.TestCheckpointsWithSnapshots
Java HotSpot(TM) 64-Bit Server VM warning: ignoring option MaxPermSize=768m; support was removed
in 8.0
Running org.apache.hadoop.hdfs.server.namenode.snapshot.TestFileWithSnapshotFeature
Tests run: 1, Failures: 0, Errors: 0, Skipped: 0, Time elapsed: 0.541 sec - in org.apache.hadoop.hdfs.server.namenode.snapshot.TestFileWithSnapshotFeature
Java HotSpot(TM) 64-Bit Server VM warning: ignoring option MaxPermSize=768m; support was removed
in 8.0
Running org.apache.hadoop.hdfs.server.namenode.snapshot.TestSnapshotReplication
Tests run: 3, Failures: 0, Errors: 0, Skipped: 0, Time elapsed: 10.482 sec - in org.apache.hadoop.hdfs.server.namenode.snapshot.TestSnapshotReplication
Java HotSpot(TM) 64-Bit Server VM warning: ignoring option MaxPermSize=768m; support was removed
in 8.0
Running org.apache.hadoop.hdfs.server.namenode.snapshot.TestSnapshottableDirListing
Tests run: 2, Failures: 0, Errors: 0, Skipped: 0, Time elapsed: 6.956 sec - in org.apache.hadoop.hdfs.server.namenode.snapshot.TestSnapshottableDirListing
Java HotSpot(TM) 64-Bit Server VM warning: ignoring option MaxPermSize=768m; support was removed
in 8.0
Running org.apache.hadoop.hdfs.server.namenode.snapshot.TestSnapshotNameWithInvalidCharacters
Tests run: 2, Failures: 0, Errors: 0, Skipped: 0, Time elapsed: 6.12 sec - in org.apache.hadoop.hdfs.server.namenode.snapshot.TestSnapshotNameWithInvalidCharacters
Java HotSpot(TM) 64-Bit Server VM warning: ignoring option MaxPermSize=768m; support was removed
in 8.0
Running org.apache.hadoop.hdfs.server.namenode.snapshot.TestSnapshotStatsMXBean
Tests run: 1, Failures: 0, Errors: 0, Skipped: 0, Time elapsed: 4.275 sec - in org.apache.hadoop.hdfs.server.namenode.snapshot.TestSnapshotStatsMXBean
Java HotSpot(TM) 64-Bit Server VM warning: ignoring option MaxPermSize=768m; support was removed
in 8.0
Running org.apache.hadoop.hdfs.server.namenode.snapshot.TestOpenFilesWithSnapshot
Tests run: 7, Failures: 0, Errors: 0, Skipped: 0, Time elapsed: 54.713 sec - in org.apache.hadoop.hdfs.server.namenode.snapshot.TestOpenFilesWithSnapshot
Java HotSpot(TM) 64-Bit Server VM warning: ignoring option MaxPermSize=768m; support was removed
in 8.0
Running org.apache.hadoop.hdfs.server.namenode.snapshot.TestSnapshotRename
Tests run: 6, Failures: 0, Errors: 0, Skipped: 0, Time elapsed: 13.176 sec - in org.apache.hadoop.hdfs.server.namenode.snapshot.TestSnapshotRename
Java HotSpot(TM) 64-Bit Server VM warning: ignoring option MaxPermSize=768m; support was removed
in 8.0
Running org.apache.hadoop.hdfs.server.namenode.snapshot.TestSnapshotMetrics
Tests run: 2, Failures: 0, Errors: 0, Skipped: 0, Time elapsed: 7.637 sec - in org.apache.hadoop.hdfs.server.namenode.snapshot.TestSnapshotMetrics
Java HotSpot(TM) 64-Bit Server VM warning: ignoring option MaxPermSize=768m; support was removed
in 8.0
Running org.apache.hadoop.hdfs.server.namenode.snapshot.TestINodeFileUnderConstructionWithSnapshot
Tests run: 4, Failures: 0, Errors: 0, Skipped: 0, Time elapsed: 11.779 sec - in org.apache.hadoop.hdfs.server.namenode.snapshot.TestINodeFileUnderConstructionWithSnapshot
Java HotSpot(TM) 64-Bit Server VM warning: ignoring option MaxPermSize=768m; support was removed
in 8.0
Running org.apache.hadoop.hdfs.server.namenode.snapshot.TestSetQuotaWithSnapshot
Tests run: 2, Failures: 0, Errors: 0, Skipped: 0, Time elapsed: 6.891 sec - in org.apache.hadoop.hdfs.server.namenode.snapshot.TestSetQuotaWithSnapshot
Java HotSpot(TM) 64-Bit Server VM warning: ignoring option MaxPermSize=768m; support was removed
in 8.0
Running org.apache.hadoop.hdfs.server.namenode.snapshot.TestSnapshotListing
Tests run: 1, Failures: 0, Errors: 0, Skipped: 0, Time elapsed: 4.483 sec - in org.apache.hadoop.hdfs.server.namenode.snapshot.TestSnapshotListing
Java HotSpot(TM) 64-Bit Server VM warning: ignoring option MaxPermSize=768m; support was removed
in 8.0
Running org.apache.hadoop.hdfs.server.namenode.snapshot.TestFileContextSnapshot
Tests run: 2, Failures: 0, Errors: 0, Skipped: 0, Time elapsed: 6.869 sec - in org.apache.hadoop.hdfs.server.namenode.snapshot.TestFileContextSnapshot
Java HotSpot(TM) 64-Bit Server VM warning: ignoring option MaxPermSize=768m; support was removed
in 8.0
Running org.apache.hadoop.hdfs.server.namenode.TestSecondaryWebUi
Tests run: 1, Failures: 0, Errors: 0, Skipped: 0, Time elapsed: 4.055 sec - in org.apache.hadoop.hdfs.server.namenode.TestSecondaryWebUi
Java HotSpot(TM) 64-Bit Server VM warning: ignoring option MaxPermSize=768m; support was removed
in 8.0
Running org.apache.hadoop.hdfs.server.namenode.TestAuditLogger
Tests run: 6, Failures: 0, Errors: 0, Skipped: 0, Time elapsed: 11.118 sec - in org.apache.hadoop.hdfs.server.namenode.TestAuditLogger
Java HotSpot(TM) 64-Bit Server VM warning: ignoring option MaxPermSize=768m; support was removed
in 8.0
Running org.apache.hadoop.hdfs.server.namenode.TestSnapshotPathINodes
Tests run: 6, Failures: 0, Errors: 0, Skipped: 0, Time elapsed: 5.663 sec - in org.apache.hadoop.hdfs.server.namenode.TestSnapshotPathINodes
Java HotSpot(TM) 64-Bit Server VM warning: ignoring option MaxPermSize=768m; support was removed
in 8.0
Running org.apache.hadoop.hdfs.server.namenode.TestCheckPointForSecurityTokens
Tests run: 1, Failures: 0, Errors: 0, Skipped: 0, Time elapsed: 9.006 sec - in org.apache.hadoop.hdfs.server.namenode.TestCheckPointForSecurityTokens
Java HotSpot(TM) 64-Bit Server VM warning: ignoring option MaxPermSize=768m; support was removed
in 8.0
Running org.apache.hadoop.hdfs.server.namenode.TestEditLogJournalFailures
Tests run: 6, Failures: 0, Errors: 0, Skipped: 0, Time elapsed: 9.272 sec - in org.apache.hadoop.hdfs.server.namenode.TestEditLogJournalFailures
Java HotSpot(TM) 64-Bit Server VM warning: ignoring option MaxPermSize=768m; support was removed
in 8.0
Running org.apache.hadoop.hdfs.server.namenode.TestCacheDirectives
Tests run: 13, Failures: 0, Errors: 0, Skipped: 0, Time elapsed: 87.641 sec - in org.apache.hadoop.hdfs.server.namenode.TestCacheDirectives
Java HotSpot(TM) 64-Bit Server VM warning: ignoring option MaxPermSize=768m; support was removed
in 8.0
Running org.apache.hadoop.hdfs.server.namenode.web.resources.TestWebHdfsDataLocality
Tests run: 3, Failures: 0, Errors: 0, Skipped: 0, Time elapsed: 9.082 sec - in org.apache.hadoop.hdfs.server.namenode.web.resources.TestWebHdfsDataLocality
Java HotSpot(TM) 64-Bit Server VM warning: ignoring option MaxPermSize=768m; support was removed
in 8.0
Running org.apache.hadoop.hdfs.server.namenode.TestSecurityTokenEditLog
Tests run: 2, Failures: 0, Errors: 0, Skipped: 0, Time elapsed: 15.05 sec - in org.apache.hadoop.hdfs.server.namenode.TestSecurityTokenEditLog
Java HotSpot(TM) 64-Bit Server VM warning: ignoring option MaxPermSize=768m; support was removed
in 8.0
Running org.apache.hadoop.hdfs.server.namenode.TestGetBlockLocations
Tests run: 3, Failures: 0, Errors: 0, Skipped: 0, Time elapsed: 2.096 sec - in org.apache.hadoop.hdfs.server.namenode.TestGetBlockLocations
Java HotSpot(TM) 64-Bit Server VM warning: ignoring option MaxPermSize=768m; support was removed
in 8.0
Running org.apache.hadoop.hdfs.server.namenode.TestNameNodeAcl
Tests run: 64, Failures: 0, Errors: 0, Skipped: 0, Time elapsed: 23.446 sec - in org.apache.hadoop.hdfs.server.namenode.TestNameNodeAcl
Java HotSpot(TM) 64-Bit Server VM warning: ignoring option MaxPermSize=768m; support was removed
in 8.0
Running org.apache.hadoop.hdfs.server.namenode.TestAddBlock
Tests run: 2, Failures: 0, Errors: 0, Skipped: 0, Time elapsed: 16.392 sec - in org.apache.hadoop.hdfs.server.namenode.TestAddBlock
Java HotSpot(TM) 64-Bit Server VM warning: ignoring option MaxPermSize=768m; support was removed
in 8.0
Running org.apache.hadoop.hdfs.server.namenode.TestFsck
Tests run: 22, Failures: 0, Errors: 0, Skipped: 0, Time elapsed: 63.69 sec - in org.apache.hadoop.hdfs.server.namenode.TestFsck
Java HotSpot(TM) 64-Bit Server VM warning: ignoring option MaxPermSize=768m; support was removed
in 8.0
Running org.apache.hadoop.hdfs.server.namenode.TestTruncateQuotaUpdate
Tests run: 3, Failures: 0, Errors: 0, Skipped: 0, Time elapsed: 0.358 sec - in org.apache.hadoop.hdfs.server.namenode.TestTruncateQuotaUpdate
Java HotSpot(TM) 64-Bit Server VM warning: ignoring option MaxPermSize=768m; support was removed
in 8.0
Running org.apache.hadoop.hdfs.server.namenode.TestHostsFiles
Tests run: 2, Failures: 0, Errors: 0, Skipped: 0, Time elapsed: 11.823 sec - in org.apache.hadoop.hdfs.server.namenode.TestHostsFiles
Java HotSpot(TM) 64-Bit Server VM warning: ignoring option MaxPermSize=768m; support was removed
in 8.0
Running org.apache.hadoop.hdfs.server.namenode.TestStartupProgressServlet
Tests run: 3, Failures: 0, Errors: 0, Skipped: 0, Time elapsed: 0.53 sec - in org.apache.hadoop.hdfs.server.namenode.TestStartupProgressServlet
Java HotSpot(TM) 64-Bit Server VM warning: ignoring option MaxPermSize=768m; support was removed
in 8.0
Running org.apache.hadoop.hdfs.server.namenode.TestFileContextXAttr
Tests run: 12, Failures: 0, Errors: 0, Skipped: 0, Time elapsed: 13.111 sec - in org.apache.hadoop.hdfs.server.namenode.TestFileContextXAttr
Java HotSpot(TM) 64-Bit Server VM warning: ignoring option MaxPermSize=768m; support was removed
in 8.0
Running org.apache.hadoop.hdfs.server.namenode.TestFSImageWithSnapshot
Tests run: 6, Failures: 0, Errors: 0, Skipped: 0, Time elapsed: 30.667 sec - in org.apache.hadoop.hdfs.server.namenode.TestFSImageWithSnapshot
Java HotSpot(TM) 64-Bit Server VM warning: ignoring option MaxPermSize=768m; support was removed
in 8.0
Running org.apache.hadoop.hdfs.server.namenode.TestFileTruncate

Results :

Tests in error: 
  TestPread.testHedgedReadLoopTooManyTimes:289 » Runtime java.util.zip.ZipExcept...
  TestPread.testPreadDFS:256->dfsPreadTest:448 » Runtime java.util.zip.ZipExcept...
  TestPread.testPreadDFSSimulated:476->testPreadDFS:256->dfsPreadTest:448 » Runtime
  TestPread.testHedgedPreadDFSBasic:276 » Runtime java.util.zip.ZipException: in...

Tests run: 2300, Failures: 0, Errors: 4, Skipped: 11

[INFO]                                                                         
[INFO] ------------------------------------------------------------------------
[INFO] Skipping Apache Hadoop HttpFS
[INFO] This project has been banned from the build due to previous failures.
[INFO] ------------------------------------------------------------------------
[INFO]                                                                         
[INFO] ------------------------------------------------------------------------
[INFO] Skipping Apache Hadoop HDFS BookKeeper Journal
[INFO] This project has been banned from the build due to previous failures.
[INFO] ------------------------------------------------------------------------
[INFO]                                                                         
[INFO] ------------------------------------------------------------------------
[INFO] Skipping Apache Hadoop HDFS-NFS
[INFO] This project has been banned from the build due to previous failures.
[INFO] ------------------------------------------------------------------------
[INFO]                                                                         
[INFO] ------------------------------------------------------------------------
[INFO] Building Apache Hadoop HDFS Project 3.0.0-SNAPSHOT
[INFO] ------------------------------------------------------------------------
[INFO] 
[INFO] --- maven-clean-plugin:2.5:clean (default-clean) @ hadoop-hdfs-project ---
[INFO] Deleting <https://builds.apache.org/job/Hadoop-Hdfs-trunk-Java8/ws/hadoop-hdfs-project/target>
[INFO] 
[INFO] --- maven-antrun-plugin:1.7:run (create-testdirs) @ hadoop-hdfs-project ---
[INFO] Executing tasks

main:
    [mkdir] Created dir: <https://builds.apache.org/job/Hadoop-Hdfs-trunk-Java8/ws/hadoop-hdfs-project/target/test-dir>
[INFO] Executed tasks
[INFO] 
[INFO] --- maven-source-plugin:2.3:jar-no-fork (hadoop-java-sources) @ hadoop-hdfs-project
---
[INFO] 
[INFO] --- maven-source-plugin:2.3:test-jar-no-fork (hadoop-java-sources) @ hadoop-hdfs-project
---
[INFO] 
[INFO] --- maven-enforcer-plugin:1.3.1:enforce (dist-enforce) @ hadoop-hdfs-project ---
[INFO] 
[INFO] --- maven-site-plugin:3.4:attach-descriptor (attach-descriptor) @ hadoop-hdfs-project
---
[INFO] 
[INFO] --- maven-javadoc-plugin:2.8.1:jar (module-javadocs) @ hadoop-hdfs-project ---
[INFO] Not executing Javadoc as the project is not a Java classpath-capable package
[INFO] 
[INFO] --- maven-enforcer-plugin:1.3.1:enforce (depcheck) @ hadoop-hdfs-project ---
[INFO] 
[INFO] --- maven-checkstyle-plugin:2.15:checkstyle (default-cli) @ hadoop-hdfs-project ---
[INFO] 
[INFO] --- findbugs-maven-plugin:3.0.0:findbugs (default-cli) @ hadoop-hdfs-project ---
[INFO] ------------------------------------------------------------------------
[INFO] Reactor Summary:
[INFO] 
[INFO] Apache Hadoop HDFS Client ......................... SUCCESS [03:17 min]
[INFO] Apache Hadoop HDFS ................................ FAILURE [  01:14 h]
[INFO] Apache Hadoop HttpFS .............................. SKIPPED
[INFO] Apache Hadoop HDFS BookKeeper Journal ............. SKIPPED
[INFO] Apache Hadoop HDFS-NFS ............................ SKIPPED
[INFO] Apache Hadoop HDFS Project ........................ SUCCESS [  0.069 s]
[INFO] ------------------------------------------------------------------------
[INFO] BUILD FAILURE
[INFO] ------------------------------------------------------------------------
[INFO] Total time: 01:17 h
[INFO] Finished at: 2015-09-02T22:17:40+00:00
[INFO] Final Memory: 73M/1046M
[INFO] ------------------------------------------------------------------------
[ERROR] Failed to execute goal org.apache.maven.plugins:maven-surefire-plugin:2.17:test (default-test)
on project hadoop-hdfs: ExecutionException: org.apache.maven.surefire.booter.SurefireBooterForkException:
Error occurred in starting fork, check output in log -> [Help 1]
[ERROR] 
[ERROR] To see the full stack trace of the errors, re-run Maven with the -e switch.
[ERROR] Re-run Maven using the -X switch to enable full debug logging.
[ERROR] 
[ERROR] For more information about the errors and possible solutions, please read the following
articles:
[ERROR] [Help 1] http://cwiki.apache.org/confluence/display/MAVEN/MojoFailureException
[ERROR] 
[ERROR] After correcting the problems, you can resume the build with the command
[ERROR]   mvn <goals> -rf :hadoop-hdfs
Build step 'Execute shell' marked build as failure
Archiving artifacts
Sending artifact delta relative to Hadoop-Hdfs-trunk-Java8 #222
Archived 1 artifacts
Archive block size is 32768
Received 0 blocks and 5276921 bytes
Compression is 0.0%
Took 3.3 sec
Recording test results
Updating HDFS-2070
Updating HDFS-328

Mime
View raw message