hadoop-hdfs-dev mailing list archives

Site index · List index
Message view « Date » · « Thread »
Top « Date » · « Thread »
From Apache Jenkins Server <jenk...@builds.apache.org>
Subject Build failed in Jenkins: Hadoop-Hdfs-trunk-Java8 #427
Date Mon, 28 Sep 2015 11:37:18 GMT
See <https://builds.apache.org/job/Hadoop-Hdfs-trunk-Java8/427/changes>

Changes:

[harsh] MAPREDUCE-6471. Document distcp incremental copy. Contributed by Neelesh Srinivas
Salian.

------------------------------------------
[...truncated 8181 lines...]
java.lang.NoSuchMethodError: org.apache.hadoop.util.ShutdownHookManager.clearShutdownHooks()V
	at org.apache.hadoop.hdfs.MiniDFSCluster.shutdown(MiniDFSCluster.java:1871)
	at org.apache.hadoop.hdfs.MiniDFSCluster.shutdown(MiniDFSCluster.java:1835)
	at org.apache.hadoop.hdfs.MiniDFSCluster.shutdown(MiniDFSCluster.java:1828)
	at org.apache.hadoop.TestRefreshCallQueue.tearDown(TestRefreshCallQueue.java:88)

Java HotSpot(TM) 64-Bit Server VM warning: ignoring option MaxPermSize=768m; support was removed
in 8.0
Running org.apache.hadoop.net.TestNetworkTopology
Tests run: 10, Failures: 0, Errors: 1, Skipped: 0, Time elapsed: 9.476 sec <<< FAILURE!
- in org.apache.hadoop.net.TestNetworkTopology
testInvalidNetworkTopologiesNotCachedInHdfs(org.apache.hadoop.net.TestNetworkTopology)  Time
elapsed: 9.143 sec  <<< ERROR!
java.lang.NoSuchMethodError: org.apache.hadoop.util.ShutdownHookManager.clearShutdownHooks()V
	at org.apache.hadoop.hdfs.MiniDFSCluster.shutdown(MiniDFSCluster.java:1871)
	at org.apache.hadoop.hdfs.MiniDFSCluster.shutdown(MiniDFSCluster.java:1835)
	at org.apache.hadoop.hdfs.MiniDFSCluster.shutdown(MiniDFSCluster.java:1828)
	at org.apache.hadoop.net.TestNetworkTopology.testInvalidNetworkTopologiesNotCachedInHdfs(TestNetworkTopology.java:367)

Java HotSpot(TM) 64-Bit Server VM warning: ignoring option MaxPermSize=768m; support was removed
in 8.0
Running org.apache.hadoop.cli.TestCacheAdminCLI
Tests run: 2, Failures: 0, Errors: 2, Skipped: 0, Time elapsed: 4.304 sec <<< FAILURE!
- in org.apache.hadoop.cli.TestCacheAdminCLI
testAll(org.apache.hadoop.cli.TestCacheAdminCLI)  Time elapsed: 4.102 sec  <<< ERROR!
java.lang.NoSuchMethodError: org.apache.hadoop.cli.util.CLICommand.getExecutor(Ljava/lang/String;Lorg/apache/hadoop/conf/Configuration;)Lorg/apache/hadoop/cli/util/CommandExecutor;
	at org.apache.hadoop.cli.TestCacheAdminCLI.execute(TestCacheAdminCLI.java:134)

testAll(org.apache.hadoop.cli.TestCacheAdminCLI)  Time elapsed: 4.102 sec  <<< ERROR!
java.lang.NoSuchMethodError: org.apache.hadoop.util.ShutdownHookManager.clearShutdownHooks()V
	at org.apache.hadoop.hdfs.MiniDFSCluster.shutdown(MiniDFSCluster.java:1871)
	at org.apache.hadoop.hdfs.MiniDFSCluster.shutdown(MiniDFSCluster.java:1835)
	at org.apache.hadoop.hdfs.MiniDFSCluster.shutdown(MiniDFSCluster.java:1828)
	at org.apache.hadoop.cli.TestCacheAdminCLI.tearDown(TestCacheAdminCLI.java:81)

Java HotSpot(TM) 64-Bit Server VM warning: ignoring option MaxPermSize=768m; support was removed
in 8.0
Running org.apache.hadoop.cli.TestCryptoAdminCLI
Tests run: 2, Failures: 0, Errors: 2, Skipped: 0, Time elapsed: 4.244 sec <<< FAILURE!
- in org.apache.hadoop.cli.TestCryptoAdminCLI
testAll(org.apache.hadoop.cli.TestCryptoAdminCLI)  Time elapsed: 4.032 sec  <<< ERROR!
java.lang.NoSuchMethodError: org.apache.hadoop.cli.util.CLICommand.getExecutor(Ljava/lang/String;Lorg/apache/hadoop/conf/Configuration;)Lorg/apache/hadoop/cli/util/CommandExecutor;
	at org.apache.hadoop.cli.TestCryptoAdminCLI.execute(TestCryptoAdminCLI.java:163)

testAll(org.apache.hadoop.cli.TestCryptoAdminCLI)  Time elapsed: 4.033 sec  <<< ERROR!
java.lang.NoSuchMethodError: org.apache.hadoop.util.ShutdownHookManager.clearShutdownHooks()V
	at org.apache.hadoop.hdfs.MiniDFSCluster.shutdown(MiniDFSCluster.java:1871)
	at org.apache.hadoop.hdfs.MiniDFSCluster.shutdown(MiniDFSCluster.java:1835)
	at org.apache.hadoop.hdfs.MiniDFSCluster.shutdown(MiniDFSCluster.java:1828)
	at org.apache.hadoop.cli.TestCryptoAdminCLI.tearDown(TestCryptoAdminCLI.java:91)

Java HotSpot(TM) 64-Bit Server VM warning: ignoring option MaxPermSize=768m; support was removed
in 8.0
Running org.apache.hadoop.cli.TestDeleteCLI
Tests run: 2, Failures: 0, Errors: 2, Skipped: 0, Time elapsed: 4.041 sec <<< FAILURE!
- in org.apache.hadoop.cli.TestDeleteCLI
testAll(org.apache.hadoop.cli.TestDeleteCLI)  Time elapsed: 3.849 sec  <<< ERROR!
java.lang.NoSuchMethodError: org.apache.hadoop.cli.util.CLICommand.getExecutor(Ljava/lang/String;Lorg/apache/hadoop/conf/Configuration;)Lorg/apache/hadoop/cli/util/CommandExecutor;
	at org.apache.hadoop.cli.TestDeleteCLI.execute(TestDeleteCLI.java:84)

testAll(org.apache.hadoop.cli.TestDeleteCLI)  Time elapsed: 3.852 sec  <<< ERROR!
java.lang.NoSuchMethodError: org.apache.hadoop.util.ShutdownHookManager.clearShutdownHooks()V
	at org.apache.hadoop.hdfs.MiniDFSCluster.shutdown(MiniDFSCluster.java:1871)
	at org.apache.hadoop.hdfs.MiniDFSCluster.shutdown(MiniDFSCluster.java:1835)
	at org.apache.hadoop.hdfs.MiniDFSCluster.shutdown(MiniDFSCluster.java:1828)
	at org.apache.hadoop.cli.TestDeleteCLI.tearDown(TestDeleteCLI.java:63)

Java HotSpot(TM) 64-Bit Server VM warning: ignoring option MaxPermSize=768m; support was removed
in 8.0
Running org.apache.hadoop.cli.TestAclCLI
Tests run: 2, Failures: 1, Errors: 1, Skipped: 0, Time elapsed: 3.67 sec <<< FAILURE!
- in org.apache.hadoop.cli.TestAclCLI
testAll(org.apache.hadoop.cli.TestAclCLI)  Time elapsed: 3.488 sec  <<< ERROR!
java.lang.NoSuchMethodError: org.apache.hadoop.cli.util.CLICommand.getExecutor(Ljava/lang/String;Lorg/apache/hadoop/conf/Configuration;)Lorg/apache/hadoop/cli/util/CommandExecutor;
	at org.apache.hadoop.cli.TestAclCLI.execute(TestAclCLI.java:76)

testAll(org.apache.hadoop.cli.TestAclCLI)  Time elapsed: 3.488 sec  <<< FAILURE!
java.lang.AssertionError: One of the tests failed. See the Detailed results to identify the
command that failed
	at org.junit.Assert.fail(Assert.java:88)
	at org.junit.Assert.assertTrue(Assert.java:41)
	at org.apache.hadoop.cli.CLITestHelper.displayResults(CLITestHelper.java:263)
	at org.apache.hadoop.cli.CLITestHelper.tearDown(CLITestHelper.java:125)
	at org.apache.hadoop.cli.TestAclCLI.tearDown(TestAclCLI.java:49)

Java HotSpot(TM) 64-Bit Server VM warning: ignoring option MaxPermSize=768m; support was removed
in 8.0
Running org.apache.hadoop.cli.TestXAttrCLI
Tests run: 2, Failures: 0, Errors: 2, Skipped: 0, Time elapsed: 4.014 sec <<< FAILURE!
- in org.apache.hadoop.cli.TestXAttrCLI
testAll(org.apache.hadoop.cli.TestXAttrCLI)  Time elapsed: 3.833 sec  <<< ERROR!
java.lang.NoSuchMethodError: org.apache.hadoop.cli.util.CLICommand.getExecutor(Ljava/lang/String;Lorg/apache/hadoop/conf/Configuration;)Lorg/apache/hadoop/cli/util/CommandExecutor;
	at org.apache.hadoop.cli.TestXAttrCLI.execute(TestXAttrCLI.java:90)

testAll(org.apache.hadoop.cli.TestXAttrCLI)  Time elapsed: 3.839 sec  <<< ERROR!
java.lang.NoSuchMethodError: org.apache.hadoop.util.ShutdownHookManager.clearShutdownHooks()V
	at org.apache.hadoop.hdfs.MiniDFSCluster.shutdown(MiniDFSCluster.java:1871)
	at org.apache.hadoop.hdfs.MiniDFSCluster.shutdown(MiniDFSCluster.java:1835)
	at org.apache.hadoop.hdfs.MiniDFSCluster.shutdown(MiniDFSCluster.java:1828)
	at org.apache.hadoop.cli.TestXAttrCLI.tearDown(TestXAttrCLI.java:72)

Java HotSpot(TM) 64-Bit Server VM warning: ignoring option MaxPermSize=768m; support was removed
in 8.0
Running org.apache.hadoop.cli.TestHDFSCLI
Tests run: 2, Failures: 0, Errors: 2, Skipped: 0, Time elapsed: 5.838 sec <<< FAILURE!
- in org.apache.hadoop.cli.TestHDFSCLI
testAll(org.apache.hadoop.cli.TestHDFSCLI)  Time elapsed: 5.643 sec  <<< ERROR!
java.lang.NoSuchMethodError: org.apache.hadoop.cli.util.CLICommand.getExecutor(Ljava/lang/String;Lorg/apache/hadoop/conf/Configuration;)Lorg/apache/hadoop/cli/util/CommandExecutor;
	at org.apache.hadoop.cli.TestHDFSCLI.execute(TestHDFSCLI.java:98)

testAll(org.apache.hadoop.cli.TestHDFSCLI)  Time elapsed: 5.643 sec  <<< ERROR!
java.lang.NoSuchMethodError: org.apache.hadoop.util.ShutdownHookManager.clearShutdownHooks()V
	at org.apache.hadoop.hdfs.MiniDFSCluster.shutdown(MiniDFSCluster.java:1871)
	at org.apache.hadoop.hdfs.MiniDFSCluster.shutdown(MiniDFSCluster.java:1835)
	at org.apache.hadoop.hdfs.MiniDFSCluster.shutdown(MiniDFSCluster.java:1828)
	at org.apache.hadoop.cli.TestHDFSCLI.tearDown(TestHDFSCLI.java:82)


Results :

Failed tests: 
  TestSeveralNameNodes.testCircularLinkedListWrites:90 Some writers didn't complete in expected
runtime! Current writer state:[Circular Writer:
	 directory: /test-0
	 target length: 50
	 current item: 50
	 done: false
, Circular Writer:
	 directory: /test-1
	 target length: 50
	 current item: 11
	 done: false
, Circular Writer:
	 directory: /test-2
	 target length: 50
	 current item: 43
	 done: false
] expected:<0> but was:<3>
  TestAclCLI.tearDown:49->CLITestHelper.tearDown:125->CLITestHelper.displayResults:263
One of the tests failed. See the Detailed results to identify the command that failed

Tests in error: 
  TestWebHDFSOAuth2.listStatusReturnsAsExpected:147 » IO Unable to load OAuth2 c...
  TestWebHdfsFileContextMainOperations.clusterSetupAtBeginning:77 » NoClassDefFound
  TestSymlinkHdfsFileContext>TestSymlinkHdfs.beforeClassSetup:92 » NoClassDefFound
  TestSymlinkHdfsFileContext>TestSymlinkHdfs.afterClassTeardown:99 » NullPointer
  TestUnbuffer.testUnbufferClosesSockets:87 » NoSuchMethod org.apache.hadoop.uti...
  TestUnbuffer.testOpenManyFilesViaTcp:122 » NoSuchMethod org.apache.hadoop.util...
  TestHdfsTextCommand.tearDown:65 » NoSuchMethod org.apache.hadoop.util.Shutdown...
  TestResolveHdfsSymlink.tearDown:69 » NoSuchMethod org.apache.hadoop.util.Shutd...
  TestFcHdfsCreateMkdir.ClusterShutdownAtEnd:61 » NoSuchMethod org.apache.hadoop...
  TestFcHdfsPermission.ClusterShutdownAtEnd:68 » NoSuchMethod org.apache.hadoop....
  TestGlobPaths.tearDown:87 » NoSuchMethod org.apache.hadoop.util.ShutdownHookMa...
  TestUrlStreamHandler.testDfsUrls:100 » NoSuchMethod org.apache.hadoop.util.Shu...
  TestViewFileSystemAtHdfsRoot.clusterShutdownAtEnd:69 » NoSuchMethod org.apache...
  TestViewFsWithAcls.ClusterShutdownAtEnd:79 » NoSuchMethod org.apache.hadoop.ut...
  TestViewFileSystemWithAcls.ClusterShutdownAtEnd:79 » NoSuchMethod org.apache.h...
  TestViewFileSystemHdfs.ClusterShutdownAtEnd:91 » NoSuchMethod org.apache.hadoo...
  TestViewFsAtHdfsRoot.ClusterShutdownAtEnd:67 » NoSuchMethod org.apache.hadoop....
  TestViewFileSystemWithXAttrs.ClusterShutdownAtEnd:74 » NoSuchMethod org.apache...
  TestViewFsWithXAttrs.ClusterShutdownAtEnd:73 » NoSuchMethod org.apache.hadoop....
  TestViewFsHdfs.ClusterShutdownAtEnd:67 » NoSuchMethod org.apache.hadoop.util.S...
  TestJMXGet.testDataNode:159 » NoSuchMethod org.apache.hadoop.util.ShutdownHook...
  TestJMXGet.tearDown:77 » NoSuchMethod org.apache.hadoop.util.ShutdownHookManag...
  TestJMXGet.testNameNode:115 » NoSuchMethod org.apache.hadoop.util.ShutdownHook...
  TestJMXGet.tearDown:77 » NoSuchMethod org.apache.hadoop.util.ShutdownHookManag...
  TestRefreshCallQueue.tearDown:88 » NoSuchMethod org.apache.hadoop.util.Shutdow...
  TestNetworkTopology.testInvalidNetworkTopologiesNotCachedInHdfs:367 » NoSuchMethod
  TestCacheAdminCLI.testAll:140->CLITestHelper.testAll:319->execute:134 NoSuchMethod
  TestCacheAdminCLI.tearDown:81 » NoSuchMethod org.apache.hadoop.util.ShutdownHo...
  TestCryptoAdminCLI.testAll:169->CLITestHelper.testAll:319->execute:163 NoSuchMethod
  TestCryptoAdminCLI.tearDown:91 » NoSuchMethod org.apache.hadoop.util.ShutdownH...
  TestDeleteCLI.testAll:90->CLITestHelper.testAll:319->execute:84 NoSuchMethod o...
  TestDeleteCLI.tearDown:63 » NoSuchMethod org.apache.hadoop.util.ShutdownHookMa...
  TestAclCLI.testAll:82->CLITestHelper.testAll:319->execute:76 NoSuchMethod org....
  TestXAttrCLI.testAll:96->CLITestHelper.testAll:319->execute:90 NoSuchMethod or...
  TestXAttrCLI.tearDown:72 » NoSuchMethod org.apache.hadoop.util.ShutdownHookMan...
  TestHDFSCLI.testAll:104->CLITestHelper.testAll:319->execute:98 NoSuchMethod or...
  TestHDFSCLI.tearDown:82 » NoSuchMethod org.apache.hadoop.util.ShutdownHookMana...

Tests run: 3577, Failures: 2, Errors: 37, Skipped: 16

[INFO]                                                                         
[INFO] ------------------------------------------------------------------------
[INFO] Skipping Apache Hadoop HttpFS
[INFO] This project has been banned from the build due to previous failures.
[INFO] ------------------------------------------------------------------------
[INFO]                                                                         
[INFO] ------------------------------------------------------------------------
[INFO] Skipping Apache Hadoop HDFS BookKeeper Journal
[INFO] This project has been banned from the build due to previous failures.
[INFO] ------------------------------------------------------------------------
[INFO]                                                                         
[INFO] ------------------------------------------------------------------------
[INFO] Skipping Apache Hadoop HDFS-NFS
[INFO] This project has been banned from the build due to previous failures.
[INFO] ------------------------------------------------------------------------
[INFO]                                                                         
[INFO] ------------------------------------------------------------------------
[INFO] Building Apache Hadoop HDFS Project 3.0.0-SNAPSHOT
[INFO] ------------------------------------------------------------------------
[INFO] 
[INFO] --- maven-clean-plugin:2.5:clean (default-clean) @ hadoop-hdfs-project ---
[INFO] Deleting <https://builds.apache.org/job/Hadoop-Hdfs-trunk-Java8/ws/hadoop-hdfs-project/target>
[INFO] 
[INFO] --- maven-antrun-plugin:1.7:run (create-testdirs) @ hadoop-hdfs-project ---
[INFO] Executing tasks

main:
    [mkdir] Created dir: <https://builds.apache.org/job/Hadoop-Hdfs-trunk-Java8/ws/hadoop-hdfs-project/target/test-dir>
[INFO] Executed tasks
[INFO] 
[INFO] --- maven-source-plugin:2.3:jar-no-fork (hadoop-java-sources) @ hadoop-hdfs-project
---
[INFO] 
[INFO] --- maven-source-plugin:2.3:test-jar-no-fork (hadoop-java-sources) @ hadoop-hdfs-project
---
[INFO] 
[INFO] --- maven-enforcer-plugin:1.3.1:enforce (dist-enforce) @ hadoop-hdfs-project ---
[INFO] 
[INFO] --- maven-site-plugin:3.4:attach-descriptor (attach-descriptor) @ hadoop-hdfs-project
---
[INFO] 
[INFO] --- maven-javadoc-plugin:2.8.1:jar (module-javadocs) @ hadoop-hdfs-project ---
[INFO] Not executing Javadoc as the project is not a Java classpath-capable package
[INFO] 
[INFO] --- maven-enforcer-plugin:1.3.1:enforce (depcheck) @ hadoop-hdfs-project ---
[INFO] 
[INFO] --- maven-checkstyle-plugin:2.15:checkstyle (default-cli) @ hadoop-hdfs-project ---
[INFO] 
[INFO] --- findbugs-maven-plugin:3.0.0:findbugs (default-cli) @ hadoop-hdfs-project ---
[INFO] ------------------------------------------------------------------------
[INFO] Reactor Summary:
[INFO] 
[INFO] Apache Hadoop HDFS Client ......................... SUCCESS [03:22 min]
[INFO] Apache Hadoop HDFS ................................ FAILURE [  02:45 h]
[INFO] Apache Hadoop HttpFS .............................. SKIPPED
[INFO] Apache Hadoop HDFS BookKeeper Journal ............. SKIPPED
[INFO] Apache Hadoop HDFS-NFS ............................ SKIPPED
[INFO] Apache Hadoop HDFS Project ........................ SUCCESS [  0.049 s]
[INFO] ------------------------------------------------------------------------
[INFO] BUILD FAILURE
[INFO] ------------------------------------------------------------------------
[INFO] Total time: 02:49 h
[INFO] Finished at: 2015-09-28T11:37:29+00:00
[INFO] Final Memory: 55M/676M
[INFO] ------------------------------------------------------------------------
[ERROR] Failed to execute goal org.apache.maven.plugins:maven-surefire-plugin:2.17:test (default-test)
on project hadoop-hdfs: There are test failures.
[ERROR] 
[ERROR] Please refer to <https://builds.apache.org/job/Hadoop-Hdfs-trunk-Java8/ws/hadoop-hdfs-project/hadoop-hdfs/target/surefire-reports>
for the individual test results.
[ERROR] -> [Help 1]
[ERROR] 
[ERROR] To see the full stack trace of the errors, re-run Maven with the -e switch.
[ERROR] Re-run Maven using the -X switch to enable full debug logging.
[ERROR] 
[ERROR] For more information about the errors and possible solutions, please read the following
articles:
[ERROR] [Help 1] http://cwiki.apache.org/confluence/display/MAVEN/MojoFailureException
[ERROR] 
[ERROR] After correcting the problems, you can resume the build with the command
[ERROR]   mvn <goals> -rf :hadoop-hdfs
Build step 'Execute shell' marked build as failure
Archiving artifacts
Sending artifact delta relative to Hadoop-Hdfs-trunk-Java8 #222
Archived 1 artifacts
Archive block size is 32768
Received 0 blocks and 5855854 bytes
Compression is 0.0%
Took 3.6 sec
Recording test results
Updating MAPREDUCE-6471

Mime
View raw message