hadoop-hdfs-dev mailing list archives

Site index · List index
Message view « Date » · « Thread »
Top « Date » · « Thread »
From Apache Jenkins Server <jenk...@builds.apache.org>
Subject Build failed in Jenkins: Hadoop-Hdfs-trunk #2368
Date Mon, 28 Sep 2015 16:50:47 GMT
See <https://builds.apache.org/job/Hadoop-Hdfs-trunk/2368/changes>

Changes:

[cmccabe] HDFS-9080. Update htrace version to 4.0.1 (cmccabe)

------------------------------------------
[...truncated 23896 lines...]
  TestPersistBlocks.testRestartWithPartialBlockHflushed:224 » NoSuchMethod org.a...
  TestPersistBlocks.TestRestartDfsWithFlush:80->testRestartDfs:104 » NoSuchMethod
  TestDFSRemove.testRemove:60 » NoSuchMethod org.apache.hadoop.util.ShutdownHook...
  TestCrcCorruption.testCorruptionDuringWrt:95 » NoSuchMethod org.apache.hadoop....
  TestCrcCorruption.testCrcCorruption:295->thistest:159 » NoSuchMethod org.apach...
  TestCrcCorruption.testEntirelyCorruptFileThreeNodes:330->doTestEntirelyCorruptFile:341
» NoSuchMethod
  TestCrcCorruption.testEntirelyCorruptFileOneNode:317->doTestEntirelyCorruptFile:341 »
NoSuchMethod
  TestDFSRename.testRename:59 » NoSuchMethod org.apache.hadoop.util.ShutdownHook...
  TestDFSRename.testRenameWithOverwrite:141 » NoSuchMethod org.apache.hadoop.uti...
  TestRollingUpgradeRollback.testRollbackCommand:97 » NoSuchMethod org.apache.ha...
  TestRollingUpgradeRollback.testRollbackWithQJM:154 » NoSuchMethod org.apache.h...
  TestRollingUpgradeRollback.testRollbackWithHAQJM:210 » NoSuchMethod org.apache...
  TestRemoteBlockReader2>TestBlockReaderBase.setup:58 » NoSuchMethod org.apache....
  TestRemoteBlockReader2>TestBlockReaderBase.shutdown:71 » NullPointer
  TestSetrepDecreasing.testSetrepDecreasing:27 » NoSuchMethod org.apache.hadoop....
  TestRead.testEOFWithBlockReaderLocal:63 » NoSuchMethod org.apache.hadoop.util....
  TestRead.testEOFWithRemoteBlockReader:78 » NoSuchMethod org.apache.hadoop.util...
  TestRead.testReadReservedPath:94 » NoSuchMethod org.apache.hadoop.util.Shutdow...
  TestWriteBlockGetsBlockLengthHint.blockLengthHintIsPropagated:52 » NoSuchMethod
  TestLocalDFS.testWorkingDirectory:72 » NoSuchMethod org.apache.hadoop.util.Shu...
  TestLocalDFS.testHomeDirectory:115 » NoSuchMethod org.apache.hadoop.util.Shutd...
  TestBlocksScheduledCounter.testBlocksScheduledCounter:54 » NoSuchMethod org.ap...
  TestSetrepIncreasing.testSetrepIncreasing:80->setrep:43 » NoSuchMethod org.apa...
  TestSetrepIncreasing.testSetrepIncreasingSimulatedStorage:84->setrep:43 » NoSuchMethod
  TestDecommission.setup:102 » NoClassDefFound org/apache/htrace/Trace
  TestDecommission.teardown:125->cleanupFile:225 NullPointer
  TestDecommission.setup:102 » NoClassDefFound org/apache/htrace/Trace
  TestDecommission.teardown:125->cleanupFile:225 NullPointer
  TestDecommission.setup:102 » NoClassDefFound org/apache/htrace/Trace
  TestDecommission.teardown:125->cleanupFile:225 NullPointer
  TestDecommission.setup:102 » NoClassDefFound org/apache/htrace/Trace
  TestDecommission.teardown:125->cleanupFile:225 NullPointer
  TestDecommission.setup:102 » NoClassDefFound org/apache/htrace/Trace
  TestDecommission.teardown:125->cleanupFile:225 NullPointer
  TestDecommission.setup:102 » NoClassDefFound org/apache/htrace/Trace
  TestDecommission.teardown:125->cleanupFile:225 NullPointer
  TestDecommission.setup:102 » NoClassDefFound org/apache/htrace/Trace
  TestDecommission.teardown:125->cleanupFile:225 NullPointer
  TestDecommission.setup:102 » NoClassDefFound org/apache/htrace/Trace
  TestDecommission.teardown:125->cleanupFile:225 NullPointer
  TestDecommission.setup:102 » NoClassDefFound org/apache/htrace/Trace
  TestDecommission.teardown:125->cleanupFile:225 NullPointer
  TestDecommission.setup:102 » NoClassDefFound org/apache/htrace/Trace
  TestDecommission.teardown:125->cleanupFile:225 NullPointer
  TestDecommission.setup:102 » NoClassDefFound org/apache/htrace/Trace
  TestDecommission.teardown:125->cleanupFile:225 NullPointer
  TestDecommission.setup:102 » NoClassDefFound org/apache/htrace/Trace
  TestDecommission.teardown:125->cleanupFile:225 NullPointer
  TestDecommission.setup:102 » NoClassDefFound org/apache/htrace/Trace
  TestDecommission.teardown:125->cleanupFile:225 NullPointer
  TestDecommission.setup:102 » NoClassDefFound org/apache/htrace/Trace
  TestDecommission.teardown:125->cleanupFile:225 NullPointer
  TestDecommission.setup:102 » NoClassDefFound org/apache/htrace/Trace
  TestDecommission.teardown:125->cleanupFile:225 NullPointer
  TestDecommission.setup:102 » NoClassDefFound org/apache/htrace/Trace
  TestDecommission.teardown:125->cleanupFile:225 NullPointer
  TestMultiThreadedHflush.testHflushWhileClosing:154 » NoSuchMethod org.apache.h...
  TestMultiThreadedHflush.testMultipleHflushersRepl1:117->doTestMultipleHflushers:127 »
NoSuchMethod
  TestMultiThreadedHflush.testMultipleHflushersRepl3:122->doTestMultipleHflushers:127 »
NoSuchMethod
  TestMissingBlocksAlert.testMissingBlocksAlert:68 » NoSuchMethod org.apache.had...
  TestDFSUpgradeFromImage.testPreserveEditLogs:640 » NoSuchMethod org.apache.had...
  TestDFSUpgradeFromImage.testUpgradeFromRel2ReservedImage:483 » NoSuchMethod or...
  TestDFSUpgradeFromImage.testUpgradeFromRel1ReservedImage:352 » NoSuchMethod or...
  TestDFSUpgradeFromImage.testUpgradeFromRel023ReservedImage:422 » NoSuchMethod ...
  TestDFSUpgradeFromImage.testUpgradeFromCorruptRel22Image:324->upgradeAndVerify:588 »
NoSuchMethod
  TestDFSUpgradeFromImage.testUpgradeFromRel1BBWImage:622->upgradeAndVerify:588 » NoSuchMethod
  TestDFSUpgradeFromImage.testFailOnPreUpgradeImage:271 » NoSuchMethod org.apach...
  TestDFSUpgradeFromImage.testUpgradeFromRel22Image:296->upgradeAndVerify:588 » NoSuchMethod
  TestFileStatus.testSetUp:69 » NoSuchMethod org.apache.hadoop.util.ShutdownHook...
  TestFileStatus.testTearDown:80 NullPointer
  TestBalancerBandwidth.testBalancerBandwidth:57 » NoSuchMethod org.apache.hadoo...
  TestSetTimes.testTimes:100 » NoSuchMethod org.apache.hadoop.util.ShutdownHookM...
  TestSetTimes.testGetBlockLocationsOnlyUsesReadLock:290 » NoSuchMethod org.apac...
  TestSetTimes.testTimesAtClose:234 » NoSuchMethod org.apache.hadoop.util.Shutdo...
  TestGenericRefresh.setUpBeforeClass:60 » NoSuchMethod org.apache.hadoop.util.S...
  TestTracing.<clinit>:59 » NoClassDefFound org/apache/htrace/SpanReceiver
  TestTracingShortCircuitLocalRead.testShortCircuitTraceHooks:67 » NoClassDefFound
  TestTraceAdmin.testCreateAndDestroySpanReceiver:64 » NoSuchMethod org.apache.h...
  TestPermission.testFilePermission:198 » NoSuchMethod org.apache.hadoop.util.Sh...
  TestPermission.testCreate:140 » NoSuchMethod org.apache.hadoop.util.ShutdownHo...
  TestPermissionSymlinks.beforeClassSetUp:78 » NoSuchMethod org.apache.hadoop.ut...
  TestRefreshUserMappings.setUp:94 » NoSuchMethod org.apache.hadoop.util.Shutdow...
  TestRefreshUserMappings.setUp:94 » NoSuchMethod org.apache.hadoop.util.Shutdow...
  TestFcHdfsSetUMask.clusterSetupAtBegining:90 » NoSuchMethod org.apache.hadoop....
  TestFcHdfsSetUMask.ClusterShutdownAtEnd:99 NullPointer
  TestSymlinkHdfsFileSystem>TestSymlinkHdfs.beforeClassSetup:92 » NoSuchMethod o...
  TestSymlinkHdfsFileSystem>TestSymlinkHdfs.afterClassTeardown:99 » NullPointer
  TestLoadGenerator.testLoadGenerator:152 » NoSuchMethod org.apache.hadoop.util....
  TestHDFSContractRename.createCluster:33 » NoSuchMethod org.apache.hadoop.util....
  TestHDFSContractDelete.createCluster:36 » NoSuchMethod org.apache.hadoop.util....
  TestHDFSContractAppend.createCluster:29 » NoSuchMethod org.apache.hadoop.util....
  TestHDFSContractOpen.createCluster:36 » NoSuchMethod org.apache.hadoop.util.Sh...
  TestHDFSContractGetFileStatus.createCluster:34 » NoSuchMethod org.apache.hadoo...
  TestHDFSContractConcat.createCluster:36 » NoSuchMethod org.apache.hadoop.util....
  TestHDFSContractMkdir.createCluster:36 » NoSuchMethod org.apache.hadoop.util.S...
  TestHDFSContractCreate.createCluster:33 » NoSuchMethod org.apache.hadoop.util....
  TestHDFSContractRootDirectory.createCluster:37 » NoSuchMethod org.apache.hadoo...
  TestHDFSContractSeek.createCluster:36 » NoSuchMethod org.apache.hadoop.util.Sh...
  TestHDFSContractSetTimes.createCluster:33 » NoSuchMethod org.apache.hadoop.uti...
  TestEnhancedByteBufferAccess.testZeroCopyReadsNoFallback:250 » NoSuchMethod or...
  TestEnhancedByteBufferAccess.testShortZeroCopyReads:194 » NoSuchMethod org.apa...
  TestEnhancedByteBufferAccess.testFallbackRead:528 » NoSuchMethod org.apache.ha...
  TestEnhancedByteBufferAccess.testZeroCopyMmapCache:341 » NoSuchMethod org.apac...
  TestEnhancedByteBufferAccess.testHdfsFallbackReads:444 » NoSuchMethod org.apac...
  TestEnhancedByteBufferAccess.testClientMmapDisable:730 » NoSuchMethod org.apac...
  TestEnhancedByteBufferAccess.testZeroCopyReads:147 » NoSuchMethod org.apache.h...
  TestEnhancedByteBufferAccess.testZeroCopyReadOfCachedData:608 » NoSuchMethod o...
  TestStickyBit.init:68->initCluster:72 » NoSuchMethod org.apache.hadoop.util.Sh...
  TestSymlinkHdfsDisable.testSymlinkHdfsDisable:41 » NoSuchMethod org.apache.had...
  TestHDFSFileContextMainOperations.clusterSetupAtBegining:59 » NoSuchMethod org...
  TestWebHdfsFileContextMainOperations.clusterSetupAtBeginning:77 » NoSuchMethod
  TestSWebHdfsFileContextMainOperations.clusterSetupAtBeginning:83 » NoSuchMethod
  TestSymlinkHdfsFileContext>TestSymlinkHdfs.beforeClassSetup:92 » NoSuchMethod ...
  TestSymlinkHdfsFileContext>TestSymlinkHdfs.afterClassTeardown:99 » NullPointer
  TestUnbuffer.testUnbufferClosesSockets:60 » NoSuchMethod org.apache.hadoop.uti...
  TestUnbuffer.testOpenManyFilesViaTcp:106 » NoSuchMethod org.apache.hadoop.util...
  TestHdfsTextCommand.setUp:54 » NoSuchMethod org.apache.hadoop.util.ShutdownHoo...
  TestResolveHdfsSymlink.setUp:61 » NoSuchMethod org.apache.hadoop.util.Shutdown...
  TestFcHdfsCreateMkdir.clusterSetupAtBegining:51 » NoSuchMethod org.apache.hado...
  TestFcHdfsCreateMkdir.ClusterShutdownAtEnd:61 NullPointer
  TestFcHdfsPermission.clusterSetupAtBegining:58 » NoSuchMethod org.apache.hadoo...
  TestFcHdfsPermission.ClusterShutdownAtEnd:68 NullPointer
  TestGlobPaths.setUp:71 » NoSuchMethod org.apache.hadoop.util.ShutdownHookManag...
  TestUrlStreamHandler.testFileUrls:125 » NoClassDefFound org/apache/htrace/Trac...
  TestUrlStreamHandler.testDfsUrls:56 » NoSuchMethod org.apache.hadoop.util.Shut...
  TestViewFileSystemAtHdfsRoot.clusterSetupAtBegining:58 » NoSuchMethod org.apac...
  TestViewFsWithAcls.clusterSetupAtBeginning:67 » NoSuchMethod org.apache.hadoop...
  TestViewFsWithAcls.ClusterShutdownAtEnd:79 NullPointer
  TestViewFsDefaultValue.clusterSetupAtBegining:82 » NoSuchMethod org.apache.had...
  TestViewFsDefaultValue.cleanup:166 NullPointer
  TestViewFileSystemWithAcls.clusterSetupAtBeginning:67 » NoSuchMethod org.apach...
  TestViewFileSystemWithAcls.ClusterShutdownAtEnd:79 NullPointer
  TestViewFileSystemHdfs.clusterSetupAtBegining:65 » NoSuchMethod org.apache.had...
  TestViewFileSystemHdfs.ClusterShutdownAtEnd:91 NullPointer
  TestViewFsAtHdfsRoot.clusterSetupAtBegining:59 » NoSuchMethod org.apache.hadoo...
  TestViewFsAtHdfsRoot.ClusterShutdownAtEnd:67 NullPointer
  TestViewFsFileStatusHdfs.clusterSetupAtBegining:65 » NoSuchMethod org.apache.h...
  TestViewFsFileStatusHdfs.cleanup:121 NullPointer
  TestViewFileSystemWithXAttrs.clusterSetupAtBeginning:62 » NoSuchMethod org.apa...
  TestViewFileSystemWithXAttrs.ClusterShutdownAtEnd:74 NullPointer
  TestViewFsWithXAttrs.clusterSetupAtBeginning:61 » NoSuchMethod org.apache.hado...
  TestViewFsWithXAttrs.ClusterShutdownAtEnd:73 NullPointer
  TestViewFsHdfs.clusterSetupAtBegining:56 » NoSuchMethod org.apache.hadoop.util...
  TestViewFsHdfs.ClusterShutdownAtEnd:67 NullPointer
  TestJMXGet.testDataNode:146 » NoSuchMethod org.apache.hadoop.util.ShutdownHook...
  TestJMXGet.tearDown:76 NullPointer
  TestJMXGet.testNameNode:93 » NoSuchMethod org.apache.hadoop.util.ShutdownHookM...
  TestJMXGet.tearDown:76 NullPointer
  TestTools.testDFSAdminInvalidUsageHelp:85 » NoClassDefFound org/apache/htrace/...
  TestRefreshCallQueue.setUp:68 » NoClassDefFound org/apache/htrace/Trace
  TestNetworkTopology.testInvalidNetworkTopologiesNotCachedInHdfs:321 » NoSuchMethod
  TestCacheAdminCLI.setUp:63 » NoSuchMethod org.apache.hadoop.util.ShutdownHookM...
  TestCryptoAdminCLI.setUp:72 » NoSuchMethod org.apache.hadoop.util.ShutdownHook...
  TestCryptoAdminCLI.tearDown:94->CLITestHelper.tearDown:125->CLITestHelper.displayResults:162->expandCommand:115
» NullPointer
  TestDeleteCLI.setUp:47 » NoSuchMethod org.apache.hadoop.util.ShutdownHookManag...
  TestDeleteCLI.tearDown:66->CLITestHelper.tearDown:125->CLITestHelper.displayResults:162->expandCommand:77
» NullPointer
  TestAclCLI.setUp:40 » NoSuchMethod org.apache.hadoop.util.ShutdownHookManager....
  TestAclCLI.tearDown:49->CLITestHelper.tearDown:125->CLITestHelper.displayResults:162->expandCommand:66
» NullPointer
  TestXAttrCLI.setUp:49 » NoSuchMethod org.apache.hadoop.util.ShutdownHookManage...
  TestXAttrCLI.tearDown:75->CLITestHelper.tearDown:125->CLITestHelper.displayResults:162->expandCommand:81
» NullPointer
  TestHDFSCLI.setUp:56 » NoSuchMethod org.apache.hadoop.util.ShutdownHookManager...
  TestHDFSCLI.tearDown:85->CLITestHelper.tearDown:125->CLITestHelper.displayResults:162->expandCommand:91
» NullPointer

Tests run: 2650, Failures: 20, Errors: 1459, Skipped: 7

[INFO]                                                                         
[INFO] ------------------------------------------------------------------------
[INFO] Skipping Apache Hadoop HttpFS
[INFO] This project has been banned from the build due to previous failures.
[INFO] ------------------------------------------------------------------------
[INFO]                                                                         
[INFO] ------------------------------------------------------------------------
[INFO] Skipping Apache Hadoop HDFS BookKeeper Journal
[INFO] This project has been banned from the build due to previous failures.
[INFO] ------------------------------------------------------------------------
[INFO]                                                                         
[INFO] ------------------------------------------------------------------------
[INFO] Skipping Apache Hadoop HDFS-NFS
[INFO] This project has been banned from the build due to previous failures.
[INFO] ------------------------------------------------------------------------
[INFO]                                                                         
[INFO] ------------------------------------------------------------------------
[INFO] Building Apache Hadoop HDFS Project 3.0.0-SNAPSHOT
[INFO] ------------------------------------------------------------------------
[INFO] 
[INFO] --- maven-clean-plugin:2.5:clean (default-clean) @ hadoop-hdfs-project ---
[INFO] Deleting <https://builds.apache.org/job/Hadoop-Hdfs-trunk/ws/hadoop-hdfs-project/target>
[INFO] 
[INFO] --- maven-antrun-plugin:1.7:run (create-testdirs) @ hadoop-hdfs-project ---
[INFO] Executing tasks

main:
    [mkdir] Created dir: <https://builds.apache.org/job/Hadoop-Hdfs-trunk/ws/hadoop-hdfs-project/target/test-dir>
[INFO] Executed tasks
[INFO] 
[INFO] --- maven-source-plugin:2.3:jar-no-fork (hadoop-java-sources) @ hadoop-hdfs-project
---
[INFO] 
[INFO] --- maven-source-plugin:2.3:test-jar-no-fork (hadoop-java-sources) @ hadoop-hdfs-project
---
[INFO] 
[INFO] --- maven-enforcer-plugin:1.3.1:enforce (dist-enforce) @ hadoop-hdfs-project ---
[INFO] 
[INFO] --- maven-site-plugin:3.4:attach-descriptor (attach-descriptor) @ hadoop-hdfs-project
---
[INFO] 
[INFO] --- maven-javadoc-plugin:2.8.1:jar (module-javadocs) @ hadoop-hdfs-project ---
[INFO] Skipping javadoc generation
[INFO] 
[INFO] --- maven-enforcer-plugin:1.3.1:enforce (depcheck) @ hadoop-hdfs-project ---
[INFO] 
[INFO] --- maven-checkstyle-plugin:2.15:checkstyle (default-cli) @ hadoop-hdfs-project ---
[INFO] 
[INFO] --- findbugs-maven-plugin:3.0.0:findbugs (default-cli) @ hadoop-hdfs-project ---
[INFO] ------------------------------------------------------------------------
[INFO] Reactor Summary:
[INFO] 
[INFO] Apache Hadoop HDFS Client ......................... SUCCESS [03:13 min]
[INFO] Apache Hadoop HDFS ................................ FAILURE [58:48 min]
[INFO] Apache Hadoop HttpFS .............................. SKIPPED
[INFO] Apache Hadoop HDFS BookKeeper Journal ............. SKIPPED
[INFO] Apache Hadoop HDFS-NFS ............................ SKIPPED
[INFO] Apache Hadoop HDFS Project ........................ SUCCESS [  0.061 s]
[INFO] ------------------------------------------------------------------------
[INFO] BUILD FAILURE
[INFO] ------------------------------------------------------------------------
[INFO] Total time: 01:02 h
[INFO] Finished at: 2015-09-28T16:50:51+00:00
[INFO] Final Memory: 55M/787M
[INFO] ------------------------------------------------------------------------
[ERROR] Failed to execute goal org.apache.maven.plugins:maven-surefire-plugin:2.17:test (default-test)
on project hadoop-hdfs: ExecutionException: java.lang.RuntimeException: The forked VM terminated
without properly saying goodbye. VM crash or System.exit called?
[ERROR] Command was /bin/sh -c cd <https://builds.apache.org/job/Hadoop-Hdfs-trunk/ws/hadoop-hdfs-project/hadoop-hdfs>
&& /home/jenkins/tools/java/jdk1.7.0_55/jre/bin/java -Xmx2048m -XX:MaxPermSize=768m
-XX:+HeapDumpOnOutOfMemoryError -jar <https://builds.apache.org/job/Hadoop-Hdfs-trunk/ws/hadoop-hdfs-project/hadoop-hdfs/target/surefire/surefirebooter2335650954956909318.jar>
<https://builds.apache.org/job/Hadoop-Hdfs-trunk/ws/hadoop-hdfs-project/hadoop-hdfs/target/surefire/surefire5494700441677902215tmp>
<https://builds.apache.org/job/Hadoop-Hdfs-trunk/ws/hadoop-hdfs-project/hadoop-hdfs/target/surefire/surefire_1147405281654341074256tmp>
[ERROR] -> [Help 1]
[ERROR] 
[ERROR] To see the full stack trace of the errors, re-run Maven with the -e switch.
[ERROR] Re-run Maven using the -X switch to enable full debug logging.
[ERROR] 
[ERROR] For more information about the errors and possible solutions, please read the following
articles:
[ERROR] [Help 1] http://cwiki.apache.org/confluence/display/MAVEN/MojoFailureException
[ERROR] 
[ERROR] After correcting the problems, you can resume the build with the command
[ERROR]   mvn <goals> -rf :hadoop-hdfs
Build step 'Execute shell' marked build as failure
Archiving artifacts
Sending artifact delta relative to Hadoop-Hdfs-trunk #2342
Archived 1 artifacts
Archive block size is 32768
Received 0 blocks and 4797218 bytes
Compression is 0.0%
Took 2.4 sec
Recording test results
Updating HDFS-9080

Mime
View raw message