hadoop-hdfs-dev mailing list archives

Site index · List index
Message view « Date » · « Thread »
Top « Date » · « Thread »
From Apache Jenkins Server <jenk...@builds.apache.org>
Subject Hadoop-Hdfs-trunk - Build # 2341 - Still Failing
Date Tue, 22 Sep 2015 11:07:19 GMT
See https://builds.apache.org/job/Hadoop-Hdfs-trunk/2341/

###################################################################################
########################## LAST 60 LINES OF THE CONSOLE ###########################
[...truncated 7619 lines...]
[INFO] 
[INFO] --- maven-source-plugin:2.3:jar-no-fork (hadoop-java-sources) @ hadoop-hdfs-project
---
[INFO] 
[INFO] --- maven-source-plugin:2.3:test-jar-no-fork (hadoop-java-sources) @ hadoop-hdfs-project
---
[INFO] 
[INFO] --- maven-enforcer-plugin:1.3.1:enforce (dist-enforce) @ hadoop-hdfs-project ---
[INFO] 
[INFO] --- maven-site-plugin:3.4:attach-descriptor (attach-descriptor) @ hadoop-hdfs-project
---
[INFO] 
[INFO] --- maven-javadoc-plugin:2.8.1:jar (module-javadocs) @ hadoop-hdfs-project ---
[INFO] Skipping javadoc generation
[INFO] 
[INFO] --- maven-enforcer-plugin:1.3.1:enforce (depcheck) @ hadoop-hdfs-project ---
[INFO] 
[INFO] --- maven-checkstyle-plugin:2.15:checkstyle (default-cli) @ hadoop-hdfs-project ---
[INFO] 
[INFO] --- findbugs-maven-plugin:3.0.0:findbugs (default-cli) @ hadoop-hdfs-project ---
[INFO] ------------------------------------------------------------------------
[INFO] Reactor Summary:
[INFO] 
[INFO] Apache Hadoop HDFS Client ......................... SUCCESS [03:22 min]
[INFO] Apache Hadoop HDFS ................................ FAILURE [  02:42 h]
[INFO] Apache Hadoop HttpFS .............................. SKIPPED
[INFO] Apache Hadoop HDFS BookKeeper Journal ............. SKIPPED
[INFO] Apache Hadoop HDFS-NFS ............................ SKIPPED
[INFO] Apache Hadoop HDFS Project ........................ SUCCESS [  0.065 s]
[INFO] ------------------------------------------------------------------------
[INFO] BUILD FAILURE
[INFO] ------------------------------------------------------------------------
[INFO] Total time: 02:45 h
[INFO] Finished at: 2015-09-22T11:07:20+00:00
[INFO] Final Memory: 58M/775M
[INFO] ------------------------------------------------------------------------
[ERROR] Failed to execute goal org.apache.maven.plugins:maven-surefire-plugin:2.17:test (default-test)
on project hadoop-hdfs: There are test failures.
[ERROR] 
[ERROR] Please refer to /home/jenkins/jenkins-slave/workspace/Hadoop-Hdfs-trunk/hadoop-hdfs-project/hadoop-hdfs/target/surefire-reports
for the individual test results.
[ERROR] -> [Help 1]
[ERROR] 
[ERROR] To see the full stack trace of the errors, re-run Maven with the -e switch.
[ERROR] Re-run Maven using the -X switch to enable full debug logging.
[ERROR] 
[ERROR] For more information about the errors and possible solutions, please read the following
articles:
[ERROR] [Help 1] http://cwiki.apache.org/confluence/display/MAVEN/MojoFailureException
[ERROR] 
[ERROR] After correcting the problems, you can resume the build with the command
[ERROR]   mvn <goals> -rf :hadoop-hdfs
Build step 'Execute shell' marked build as failure
Archiving artifacts
Sending artifact delta relative to Hadoop-Hdfs-trunk #2322
Archived 1 artifacts
Archive block size is 32768
Received 0 blocks and 4625356 bytes
Compression is 0.0%
Took 2.2 sec
Recording test results
Updating HDFS-8780
Sending e-mails to: hdfs-dev@hadoop.apache.org
Email was triggered for: Failure
Sending email for trigger: Failure



###################################################################################
############################## FAILED TESTS (if any) ##############################
13 tests failed.
REGRESSION:  org.apache.hadoop.cli.TestAclCLI.testAll

Error Message:
org.apache.hadoop.cli.util.CLICommand.getExecutor(Ljava/lang/String;Lorg/apache/hadoop/conf/Configuration;)Lorg/apache/hadoop/cli/util/CommandExecutor;

Stack Trace:
java.lang.NoSuchMethodError: org.apache.hadoop.cli.util.CLICommand.getExecutor(Ljava/lang/String;Lorg/apache/hadoop/conf/Configuration;)Lorg/apache/hadoop/cli/util/CommandExecutor;
	at org.apache.hadoop.cli.TestAclCLI.execute(TestAclCLI.java:76)


REGRESSION:  org.apache.hadoop.cli.TestAclCLI.testAll

Error Message:
One of the tests failed. See the Detailed results to identify the command that failed

Stack Trace:
java.lang.AssertionError: One of the tests failed. See the Detailed results to identify the
command that failed
	at org.junit.Assert.fail(Assert.java:88)
	at org.junit.Assert.assertTrue(Assert.java:41)
	at org.apache.hadoop.cli.CLITestHelper.displayResults(CLITestHelper.java:263)
	at org.apache.hadoop.cli.CLITestHelper.tearDown(CLITestHelper.java:125)
	at org.apache.hadoop.cli.TestAclCLI.tearDown(TestAclCLI.java:49)


REGRESSION:  org.apache.hadoop.cli.TestCacheAdminCLI.testAll

Error Message:
org.apache.hadoop.cli.util.CLICommand.getExecutor(Ljava/lang/String;Lorg/apache/hadoop/conf/Configuration;)Lorg/apache/hadoop/cli/util/CommandExecutor;

Stack Trace:
java.lang.NoSuchMethodError: org.apache.hadoop.cli.util.CLICommand.getExecutor(Ljava/lang/String;Lorg/apache/hadoop/conf/Configuration;)Lorg/apache/hadoop/cli/util/CommandExecutor;
	at org.apache.hadoop.cli.TestCacheAdminCLI.execute(TestCacheAdminCLI.java:134)


REGRESSION:  org.apache.hadoop.cli.TestCacheAdminCLI.testAll

Error Message:
One of the tests failed. See the Detailed results to identify the command that failed

Stack Trace:
java.lang.AssertionError: One of the tests failed. See the Detailed results to identify the
command that failed
	at org.junit.Assert.fail(Assert.java:88)
	at org.junit.Assert.assertTrue(Assert.java:41)
	at org.apache.hadoop.cli.CLITestHelper.displayResults(CLITestHelper.java:263)
	at org.apache.hadoop.cli.CLITestHelper.tearDown(CLITestHelper.java:125)
	at org.apache.hadoop.cli.TestCacheAdminCLI.tearDown(TestCacheAdminCLI.java:84)


REGRESSION:  org.apache.hadoop.cli.TestCryptoAdminCLI.testAll

Error Message:
org.apache.hadoop.cli.util.CLICommand.getExecutor(Ljava/lang/String;Lorg/apache/hadoop/conf/Configuration;)Lorg/apache/hadoop/cli/util/CommandExecutor;

Stack Trace:
java.lang.NoSuchMethodError: org.apache.hadoop.cli.util.CLICommand.getExecutor(Ljava/lang/String;Lorg/apache/hadoop/conf/Configuration;)Lorg/apache/hadoop/cli/util/CommandExecutor;
	at org.apache.hadoop.cli.TestCryptoAdminCLI.execute(TestCryptoAdminCLI.java:163)


REGRESSION:  org.apache.hadoop.cli.TestCryptoAdminCLI.testAll

Error Message:
One of the tests failed. See the Detailed results to identify the command that failed

Stack Trace:
java.lang.AssertionError: One of the tests failed. See the Detailed results to identify the
command that failed
	at org.junit.Assert.fail(Assert.java:88)
	at org.junit.Assert.assertTrue(Assert.java:41)
	at org.apache.hadoop.cli.CLITestHelper.displayResults(CLITestHelper.java:263)
	at org.apache.hadoop.cli.CLITestHelper.tearDown(CLITestHelper.java:125)
	at org.apache.hadoop.cli.TestCryptoAdminCLI.tearDown(TestCryptoAdminCLI.java:94)


REGRESSION:  org.apache.hadoop.cli.TestDeleteCLI.testAll

Error Message:
org.apache.hadoop.cli.util.CLICommand.getExecutor(Ljava/lang/String;Lorg/apache/hadoop/conf/Configuration;)Lorg/apache/hadoop/cli/util/CommandExecutor;

Stack Trace:
java.lang.NoSuchMethodError: org.apache.hadoop.cli.util.CLICommand.getExecutor(Ljava/lang/String;Lorg/apache/hadoop/conf/Configuration;)Lorg/apache/hadoop/cli/util/CommandExecutor;
	at org.apache.hadoop.cli.TestDeleteCLI.execute(TestDeleteCLI.java:84)


REGRESSION:  org.apache.hadoop.cli.TestDeleteCLI.testAll

Error Message:
One of the tests failed. See the Detailed results to identify the command that failed

Stack Trace:
java.lang.AssertionError: One of the tests failed. See the Detailed results to identify the
command that failed
	at org.junit.Assert.fail(Assert.java:88)
	at org.junit.Assert.assertTrue(Assert.java:41)
	at org.apache.hadoop.cli.CLITestHelper.displayResults(CLITestHelper.java:263)
	at org.apache.hadoop.cli.CLITestHelper.tearDown(CLITestHelper.java:125)
	at org.apache.hadoop.cli.TestDeleteCLI.tearDown(TestDeleteCLI.java:66)


REGRESSION:  org.apache.hadoop.cli.TestHDFSCLI.testAll

Error Message:
org.apache.hadoop.cli.util.CLICommand.getExecutor(Ljava/lang/String;Lorg/apache/hadoop/conf/Configuration;)Lorg/apache/hadoop/cli/util/CommandExecutor;

Stack Trace:
java.lang.NoSuchMethodError: org.apache.hadoop.cli.util.CLICommand.getExecutor(Ljava/lang/String;Lorg/apache/hadoop/conf/Configuration;)Lorg/apache/hadoop/cli/util/CommandExecutor;
	at org.apache.hadoop.cli.TestHDFSCLI.execute(TestHDFSCLI.java:98)


REGRESSION:  org.apache.hadoop.cli.TestHDFSCLI.testAll

Error Message:
One of the tests failed. See the Detailed results to identify the command that failed

Stack Trace:
java.lang.AssertionError: One of the tests failed. See the Detailed results to identify the
command that failed
	at org.junit.Assert.fail(Assert.java:88)
	at org.junit.Assert.assertTrue(Assert.java:41)
	at org.apache.hadoop.cli.CLITestHelper.displayResults(CLITestHelper.java:263)
	at org.apache.hadoop.cli.CLITestHelper.tearDown(CLITestHelper.java:125)
	at org.apache.hadoop.cli.TestHDFSCLI.tearDown(TestHDFSCLI.java:85)


REGRESSION:  org.apache.hadoop.cli.TestXAttrCLI.testAll

Error Message:
org.apache.hadoop.cli.util.CLICommand.getExecutor(Ljava/lang/String;Lorg/apache/hadoop/conf/Configuration;)Lorg/apache/hadoop/cli/util/CommandExecutor;

Stack Trace:
java.lang.NoSuchMethodError: org.apache.hadoop.cli.util.CLICommand.getExecutor(Ljava/lang/String;Lorg/apache/hadoop/conf/Configuration;)Lorg/apache/hadoop/cli/util/CommandExecutor;
	at org.apache.hadoop.cli.TestXAttrCLI.execute(TestXAttrCLI.java:90)


REGRESSION:  org.apache.hadoop.cli.TestXAttrCLI.testAll

Error Message:
One of the tests failed. See the Detailed results to identify the command that failed

Stack Trace:
java.lang.AssertionError: One of the tests failed. See the Detailed results to identify the
command that failed
	at org.junit.Assert.fail(Assert.java:88)
	at org.junit.Assert.assertTrue(Assert.java:41)
	at org.apache.hadoop.cli.CLITestHelper.displayResults(CLITestHelper.java:263)
	at org.apache.hadoop.cli.CLITestHelper.tearDown(CLITestHelper.java:125)
	at org.apache.hadoop.cli.TestXAttrCLI.tearDown(TestXAttrCLI.java:75)


REGRESSION:  org.apache.hadoop.hdfs.qjournal.client.TestQJMWithFaults.testRandomized

Error Message:
Expected to find 'Injected' but got unexpected exception:org.apache.hadoop.hdfs.qjournal.client.QuorumException:
Got too many exceptions to achieve quorum size 2/3. 1 successful responses:
127.0.0.1:42043: null [success]
2 exceptions thrown:
127.0.0.1:52970: org/apache/hadoop/metrics2/util/SampleQuantiles$SampleItem
 at org.apache.hadoop.metrics2.util.SampleQuantiles.insertBatch(SampleQuantiles.java:139)
 at org.apache.hadoop.metrics2.util.SampleQuantiles.insert(SampleQuantiles.java:120)
 at org.apache.hadoop.metrics2.lib.MutableQuantiles.add(MutableQuantiles.java:130)
 at org.apache.hadoop.hdfs.qjournal.server.JournalMetrics.addSync(JournalMetrics.java:120)
 at org.apache.hadoop.hdfs.qjournal.server.Journal.journal(Journal.java:399)
 at org.apache.hadoop.hdfs.qjournal.server.JournalNodeRpcServer.journal(JournalNodeRpcServer.java:148)
 at org.apache.hadoop.hdfs.qjournal.protocolPB.QJournalProtocolServerSideTranslatorPB.journal(QJournalProtocolServerSideTranslatorPB.java:158)
 at org.apache.hadoop.hdfs.qjournal.protocol.QJournalProtocolProtos$QJournalProtocolService$2.callBlockingMethod(QJournalProtocolProtos.java:25421)
 at org.apache.hadoop.ipc.ProtobufRpcEngine$Server$ProtoBufRpcInvoker.call(ProtobufRpcEngine.java:636)
 at org.apache.hadoop.ipc.RPC$Server.call(RPC.java:976)
 at org.apache.hadoop.ipc.Server$Handler$1.run(Server.java:2230)
 at org.apache.hadoop.ipc.Server$Handler$1.run(Server.java:2226)
 at java.security.AccessController.doPrivileged(Native Method)
 at javax.security.auth.Subject.doAs(Subject.java:415)
 at org.apache.hadoop.security.UserGroupInformation.doAs(UserGroupInformation.java:1667)
 at org.apache.hadoop.ipc.Server$Handler.run(Server.java:2224)

127.0.0.1:57787: Journal disabled until next roll
 at org.apache.hadoop.hdfs.qjournal.client.QuorumException.create(QuorumException.java:81)
 at org.apache.hadoop.hdfs.qjournal.client.QuorumCall.rethrowException(QuorumCall.java:223)
 at org.apache.hadoop.hdfs.qjournal.client.AsyncLoggerSet.waitForWriteQuorum(AsyncLoggerSet.java:142)
 at org.apache.hadoop.hdfs.qjournal.client.QuorumOutputStream.flushAndSync(QuorumOutputStream.java:107)
 at org.apache.hadoop.hdfs.server.namenode.EditLogOutputStream.flush(EditLogOutputStream.java:113)
 at org.apache.hadoop.hdfs.server.namenode.EditLogOutputStream.flush(EditLogOutputStream.java:107)
 at org.apache.hadoop.hdfs.qjournal.QJMTestUtil.writeTxns(QJMTestUtil.java:112)
 at org.apache.hadoop.hdfs.qjournal.client.TestQJMWithFaults.writeSegmentUntilCrash(TestQJMWithFaults.java:295)
 at org.apache.hadoop.hdfs.qjournal.client.TestQJMWithFaults.testRandomized(TestQJMWithFaults.java:260)
 at sun.reflect.NativeMethodAccessorImpl.invoke0(Native Method)
 at sun.reflect.NativeMethodAccessorImpl.invoke(NativeMethodAccessorImpl.java:57)
 at sun.reflect.DelegatingMethodAccessorImpl.invoke(DelegatingMethodAccessorImpl.java:43)
 at java.lang.reflect.Method.invoke(Method.java:606)
 at org.junit.runners.model.FrameworkMethod$1.runReflectiveCall(FrameworkMethod.java:47)
 at org.junit.internal.runners.model.ReflectiveCallable.run(ReflectiveCallable.java:12)
 at org.junit.runners.model.FrameworkMethod.invokeExplosively(FrameworkMethod.java:44)
 at org.junit.internal.runners.statements.InvokeMethod.evaluate(InvokeMethod.java:17)
 at org.junit.runners.ParentRunner.runLeaf(ParentRunner.java:271)
 at org.junit.runners.BlockJUnit4ClassRunner.runChild(BlockJUnit4ClassRunner.java:70)
 at org.junit.runners.BlockJUnit4ClassRunner.runChild(BlockJUnit4ClassRunner.java:50)
 at org.junit.runners.ParentRunner$3.run(ParentRunner.java:238)
 at org.junit.runners.ParentRunner$1.schedule(ParentRunner.java:63)
 at org.junit.runners.ParentRunner.runChildren(ParentRunner.java:236)
 at org.junit.runners.ParentRunner.access$000(ParentRunner.java:53)
 at org.junit.runners.ParentRunner$2.evaluate(ParentRunner.java:229)
 at org.junit.runners.ParentRunner.run(ParentRunner.java:309)
 at org.apache.maven.surefire.junit4.JUnit4Provider.execute(JUnit4Provider.java:264)
 at org.apache.maven.surefire.junit4.JUnit4Provider.executeTestSet(JUnit4Provider.java:153)
 at org.apache.maven.surefire.junit4.JUnit4Provider.invoke(JUnit4Provider.java:124)
 at org.apache.maven.surefire.booter.ForkedBooter.invokeProviderInSameClassLoader(ForkedBooter.java:200)
 at org.apache.maven.surefire.booter.ForkedBooter.runSuitesInProcess(ForkedBooter.java:153)
 at org.apache.maven.surefire.booter.ForkedBooter.main(ForkedBooter.java:103)


Stack Trace:
java.lang.AssertionError: Expected to find 'Injected' but got unexpected exception:org.apache.hadoop.hdfs.qjournal.client.QuorumException:
Got too many exceptions to achieve quorum size 2/3. 1 successful responses:
127.0.0.1:42043: null [success]
2 exceptions thrown:
127.0.0.1:52970: org/apache/hadoop/metrics2/util/SampleQuantiles$SampleItem
	at org.apache.hadoop.metrics2.util.SampleQuantiles.insertBatch(SampleQuantiles.java:139)
	at org.apache.hadoop.metrics2.util.SampleQuantiles.insert(SampleQuantiles.java:120)
	at org.apache.hadoop.metrics2.lib.MutableQuantiles.add(MutableQuantiles.java:130)
	at org.apache.hadoop.hdfs.qjournal.server.JournalMetrics.addSync(JournalMetrics.java:120)
	at org.apache.hadoop.hdfs.qjournal.server.Journal.journal(Journal.java:399)
	at org.apache.hadoop.hdfs.qjournal.server.JournalNodeRpcServer.journal(JournalNodeRpcServer.java:148)
	at org.apache.hadoop.hdfs.qjournal.protocolPB.QJournalProtocolServerSideTranslatorPB.journal(QJournalProtocolServerSideTranslatorPB.java:158)
	at org.apache.hadoop.hdfs.qjournal.protocol.QJournalProtocolProtos$QJournalProtocolService$2.callBlockingMethod(QJournalProtocolProtos.java:25421)
	at org.apache.hadoop.ipc.ProtobufRpcEngine$Server$ProtoBufRpcInvoker.call(ProtobufRpcEngine.java:636)
	at org.apache.hadoop.ipc.RPC$Server.call(RPC.java:976)
	at org.apache.hadoop.ipc.Server$Handler$1.run(Server.java:2230)
	at org.apache.hadoop.ipc.Server$Handler$1.run(Server.java:2226)
	at java.security.AccessController.doPrivileged(Native Method)
	at javax.security.auth.Subject.doAs(Subject.java:415)
	at org.apache.hadoop.security.UserGroupInformation.doAs(UserGroupInformation.java:1667)
	at org.apache.hadoop.ipc.Server$Handler.run(Server.java:2224)

127.0.0.1:57787: Journal disabled until next roll
	at org.apache.hadoop.hdfs.qjournal.client.QuorumException.create(QuorumException.java:81)
	at org.apache.hadoop.hdfs.qjournal.client.QuorumCall.rethrowException(QuorumCall.java:223)
	at org.apache.hadoop.hdfs.qjournal.client.AsyncLoggerSet.waitForWriteQuorum(AsyncLoggerSet.java:142)
	at org.apache.hadoop.hdfs.qjournal.client.QuorumOutputStream.flushAndSync(QuorumOutputStream.java:107)
	at org.apache.hadoop.hdfs.server.namenode.EditLogOutputStream.flush(EditLogOutputStream.java:113)
	at org.apache.hadoop.hdfs.server.namenode.EditLogOutputStream.flush(EditLogOutputStream.java:107)
	at org.apache.hadoop.hdfs.qjournal.QJMTestUtil.writeTxns(QJMTestUtil.java:112)
	at org.apache.hadoop.hdfs.qjournal.client.TestQJMWithFaults.writeSegmentUntilCrash(TestQJMWithFaults.java:295)
	at org.apache.hadoop.hdfs.qjournal.client.TestQJMWithFaults.testRandomized(TestQJMWithFaults.java:260)
	at sun.reflect.NativeMethodAccessorImpl.invoke0(Native Method)
	at sun.reflect.NativeMethodAccessorImpl.invoke(NativeMethodAccessorImpl.java:57)
	at sun.reflect.DelegatingMethodAccessorImpl.invoke(DelegatingMethodAccessorImpl.java:43)
	at java.lang.reflect.Method.invoke(Method.java:606)
	at org.junit.runners.model.FrameworkMethod$1.runReflectiveCall(FrameworkMethod.java:47)
	at org.junit.internal.runners.model.ReflectiveCallable.run(ReflectiveCallable.java:12)
	at org.junit.runners.model.FrameworkMethod.invokeExplosively(FrameworkMethod.java:44)
	at org.junit.internal.runners.statements.InvokeMethod.evaluate(InvokeMethod.java:17)
	at org.junit.runners.ParentRunner.runLeaf(ParentRunner.java:271)
	at org.junit.runners.BlockJUnit4ClassRunner.runChild(BlockJUnit4ClassRunner.java:70)
	at org.junit.runners.BlockJUnit4ClassRunner.runChild(BlockJUnit4ClassRunner.java:50)
	at org.junit.runners.ParentRunner$3.run(ParentRunner.java:238)
	at org.junit.runners.ParentRunner$1.schedule(ParentRunner.java:63)
	at org.junit.runners.ParentRunner.runChildren(ParentRunner.java:236)
	at org.junit.runners.ParentRunner.access$000(ParentRunner.java:53)
	at org.junit.runners.ParentRunner$2.evaluate(ParentRunner.java:229)
	at org.junit.runners.ParentRunner.run(ParentRunner.java:309)
	at org.apache.maven.surefire.junit4.JUnit4Provider.execute(JUnit4Provider.java:264)
	at org.apache.maven.surefire.junit4.JUnit4Provider.executeTestSet(JUnit4Provider.java:153)
	at org.apache.maven.surefire.junit4.JUnit4Provider.invoke(JUnit4Provider.java:124)
	at org.apache.maven.surefire.booter.ForkedBooter.invokeProviderInSameClassLoader(ForkedBooter.java:200)
	at org.apache.maven.surefire.booter.ForkedBooter.runSuitesInProcess(ForkedBooter.java:153)
	at org.apache.maven.surefire.booter.ForkedBooter.main(ForkedBooter.java:103)

	at org.junit.Assert.fail(Assert.java:88)
	at org.junit.Assert.assertTrue(Assert.java:41)
	at org.apache.hadoop.test.GenericTestUtils.assertExceptionContains(GenericTestUtils.java:148)
	at org.apache.hadoop.hdfs.qjournal.client.TestQJMWithFaults.checkException(TestQJMWithFaults.java:278)
	at org.apache.hadoop.hdfs.qjournal.client.TestQJMWithFaults.testRandomized(TestQJMWithFaults.java:263)



Mime
  • Unnamed multipart/mixed (inline, None, 0 bytes)
View raw message