hadoop-hdfs-dev mailing list archives

Site index · List index
Message view « Date » · « Thread »
Top « Date » · « Thread »
From Apache Jenkins Server <jenk...@builds.apache.org>
Subject Hadoop-Hdfs-trunk-Java8 - Build # 403 - Still Failing
Date Tue, 22 Sep 2015 10:52:19 GMT
See https://builds.apache.org/job/Hadoop-Hdfs-trunk-Java8/403/

###################################################################################
########################## LAST 60 LINES OF THE CONSOLE ###########################
[...truncated 7349 lines...]
[INFO] Executed tasks
[INFO] 
[INFO] --- maven-source-plugin:2.3:jar-no-fork (hadoop-java-sources) @ hadoop-hdfs-project
---
[INFO] 
[INFO] --- maven-source-plugin:2.3:test-jar-no-fork (hadoop-java-sources) @ hadoop-hdfs-project
---
[INFO] 
[INFO] --- maven-enforcer-plugin:1.3.1:enforce (dist-enforce) @ hadoop-hdfs-project ---
[INFO] 
[INFO] --- maven-site-plugin:3.4:attach-descriptor (attach-descriptor) @ hadoop-hdfs-project
---
[INFO] 
[INFO] --- maven-javadoc-plugin:2.8.1:jar (module-javadocs) @ hadoop-hdfs-project ---
[INFO] Not executing Javadoc as the project is not a Java classpath-capable package
[INFO] 
[INFO] --- maven-enforcer-plugin:1.3.1:enforce (depcheck) @ hadoop-hdfs-project ---
[INFO] 
[INFO] --- maven-checkstyle-plugin:2.15:checkstyle (default-cli) @ hadoop-hdfs-project ---
[INFO] 
[INFO] --- findbugs-maven-plugin:3.0.0:findbugs (default-cli) @ hadoop-hdfs-project ---
[INFO] ------------------------------------------------------------------------
[INFO] Reactor Summary:
[INFO] 
[INFO] Apache Hadoop HDFS Client ......................... SUCCESS [04:11 min]
[INFO] Apache Hadoop HDFS ................................ FAILURE [  01:49 h]
[INFO] Apache Hadoop HttpFS .............................. SKIPPED
[INFO] Apache Hadoop HDFS BookKeeper Journal ............. SKIPPED
[INFO] Apache Hadoop HDFS-NFS ............................ SKIPPED
[INFO] Apache Hadoop HDFS Project ........................ SUCCESS [  0.076 s]
[INFO] ------------------------------------------------------------------------
[INFO] BUILD FAILURE
[INFO] ------------------------------------------------------------------------
[INFO] Total time: 01:53 h
[INFO] Finished at: 2015-09-22T10:52:23+00:00
[INFO] Final Memory: 73M/975M
[INFO] ------------------------------------------------------------------------
[ERROR] Failed to execute goal org.apache.maven.plugins:maven-surefire-plugin:2.17:test (default-test)
on project hadoop-hdfs: ExecutionException: java.lang.RuntimeException: The forked VM terminated
without properly saying goodbye. VM crash or System.exit called?
[ERROR] Command was /bin/sh -c cd /home/jenkins/jenkins-slave/workspace/Hadoop-Hdfs-trunk-Java8/hadoop-hdfs-project/hadoop-hdfs
&& /home/jenkins/tools/java/jdk1.8.0/jre/bin/java -Xmx4096m -XX:MaxPermSize=768m -XX:+HeapDumpOnOutOfMemoryError
-jar /home/jenkins/jenkins-slave/workspace/Hadoop-Hdfs-trunk-Java8/hadoop-hdfs-project/hadoop-hdfs/target/surefire/surefirebooter959991315025394813.jar
/home/jenkins/jenkins-slave/workspace/Hadoop-Hdfs-trunk-Java8/hadoop-hdfs-project/hadoop-hdfs/target/surefire/surefire5219968617241491106tmp
/home/jenkins/jenkins-slave/workspace/Hadoop-Hdfs-trunk-Java8/hadoop-hdfs-project/hadoop-hdfs/target/surefire/surefire_1414235572271638200755tmp
[ERROR] -> [Help 1]
[ERROR] 
[ERROR] To see the full stack trace of the errors, re-run Maven with the -e switch.
[ERROR] Re-run Maven using the -X switch to enable full debug logging.
[ERROR] 
[ERROR] For more information about the errors and possible solutions, please read the following
articles:
[ERROR] [Help 1] http://cwiki.apache.org/confluence/display/MAVEN/MojoFailureException
[ERROR] 
[ERROR] After correcting the problems, you can resume the build with the command
[ERROR]   mvn <goals> -rf :hadoop-hdfs
Build step 'Execute shell' marked build as failure
Archiving artifacts
Sending artifact delta relative to Hadoop-Hdfs-trunk-Java8 #222
Archived 1 artifacts
Archive block size is 32768
Received 0 blocks and 5480257 bytes
Compression is 0.0%
Took 5.7 sec
Recording test results
Updating HDFS-8780
Sending e-mails to: hdfs-dev@hadoop.apache.org
Email was triggered for: Failure
Sending email for trigger: Failure



###################################################################################
############################## FAILED TESTS (if any) ##############################
7 tests failed.
REGRESSION:  org.apache.hadoop.hdfs.TestDFSUpgradeFromImage.testUpgradeFromRel1BBWImage

Error Message:
Cannot obtain block length for LocatedBlock{BP-952345559-67.195.81.151-1442913117259:blk_7162739548153522810_1020;
getBlockSize()=1024; corrupt=false; offset=0; locs=[DatanodeInfoWithStorage[127.0.0.1:49468,DS-ee6a2acc-65b4-45fe-af30-780255ba0ebd,DISK]]}

Stack Trace:
java.io.IOException: Cannot obtain block length for LocatedBlock{BP-952345559-67.195.81.151-1442913117259:blk_7162739548153522810_1020;
getBlockSize()=1024; corrupt=false; offset=0; locs=[DatanodeInfoWithStorage[127.0.0.1:49468,DS-ee6a2acc-65b4-45fe-af30-780255ba0ebd,DISK]]}
	at org.apache.hadoop.hdfs.DFSInputStream.readBlockLength(DFSInputStream.java:404)
	at org.apache.hadoop.hdfs.DFSInputStream.fetchLocatedBlocksAndGetLastBlockLength(DFSInputStream.java:346)
	at org.apache.hadoop.hdfs.DFSInputStream.openInfo(DFSInputStream.java:277)
	at org.apache.hadoop.hdfs.DFSInputStream.<init>(DFSInputStream.java:265)
	at org.apache.hadoop.hdfs.DFSClient.open(DFSClient.java:1057)
	at org.apache.hadoop.hdfs.DFSClient.open(DFSClient.java:1041)
	at org.apache.hadoop.hdfs.DFSClient.open(DFSClient.java:1027)
	at org.apache.hadoop.hdfs.TestDFSUpgradeFromImage.dfsOpenFileWithRetries(TestDFSUpgradeFromImage.java:177)
	at org.apache.hadoop.hdfs.TestDFSUpgradeFromImage.verifyDir(TestDFSUpgradeFromImage.java:213)
	at org.apache.hadoop.hdfs.TestDFSUpgradeFromImage.verifyFileSystem(TestDFSUpgradeFromImage.java:228)
	at org.apache.hadoop.hdfs.TestDFSUpgradeFromImage.upgradeAndVerify(TestDFSUpgradeFromImage.java:600)
	at org.apache.hadoop.hdfs.TestDFSUpgradeFromImage.testUpgradeFromRel1BBWImage(TestDFSUpgradeFromImage.java:622)


REGRESSION:  org.apache.hadoop.hdfs.TestLeaseRecovery2.testHardLeaseRecoveryWithRenameAfterNameNodeRestart

Error Message:
org.apache.hadoop.util.ExitUtil$ExitException: Could not sync enough journals to persistent
storage due to No journals available to flush. Unsynced transactions: 1
 at org.apache.hadoop.util.ExitUtil.terminate(ExitUtil.java:126)
 at org.apache.hadoop.hdfs.server.namenode.FSEditLog.logSync(FSEditLog.java:637)
 at org.apache.hadoop.hdfs.server.namenode.FSEditLog.endCurrentLogSegment(FSEditLog.java:1316)
 at org.apache.hadoop.hdfs.server.namenode.FSEditLog.close(FSEditLog.java:362)
 at org.apache.hadoop.hdfs.server.namenode.FSNamesystem.stopActiveServices(FSNamesystem.java:1201)
 at org.apache.hadoop.hdfs.server.namenode.NameNode$NameNodeHAContext.stopActiveServices(NameNode.java:1735)
 at org.apache.hadoop.hdfs.server.namenode.ha.ActiveState.exitState(ActiveState.java:70)
 at org.apache.hadoop.hdfs.server.namenode.NameNode.stop(NameNode.java:880)
 at org.apache.hadoop.hdfs.MiniDFSCluster.shutdownNameNode(MiniDFSCluster.java:1912)
 at org.apache.hadoop.hdfs.MiniDFSCluster.restartNameNode(MiniDFSCluster.java:1963)
 at org.apache.hadoop.hdfs.MiniDFSCluster.restartNameNode(MiniDFSCluster.java:1944)
 at org.apache.hadoop.hdfs.TestLeaseRecovery2.hardLeaseRecoveryRestartHelper(TestLeaseRecovery2.java:493)
 at org.apache.hadoop.hdfs.TestLeaseRecovery2.testHardLeaseRecoveryWithRenameAfterNameNodeRestart(TestLeaseRecovery2.java:432)
 at sun.reflect.NativeMethodAccessorImpl.invoke0(Native Method)
 at sun.reflect.NativeMethodAccessorImpl.invoke(NativeMethodAccessorImpl.java:62)
 at sun.reflect.DelegatingMethodAccessorImpl.invoke(DelegatingMethodAccessorImpl.java:43)
 at java.lang.reflect.Method.invoke(Method.java:483)
 at org.junit.runners.model.FrameworkMethod$1.runReflectiveCall(FrameworkMethod.java:47)
 at org.junit.internal.runners.model.ReflectiveCallable.run(ReflectiveCallable.java:12)
 at org.junit.runners.model.FrameworkMethod.invokeExplosively(FrameworkMethod.java:44)
 at org.junit.internal.runners.statements.InvokeMethod.evaluate(InvokeMethod.java:17)
 at org.junit.runners.ParentRunner.runLeaf(ParentRunner.java:271)
 at org.junit.runners.BlockJUnit4ClassRunner.runChild(BlockJUnit4ClassRunner.java:70)
 at org.junit.runners.BlockJUnit4ClassRunner.runChild(BlockJUnit4ClassRunner.java:50)
 at org.junit.runners.ParentRunner$3.run(ParentRunner.java:238)
 at org.junit.runners.ParentRunner$1.schedule(ParentRunner.java:63)
 at org.junit.runners.ParentRunner.runChildren(ParentRunner.java:236)
 at org.junit.runners.ParentRunner.access$000(ParentRunner.java:53)
 at org.junit.runners.ParentRunner$2.evaluate(ParentRunner.java:229)
 at org.junit.internal.runners.statements.RunBefores.evaluate(RunBefores.java:26)
 at org.junit.internal.runners.statements.RunAfters.evaluate(RunAfters.java:27)
 at org.junit.runners.ParentRunner.run(ParentRunner.java:309)
 at org.apache.maven.surefire.junit4.JUnit4Provider.execute(JUnit4Provider.java:264)
 at org.apache.maven.surefire.junit4.JUnit4Provider.executeTestSet(JUnit4Provider.java:153)
 at org.apache.maven.surefire.junit4.JUnit4Provider.invoke(JUnit4Provider.java:124)
 at org.apache.maven.surefire.booter.ForkedBooter.invokeProviderInSameClassLoader(ForkedBooter.java:200)
 at org.apache.maven.surefire.booter.ForkedBooter.runSuitesInProcess(ForkedBooter.java:153)
 at org.apache.maven.surefire.booter.ForkedBooter.main(ForkedBooter.java:103)


Stack Trace:
org.apache.hadoop.util.ExitUtil$ExitException: org.apache.hadoop.util.ExitUtil$ExitException:
Could not sync enough journals to persistent storage due to No journals available to flush.
Unsynced transactions: 1
	at org.apache.hadoop.util.ExitUtil.terminate(ExitUtil.java:126)
	at org.apache.hadoop.hdfs.server.namenode.FSEditLog.logSync(FSEditLog.java:637)
	at org.apache.hadoop.hdfs.server.namenode.FSEditLog.endCurrentLogSegment(FSEditLog.java:1316)
	at org.apache.hadoop.hdfs.server.namenode.FSEditLog.close(FSEditLog.java:362)
	at org.apache.hadoop.hdfs.server.namenode.FSNamesystem.stopActiveServices(FSNamesystem.java:1201)
	at org.apache.hadoop.hdfs.server.namenode.NameNode$NameNodeHAContext.stopActiveServices(NameNode.java:1735)
	at org.apache.hadoop.hdfs.server.namenode.ha.ActiveState.exitState(ActiveState.java:70)
	at org.apache.hadoop.hdfs.server.namenode.NameNode.stop(NameNode.java:880)
	at org.apache.hadoop.hdfs.MiniDFSCluster.shutdownNameNode(MiniDFSCluster.java:1912)
	at org.apache.hadoop.hdfs.MiniDFSCluster.restartNameNode(MiniDFSCluster.java:1963)
	at org.apache.hadoop.hdfs.MiniDFSCluster.restartNameNode(MiniDFSCluster.java:1944)
	at org.apache.hadoop.hdfs.TestLeaseRecovery2.hardLeaseRecoveryRestartHelper(TestLeaseRecovery2.java:493)
	at org.apache.hadoop.hdfs.TestLeaseRecovery2.testHardLeaseRecoveryWithRenameAfterNameNodeRestart(TestLeaseRecovery2.java:432)
	at sun.reflect.NativeMethodAccessorImpl.invoke0(Native Method)
	at sun.reflect.NativeMethodAccessorImpl.invoke(NativeMethodAccessorImpl.java:62)
	at sun.reflect.DelegatingMethodAccessorImpl.invoke(DelegatingMethodAccessorImpl.java:43)
	at java.lang.reflect.Method.invoke(Method.java:483)
	at org.junit.runners.model.FrameworkMethod$1.runReflectiveCall(FrameworkMethod.java:47)
	at org.junit.internal.runners.model.ReflectiveCallable.run(ReflectiveCallable.java:12)
	at org.junit.runners.model.FrameworkMethod.invokeExplosively(FrameworkMethod.java:44)
	at org.junit.internal.runners.statements.InvokeMethod.evaluate(InvokeMethod.java:17)
	at org.junit.runners.ParentRunner.runLeaf(ParentRunner.java:271)
	at org.junit.runners.BlockJUnit4ClassRunner.runChild(BlockJUnit4ClassRunner.java:70)
	at org.junit.runners.BlockJUnit4ClassRunner.runChild(BlockJUnit4ClassRunner.java:50)
	at org.junit.runners.ParentRunner$3.run(ParentRunner.java:238)
	at org.junit.runners.ParentRunner$1.schedule(ParentRunner.java:63)
	at org.junit.runners.ParentRunner.runChildren(ParentRunner.java:236)
	at org.junit.runners.ParentRunner.access$000(ParentRunner.java:53)
	at org.junit.runners.ParentRunner$2.evaluate(ParentRunner.java:229)
	at org.junit.internal.runners.statements.RunBefores.evaluate(RunBefores.java:26)
	at org.junit.internal.runners.statements.RunAfters.evaluate(RunAfters.java:27)
	at org.junit.runners.ParentRunner.run(ParentRunner.java:309)
	at org.apache.maven.surefire.junit4.JUnit4Provider.execute(JUnit4Provider.java:264)
	at org.apache.maven.surefire.junit4.JUnit4Provider.executeTestSet(JUnit4Provider.java:153)
	at org.apache.maven.surefire.junit4.JUnit4Provider.invoke(JUnit4Provider.java:124)
	at org.apache.maven.surefire.booter.ForkedBooter.invokeProviderInSameClassLoader(ForkedBooter.java:200)
	at org.apache.maven.surefire.booter.ForkedBooter.runSuitesInProcess(ForkedBooter.java:153)
	at org.apache.maven.surefire.booter.ForkedBooter.main(ForkedBooter.java:103)

	at org.apache.hadoop.util.ExitUtil.terminate(ExitUtil.java:126)
	at org.apache.hadoop.util.ExitUtil.terminate(ExitUtil.java:170)
	at org.apache.hadoop.hdfs.server.namenode.NameNode.doImmediateShutdown(NameNode.java:1704)
	at org.apache.hadoop.hdfs.server.namenode.NameNode$NameNodeHAContext.stopActiveServices(NameNode.java:1739)
	at org.apache.hadoop.hdfs.server.namenode.ha.ActiveState.exitState(ActiveState.java:70)
	at org.apache.hadoop.hdfs.server.namenode.NameNode.stop(NameNode.java:880)
	at org.apache.hadoop.hdfs.MiniDFSCluster.shutdownNameNode(MiniDFSCluster.java:1912)
	at org.apache.hadoop.hdfs.MiniDFSCluster.restartNameNode(MiniDFSCluster.java:1963)
	at org.apache.hadoop.hdfs.MiniDFSCluster.restartNameNode(MiniDFSCluster.java:1944)
	at org.apache.hadoop.hdfs.TestLeaseRecovery2.hardLeaseRecoveryRestartHelper(TestLeaseRecovery2.java:493)
	at org.apache.hadoop.hdfs.TestLeaseRecovery2.testHardLeaseRecoveryWithRenameAfterNameNodeRestart(TestLeaseRecovery2.java:432)


REGRESSION:  org.apache.hadoop.hdfs.TestLeaseRecovery2.testLeaseRecoverByAnotherUser

Error Message:
Lease monitor is not running

Stack Trace:
java.lang.IllegalStateException: Lease monitor is not running
	at com.google.common.base.Preconditions.checkState(Preconditions.java:145)
	at org.apache.hadoop.hdfs.server.namenode.LeaseManager.triggerMonitorCheckNow(LeaseManager.java:448)
	at org.apache.hadoop.hdfs.server.namenode.NameNodeAdapter.setLeasePeriod(NameNodeAdapter.java:135)
	at org.apache.hadoop.hdfs.MiniDFSCluster.setLeasePeriod(MiniDFSCluster.java:2586)
	at org.apache.hadoop.hdfs.TestLeaseRecovery2.testLeaseRecoverByAnotherUser(TestLeaseRecovery2.java:158)


REGRESSION:  org.apache.hadoop.hdfs.TestLeaseRecovery2.testHardLeaseRecovery

Error Message:
End of File Exception between local host is: "asf907.gq1.ygridcore.net/67.195.81.151"; destination
host is: "localhost":56782; : java.io.EOFException; For more details see:  http://wiki.apache.org/hadoop/EOFException

Stack Trace:
java.io.EOFException: End of File Exception between local host is: "asf907.gq1.ygridcore.net/67.195.81.151";
destination host is: "localhost":56782; : java.io.EOFException; For more details see:  http://wiki.apache.org/hadoop/EOFException
	at sun.reflect.NativeConstructorAccessorImpl.newInstance0(Native Method)
	at sun.reflect.NativeConstructorAccessorImpl.newInstance(NativeConstructorAccessorImpl.java:62)
	at sun.reflect.DelegatingConstructorAccessorImpl.newInstance(DelegatingConstructorAccessorImpl.java:45)
	at java.lang.reflect.Constructor.newInstance(Constructor.java:408)
	at org.apache.hadoop.net.NetUtils.wrapWithMessage(NetUtils.java:792)
	at org.apache.hadoop.net.NetUtils.wrapException(NetUtils.java:765)
	at org.apache.hadoop.ipc.Client.call(Client.java:1449)
	at org.apache.hadoop.ipc.Client.call(Client.java:1376)
	at org.apache.hadoop.ipc.ProtobufRpcEngine$Invoker.invoke(ProtobufRpcEngine.java:229)
	at com.sun.proxy.$Proxy20.create(Unknown Source)
	at org.apache.hadoop.hdfs.protocolPB.ClientNamenodeProtocolTranslatorPB.create(ClientNamenodeProtocolTranslatorPB.java:297)
	at sun.reflect.NativeMethodAccessorImpl.invoke0(Native Method)
	at sun.reflect.NativeMethodAccessorImpl.invoke(NativeMethodAccessorImpl.java:62)
	at sun.reflect.DelegatingMethodAccessorImpl.invoke(DelegatingMethodAccessorImpl.java:43)
	at java.lang.reflect.Method.invoke(Method.java:483)
	at org.apache.hadoop.io.retry.RetryInvocationHandler.invokeMethod(RetryInvocationHandler.java:251)
	at org.apache.hadoop.io.retry.RetryInvocationHandler.invoke(RetryInvocationHandler.java:103)
	at com.sun.proxy.$Proxy25.create(Unknown Source)
	at org.apache.hadoop.hdfs.DFSOutputStream.newStreamForCreate(DFSOutputStream.java:241)
	at org.apache.hadoop.hdfs.DFSClient.create(DFSClient.java:1224)
	at org.apache.hadoop.hdfs.DFSClient.create(DFSClient.java:1155)
	at org.apache.hadoop.hdfs.DistributedFileSystem$7.doCall(DistributedFileSystem.java:420)
	at org.apache.hadoop.hdfs.DistributedFileSystem$7.doCall(DistributedFileSystem.java:416)
	at org.apache.hadoop.fs.FileSystemLinkResolver.resolve(FileSystemLinkResolver.java:81)
	at org.apache.hadoop.hdfs.DistributedFileSystem.create(DistributedFileSystem.java:431)
	at org.apache.hadoop.hdfs.DistributedFileSystem.create(DistributedFileSystem.java:359)
	at org.apache.hadoop.fs.FileSystem.create(FileSystem.java:913)
	at org.apache.hadoop.fs.FileSystem.create(FileSystem.java:894)
	at org.apache.hadoop.hdfs.TestLeaseRecovery2.testHardLeaseRecovery(TestLeaseRecovery2.java:275)
Caused by: java.io.EOFException: null
	at java.io.DataInputStream.readInt(DataInputStream.java:392)
	at org.apache.hadoop.ipc.Client$Connection.receiveRpcResponse(Client.java:1103)
	at org.apache.hadoop.ipc.Client$Connection.run(Client.java:998)


FAILED:  org.apache.hadoop.hdfs.TestLeaseRecovery2.org.apache.hadoop.hdfs.TestLeaseRecovery2

Error Message:
Test resulted in an unexpected exit

Stack Trace:
java.lang.AssertionError: Test resulted in an unexpected exit
	at org.apache.hadoop.hdfs.MiniDFSCluster.shutdown(MiniDFSCluster.java:1848)
	at org.apache.hadoop.hdfs.MiniDFSCluster.shutdown(MiniDFSCluster.java:1835)
	at org.apache.hadoop.hdfs.MiniDFSCluster.shutdown(MiniDFSCluster.java:1828)
	at org.apache.hadoop.hdfs.TestLeaseRecovery2.tearDown(TestLeaseRecovery2.java:104)


FAILED:  org.apache.hadoop.hdfs.server.datanode.TestDataNodeMetrics.testDataNodeTimeSpend

Error Message:
null

Stack Trace:
java.lang.AssertionError: null
	at org.junit.Assert.fail(Assert.java:86)
	at org.junit.Assert.assertTrue(Assert.java:41)
	at org.junit.Assert.assertTrue(Assert.java:52)
	at org.apache.hadoop.hdfs.server.datanode.TestDataNodeMetrics.testDataNodeTimeSpend(TestDataNodeMetrics.java:288)


FAILED:  org.apache.hadoop.hdfs.server.namenode.ha.TestSeveralNameNodes.testCircularLinkedListWrites

Error Message:
Some writers didn't complete in expected runtime! Current writer state:[Circular Writer:
  directory: /test-0
  target length: 50
  current item: 48
  done: false
, Circular Writer:
  directory: /test-1
  target length: 50
  current item: 50
  done: false
, Circular Writer:
  directory: /test-2
  target length: 50
  current item: 19
  done: false
] expected:<0> but was:<3>

Stack Trace:
java.lang.AssertionError: Some writers didn't complete in expected runtime! Current writer
state:[Circular Writer:
	 directory: /test-0
	 target length: 50
	 current item: 48
	 done: false
, Circular Writer:
	 directory: /test-1
	 target length: 50
	 current item: 50
	 done: false
, Circular Writer:
	 directory: /test-2
	 target length: 50
	 current item: 19
	 done: false
] expected:<0> but was:<3>
	at org.junit.Assert.fail(Assert.java:88)
	at org.junit.Assert.failNotEquals(Assert.java:743)
	at org.junit.Assert.assertEquals(Assert.java:118)
	at org.junit.Assert.assertEquals(Assert.java:555)
	at org.apache.hadoop.hdfs.server.namenode.ha.TestSeveralNameNodes.testCircularLinkedListWrites(TestSeveralNameNodes.java:90)



Mime
  • Unnamed multipart/mixed (inline, None, 0 bytes)
View raw message