hadoop-hdfs-dev mailing list archives

Site index · List index
Message view « Date » · « Thread »
Top « Date » · « Thread »
From Apache Jenkins Server <jenk...@builds.apache.org>
Subject Build failed in Jenkins: Hadoop-Hdfs-trunk #2376
Date Wed, 30 Sep 2015 01:06:39 GMT
See <https://builds.apache.org/job/Hadoop-Hdfs-trunk/2376/changes>

Changes:

[wheat9] HDFS-9174. Fix findbugs warnings in FSOutputSummer.tracer and DirectoryScanner$ReportCompiler.currentThread.
Contributed by Yi Liu.

[wheat9] HDFS-8696. Make the lower and higher watermark in the DN Netty server configurable.
Contributed by Xiaobing Zhou.

------------------------------------------
[...truncated 6845 lines...]
Running org.apache.hadoop.hdfs.server.namenode.TestDeduplicationMap
Tests run: 1, Failures: 0, Errors: 0, Skipped: 0, Time elapsed: 0.125 sec - in org.apache.hadoop.hdfs.server.namenode.TestDeduplicationMap
Running org.apache.hadoop.hdfs.server.namenode.ha.TestHASafeMode
Tests run: 18, Failures: 0, Errors: 0, Skipped: 0, Time elapsed: 74.808 sec - in org.apache.hadoop.hdfs.server.namenode.ha.TestHASafeMode
Running org.apache.hadoop.hdfs.server.namenode.ha.TestDNFencingWithReplication
Tests run: 1, Failures: 0, Errors: 0, Skipped: 0, Time elapsed: 73.508 sec - in org.apache.hadoop.hdfs.server.namenode.ha.TestDNFencingWithReplication
Running org.apache.hadoop.hdfs.server.namenode.ha.TestDFSUpgradeWithHA
Tests run: 9, Failures: 0, Errors: 0, Skipped: 0, Time elapsed: 21.151 sec - in org.apache.hadoop.hdfs.server.namenode.ha.TestDFSUpgradeWithHA
Running org.apache.hadoop.hdfs.server.namenode.ha.TestEditLogsDuringFailover
Tests run: 3, Failures: 0, Errors: 0, Skipped: 0, Time elapsed: 8.494 sec - in org.apache.hadoop.hdfs.server.namenode.ha.TestEditLogsDuringFailover
Running org.apache.hadoop.hdfs.server.namenode.ha.TestEditLogTailer
Tests run: 4, Failures: 0, Errors: 0, Skipped: 0, Time elapsed: 11.233 sec - in org.apache.hadoop.hdfs.server.namenode.ha.TestEditLogTailer
Running org.apache.hadoop.hdfs.server.namenode.ha.TestPendingCorruptDnMessages
Tests run: 1, Failures: 0, Errors: 0, Skipped: 0, Time elapsed: 15.472 sec - in org.apache.hadoop.hdfs.server.namenode.ha.TestPendingCorruptDnMessages
Running org.apache.hadoop.hdfs.server.namenode.ha.TestPipelinesFailover
Tests run: 8, Failures: 0, Errors: 0, Skipped: 0, Time elapsed: 96.46 sec - in org.apache.hadoop.hdfs.server.namenode.ha.TestPipelinesFailover
Running org.apache.hadoop.hdfs.server.namenode.ha.TestQuotasWithHA
Tests run: 1, Failures: 0, Errors: 0, Skipped: 0, Time elapsed: 8.505 sec - in org.apache.hadoop.hdfs.server.namenode.ha.TestQuotasWithHA
Running org.apache.hadoop.hdfs.server.namenode.ha.TestGetGroupsWithHA
Tests run: 6, Failures: 0, Errors: 0, Skipped: 0, Time elapsed: 7.365 sec - in org.apache.hadoop.hdfs.server.namenode.ha.TestGetGroupsWithHA
Running org.apache.hadoop.hdfs.server.namenode.ha.TestNNHealthCheck
Tests run: 1, Failures: 0, Errors: 0, Skipped: 0, Time elapsed: 4.839 sec - in org.apache.hadoop.hdfs.server.namenode.ha.TestNNHealthCheck
Running org.apache.hadoop.hdfs.server.namenode.ha.TestFailureToReadEdits
Tests run: 6, Failures: 0, Errors: 0, Skipped: 0, Time elapsed: 86.334 sec - in org.apache.hadoop.hdfs.server.namenode.ha.TestFailureToReadEdits
Running org.apache.hadoop.hdfs.server.namenode.ha.TestFailureOfSharedDir
Tests run: 4, Failures: 0, Errors: 0, Skipped: 0, Time elapsed: 9.14 sec - in org.apache.hadoop.hdfs.server.namenode.ha.TestFailureOfSharedDir
Running org.apache.hadoop.hdfs.server.namenode.ha.TestLossyRetryInvocationHandler
Tests run: 1, Failures: 0, Errors: 0, Skipped: 0, Time elapsed: 4.108 sec - in org.apache.hadoop.hdfs.server.namenode.ha.TestLossyRetryInvocationHandler
Running org.apache.hadoop.hdfs.server.namenode.ha.TestHAFsck
Tests run: 1, Failures: 0, Errors: 0, Skipped: 0, Time elapsed: 4.81 sec - in org.apache.hadoop.hdfs.server.namenode.ha.TestHAFsck
Running org.apache.hadoop.hdfs.server.namenode.ha.TestBootstrapStandby
Tests run: 5, Failures: 0, Errors: 0, Skipped: 0, Time elapsed: 10.403 sec - in org.apache.hadoop.hdfs.server.namenode.ha.TestBootstrapStandby
Running org.apache.hadoop.hdfs.server.namenode.ha.TestDNFencing
Tests run: 6, Failures: 0, Errors: 0, Skipped: 0, Time elapsed: 43.292 sec - in org.apache.hadoop.hdfs.server.namenode.ha.TestDNFencing
Running org.apache.hadoop.hdfs.server.namenode.ha.TestHAAppend
Tests run: 1, Failures: 0, Errors: 0, Skipped: 0, Time elapsed: 9.03 sec - in org.apache.hadoop.hdfs.server.namenode.ha.TestHAAppend
Running org.apache.hadoop.hdfs.server.namenode.ha.TestStandbyIsHot
Tests run: 2, Failures: 0, Errors: 0, Skipped: 0, Time elapsed: 17.636 sec - in org.apache.hadoop.hdfs.server.namenode.ha.TestStandbyIsHot
Running org.apache.hadoop.hdfs.server.namenode.ha.TestRetryCacheWithHA
Tests run: 22, Failures: 0, Errors: 0, Skipped: 0, Time elapsed: 102.636 sec - in org.apache.hadoop.hdfs.server.namenode.ha.TestRetryCacheWithHA
Running org.apache.hadoop.hdfs.server.namenode.ha.TestHAStateTransitions
Tests run: 11, Failures: 0, Errors: 0, Skipped: 0, Time elapsed: 66.361 sec - in org.apache.hadoop.hdfs.server.namenode.ha.TestHAStateTransitions
Running org.apache.hadoop.hdfs.server.namenode.ha.TestBootstrapStandbyWithQJM
Tests run: 5, Failures: 0, Errors: 0, Skipped: 0, Time elapsed: 15.87 sec - in org.apache.hadoop.hdfs.server.namenode.ha.TestBootstrapStandbyWithQJM
Running org.apache.hadoop.hdfs.server.namenode.ha.TestRemoteNameNodeInfo
Tests run: 1, Failures: 0, Errors: 0, Skipped: 0, Time elapsed: 0.766 sec - in org.apache.hadoop.hdfs.server.namenode.ha.TestRemoteNameNodeInfo
Running org.apache.hadoop.hdfs.server.namenode.ha.TestStandbyCheckpoints
Tests run: 7, Failures: 0, Errors: 0, Skipped: 0, Time elapsed: 184.414 sec - in org.apache.hadoop.hdfs.server.namenode.ha.TestStandbyCheckpoints
Running org.apache.hadoop.hdfs.server.namenode.ha.TestHAConfiguration
Tests run: 4, Failures: 0, Errors: 0, Skipped: 0, Time elapsed: 1.776 sec - in org.apache.hadoop.hdfs.server.namenode.ha.TestHAConfiguration
Running org.apache.hadoop.hdfs.server.namenode.ha.TestHAMetrics
Tests run: 1, Failures: 0, Errors: 0, Skipped: 0, Time elapsed: 8.599 sec - in org.apache.hadoop.hdfs.server.namenode.ha.TestHAMetrics
Running org.apache.hadoop.hdfs.server.namenode.ha.TestRequestHedgingProxyProvider
Tests run: 5, Failures: 0, Errors: 0, Skipped: 0, Time elapsed: 14.077 sec - in org.apache.hadoop.hdfs.server.namenode.ha.TestRequestHedgingProxyProvider
Running org.apache.hadoop.hdfs.server.namenode.ha.TestStateTransitionFailure
Tests run: 1, Failures: 0, Errors: 0, Skipped: 0, Time elapsed: 5.147 sec - in org.apache.hadoop.hdfs.server.namenode.ha.TestStateTransitionFailure
Running org.apache.hadoop.hdfs.server.namenode.ha.TestStandbyBlockManagement
Tests run: 1, Failures: 0, Errors: 0, Skipped: 0, Time elapsed: 8.28 sec - in org.apache.hadoop.hdfs.server.namenode.ha.TestStandbyBlockManagement
Running org.apache.hadoop.hdfs.server.namenode.ha.TestDelegationTokensWithHA
Tests run: 6, Failures: 0, Errors: 0, Skipped: 0, Time elapsed: 9.033 sec - in org.apache.hadoop.hdfs.server.namenode.ha.TestDelegationTokensWithHA
Running org.apache.hadoop.hdfs.server.namenode.ha.TestFailoverWithBlockTokensEnabled
Tests run: 4, Failures: 0, Errors: 0, Skipped: 0, Time elapsed: 20.685 sec - in org.apache.hadoop.hdfs.server.namenode.ha.TestFailoverWithBlockTokensEnabled
Running org.apache.hadoop.hdfs.server.namenode.ha.TestSeveralNameNodes
Tests run: 1, Failures: 0, Errors: 0, Skipped: 0, Time elapsed: 105.964 sec - in org.apache.hadoop.hdfs.server.namenode.ha.TestSeveralNameNodes
Running org.apache.hadoop.hdfs.server.namenode.ha.TestHarFileSystemWithHA
Tests run: 1, Failures: 0, Errors: 0, Skipped: 0, Time elapsed: 5.903 sec - in org.apache.hadoop.hdfs.server.namenode.ha.TestHarFileSystemWithHA
Running org.apache.hadoop.hdfs.server.namenode.ha.TestXAttrsWithHA
Tests run: 1, Failures: 0, Errors: 0, Skipped: 0, Time elapsed: 6.2 sec - in org.apache.hadoop.hdfs.server.namenode.ha.TestXAttrsWithHA
Running org.apache.hadoop.hdfs.server.namenode.ha.TestInitializeSharedEdits
Tests run: 4, Failures: 0, Errors: 0, Skipped: 0, Time elapsed: 13.109 sec - in org.apache.hadoop.hdfs.server.namenode.ha.TestInitializeSharedEdits
Running org.apache.hadoop.hdfs.server.namenode.TestDefaultBlockPlacementPolicy
Tests run: 4, Failures: 0, Errors: 0, Skipped: 0, Time elapsed: 10.427 sec - in org.apache.hadoop.hdfs.server.namenode.TestDefaultBlockPlacementPolicy
Running org.apache.hadoop.hdfs.server.namenode.TestDecommissioningStatus
Tests run: 3, Failures: 0, Errors: 0, Skipped: 0, Time elapsed: 13.506 sec - in org.apache.hadoop.hdfs.server.namenode.TestDecommissioningStatus
Running org.apache.hadoop.hdfs.server.namenode.TestINodeAttributeProvider
Tests run: 2, Failures: 0, Errors: 0, Skipped: 0, Time elapsed: 4.821 sec - in org.apache.hadoop.hdfs.server.namenode.TestINodeAttributeProvider
Running org.apache.hadoop.hdfs.server.namenode.metrics.TestNameNodeMetrics
Tests run: 13, Failures: 0, Errors: 0, Skipped: 0, Time elapsed: 110.436 sec - in org.apache.hadoop.hdfs.server.namenode.metrics.TestNameNodeMetrics
Running org.apache.hadoop.hdfs.server.namenode.metrics.TestNNMetricFilesInGetListingOps
Tests run: 1, Failures: 0, Errors: 0, Skipped: 0, Time elapsed: 8.353 sec - in org.apache.hadoop.hdfs.server.namenode.metrics.TestNNMetricFilesInGetListingOps
Running org.apache.hadoop.hdfs.server.namenode.TestDeadDatanode
Tests run: 2, Failures: 0, Errors: 0, Skipped: 0, Time elapsed: 33.593 sec - in org.apache.hadoop.hdfs.server.namenode.TestDeadDatanode
Running org.apache.hadoop.hdfs.server.namenode.TestNameNodeRespectsBindHostKeys
Tests run: 4, Failures: 0, Errors: 0, Skipped: 0, Time elapsed: 8.724 sec - in org.apache.hadoop.hdfs.server.namenode.TestNameNodeRespectsBindHostKeys
Running org.apache.hadoop.hdfs.server.namenode.startupprogress.TestStartupProgressMetrics
Tests run: 3, Failures: 0, Errors: 0, Skipped: 0, Time elapsed: 0.562 sec - in org.apache.hadoop.hdfs.server.namenode.startupprogress.TestStartupProgressMetrics
Running org.apache.hadoop.hdfs.server.namenode.startupprogress.TestStartupProgress
Tests run: 9, Failures: 0, Errors: 0, Skipped: 0, Time elapsed: 0.425 sec - in org.apache.hadoop.hdfs.server.namenode.startupprogress.TestStartupProgress
Running org.apache.hadoop.hdfs.server.namenode.TestNameNodeXAttr
Tests run: 13, Failures: 0, Errors: 0, Skipped: 0, Time elapsed: 12.729 sec - in org.apache.hadoop.hdfs.server.namenode.TestNameNodeXAttr
Running org.apache.hadoop.hdfs.server.namenode.TestXAttrConfigFlag
Tests run: 5, Failures: 0, Errors: 0, Skipped: 0, Time elapsed: 10.26 sec - in org.apache.hadoop.hdfs.server.namenode.TestXAttrConfigFlag
Running org.apache.hadoop.hdfs.server.namenode.TestNameNodeRecovery
Tests run: 11, Failures: 0, Errors: 0, Skipped: 0, Time elapsed: 17.906 sec - in org.apache.hadoop.hdfs.server.namenode.TestNameNodeRecovery
Running org.apache.hadoop.hdfs.server.namenode.TestBlockUnderConstruction
Tests run: 2, Failures: 0, Errors: 0, Skipped: 0, Time elapsed: 5.579 sec - in org.apache.hadoop.hdfs.server.namenode.TestBlockUnderConstruction
Running org.apache.hadoop.hdfs.server.namenode.TestDeleteRace
Tests run: 5, Failures: 0, Errors: 0, Skipped: 0, Time elapsed: 59.501 sec - in org.apache.hadoop.hdfs.server.namenode.TestDeleteRace
Running org.apache.hadoop.hdfs.server.namenode.TestNameEditsConfigs
Tests run: 4, Failures: 0, Errors: 0, Skipped: 0, Time elapsed: 17.838 sec - in org.apache.hadoop.hdfs.server.namenode.TestNameEditsConfigs
Running org.apache.hadoop.hdfs.server.namenode.TestEditLogFileInputStream
Tests run: 2, Failures: 0, Errors: 0, Skipped: 0, Time elapsed: 1.601 sec - in org.apache.hadoop.hdfs.server.namenode.TestEditLogFileInputStream
Running org.apache.hadoop.hdfs.server.namenode.TestNameNodeOptionParsing
Tests run: 2, Failures: 0, Errors: 0, Skipped: 0, Time elapsed: 0.443 sec - in org.apache.hadoop.hdfs.server.namenode.TestNameNodeOptionParsing
Running org.apache.hadoop.hdfs.server.namenode.TestEditsDoubleBuffer
Tests run: 2, Failures: 0, Errors: 0, Skipped: 0, Time elapsed: 0.279 sec - in org.apache.hadoop.hdfs.server.namenode.TestEditsDoubleBuffer
Running org.apache.hadoop.hdfs.server.namenode.TestPathComponents
Tests run: 1, Failures: 0, Errors: 0, Skipped: 0, Time elapsed: 0.413 sec - in org.apache.hadoop.hdfs.server.namenode.TestPathComponents
Running org.apache.hadoop.hdfs.server.namenode.TestNameNodeResourcePolicy
Tests run: 5, Failures: 0, Errors: 0, Skipped: 0, Time elapsed: 0.371 sec - in org.apache.hadoop.hdfs.server.namenode.TestNameNodeResourcePolicy
Running org.apache.hadoop.hdfs.server.namenode.TestFSImageWithXAttr
Tests run: 2, Failures: 0, Errors: 0, Skipped: 0, Time elapsed: 40.388 sec - in org.apache.hadoop.hdfs.server.namenode.TestFSImageWithXAttr
Running org.apache.hadoop.hdfs.server.namenode.TestAclConfigFlag
Tests run: 8, Failures: 0, Errors: 0, Skipped: 0, Time elapsed: 12.38 sec - in org.apache.hadoop.hdfs.server.namenode.TestAclConfigFlag
Running org.apache.hadoop.hdfs.server.namenode.TestHDFSConcat
Tests run: 6, Failures: 0, Errors: 0, Skipped: 0, Time elapsed: 18.576 sec - in org.apache.hadoop.hdfs.server.namenode.TestHDFSConcat
Running org.apache.hadoop.hdfs.server.namenode.TestQuotaByStorageType
Tests run: 20, Failures: 0, Errors: 0, Skipped: 0, Time elapsed: 42.024 sec - in org.apache.hadoop.hdfs.server.namenode.TestQuotaByStorageType
Running org.apache.hadoop.hdfs.server.namenode.TestNNStorageRetentionFunctional
Tests run: 1, Failures: 0, Errors: 0, Skipped: 0, Time elapsed: 4.551 sec - in org.apache.hadoop.hdfs.server.namenode.TestNNStorageRetentionFunctional
Running org.apache.hadoop.hdfs.server.namenode.TestAclTransformation
Tests run: 55, Failures: 0, Errors: 0, Skipped: 0, Time elapsed: 0.528 sec - in org.apache.hadoop.hdfs.server.namenode.TestAclTransformation
Running org.apache.hadoop.hdfs.server.namenode.TestMetadataVersionOutput
Tests run: 1, Failures: 0, Errors: 0, Skipped: 0, Time elapsed: 6.78 sec - in org.apache.hadoop.hdfs.server.namenode.TestMetadataVersionOutput
Running org.apache.hadoop.hdfs.server.namenode.TestNNStorageRetentionManager
Tests run: 9, Failures: 0, Errors: 0, Skipped: 0, Time elapsed: 1.427 sec - in org.apache.hadoop.hdfs.server.namenode.TestNNStorageRetentionManager
Running org.apache.hadoop.hdfs.server.namenode.TestFSEditLogLoader
Tests run: 7, Failures: 0, Errors: 0, Skipped: 0, Time elapsed: 8.928 sec - in org.apache.hadoop.hdfs.server.namenode.TestFSEditLogLoader
Running org.apache.hadoop.hdfs.server.namenode.TestDiskspaceQuotaUpdate
Tests run: 7, Failures: 0, Errors: 0, Skipped: 0, Time elapsed: 64.737 sec - in org.apache.hadoop.hdfs.server.namenode.TestDiskspaceQuotaUpdate
Running org.apache.hadoop.hdfs.server.namenode.TestSecondaryNameNodeUpgrade
Tests run: 3, Failures: 0, Errors: 0, Skipped: 0, Time elapsed: 8.067 sec - in org.apache.hadoop.hdfs.server.namenode.TestSecondaryNameNodeUpgrade
Running org.apache.hadoop.hdfs.server.namenode.TestNamenodeRetryCache
Tests run: 11, Failures: 0, Errors: 0, Skipped: 0, Time elapsed: 26.56 sec - in org.apache.hadoop.hdfs.server.namenode.TestNamenodeRetryCache
Running org.apache.hadoop.hdfs.server.namenode.TestAllowFormat
Tests run: 2, Failures: 0, Errors: 0, Skipped: 0, Time elapsed: 5.682 sec - in org.apache.hadoop.hdfs.server.namenode.TestAllowFormat
Running org.apache.hadoop.hdfs.server.namenode.TestNamenodeCapacityReport
Tests run: 2, Failures: 0, Errors: 0, Skipped: 0, Time elapsed: 17.886 sec - in org.apache.hadoop.hdfs.server.namenode.TestNamenodeCapacityReport
Running org.apache.hadoop.hdfs.server.namenode.TestNameNodeRpcServer
Tests run: 1, Failures: 0, Errors: 0, Skipped: 0, Time elapsed: 5.134 sec - in org.apache.hadoop.hdfs.server.namenode.TestNameNodeRpcServer
Running org.apache.hadoop.hdfs.server.namenode.TestFavoredNodesEndToEnd
Tests run: 4, Failures: 0, Errors: 0, Skipped: 0, Time elapsed: 9.03 sec - in org.apache.hadoop.hdfs.server.namenode.TestFavoredNodesEndToEnd
Running org.apache.hadoop.hdfs.server.namenode.TestSecureNameNode
Tests run: 2, Failures: 0, Errors: 0, Skipped: 0, Time elapsed: 10.468 sec - in org.apache.hadoop.hdfs.server.namenode.TestSecureNameNode
Running org.apache.hadoop.hdfs.server.namenode.TestEditLogAutoroll
Tests run: 1, Failures: 0, Errors: 0, Skipped: 0, Time elapsed: 5.741 sec - in org.apache.hadoop.hdfs.server.namenode.TestEditLogAutoroll
Running org.apache.hadoop.hdfs.server.namenode.TestClusterId
Tests run: 13, Failures: 0, Errors: 0, Skipped: 0, Time elapsed: 2.696 sec - in org.apache.hadoop.hdfs.server.namenode.TestClusterId
Running org.apache.hadoop.hdfs.server.namenode.TestStartupOptionUpgrade
Tests run: 10, Failures: 0, Errors: 0, Skipped: 0, Time elapsed: 1.341 sec - in org.apache.hadoop.hdfs.server.namenode.TestStartupOptionUpgrade
Running org.apache.hadoop.hdfs.server.namenode.TestLargeDirectoryDelete
Tests run: 1, Failures: 0, Errors: 0, Skipped: 0, Time elapsed: 59.923 sec - in org.apache.hadoop.hdfs.server.namenode.TestLargeDirectoryDelete
Running org.apache.hadoop.hdfs.server.namenode.TestFSImageWithAcl
Tests run: 4, Failures: 0, Errors: 0, Skipped: 0, Time elapsed: 64.787 sec - in org.apache.hadoop.hdfs.server.namenode.TestFSImageWithAcl
Running org.apache.hadoop.hdfs.server.namenode.TestNameNodeHttpServer
Tests run: 3, Failures: 0, Errors: 0, Skipped: 0, Time elapsed: 3.151 sec - in org.apache.hadoop.hdfs.server.namenode.TestNameNodeHttpServer
Running org.apache.hadoop.hdfs.server.namenode.TestEditLog
Tests run: 24, Failures: 0, Errors: 0, Skipped: 0, Time elapsed: 91.557 sec - in org.apache.hadoop.hdfs.server.namenode.TestEditLog
Running org.apache.hadoop.hdfs.server.namenode.TestStorageRestore

Results :

Tests run: 2780, Failures: 0, Errors: 0, Skipped: 12

[INFO]                                                                         
[INFO] ------------------------------------------------------------------------
[INFO] Skipping Apache Hadoop HttpFS
[INFO] This project has been banned from the build due to previous failures.
[INFO] ------------------------------------------------------------------------
[INFO]                                                                         
[INFO] ------------------------------------------------------------------------
[INFO] Skipping Apache Hadoop HDFS BookKeeper Journal
[INFO] This project has been banned from the build due to previous failures.
[INFO] ------------------------------------------------------------------------
[INFO]                                                                         
[INFO] ------------------------------------------------------------------------
[INFO] Skipping Apache Hadoop HDFS-NFS
[INFO] This project has been banned from the build due to previous failures.
[INFO] ------------------------------------------------------------------------
[INFO]                                                                         
[INFO] ------------------------------------------------------------------------
[INFO] Building Apache Hadoop HDFS Project 3.0.0-SNAPSHOT
[INFO] ------------------------------------------------------------------------
[INFO] 
[INFO] --- maven-clean-plugin:2.5:clean (default-clean) @ hadoop-hdfs-project ---
[INFO] Deleting <https://builds.apache.org/job/Hadoop-Hdfs-trunk/ws/hadoop-hdfs-project/target>
[INFO] 
[INFO] --- maven-antrun-plugin:1.7:run (create-testdirs) @ hadoop-hdfs-project ---
[INFO] Executing tasks

main:
    [mkdir] Created dir: <https://builds.apache.org/job/Hadoop-Hdfs-trunk/ws/hadoop-hdfs-project/target/test-dir>
[INFO] Executed tasks
[INFO] 
[INFO] --- maven-source-plugin:2.3:jar-no-fork (hadoop-java-sources) @ hadoop-hdfs-project
---
[INFO] 
[INFO] --- maven-source-plugin:2.3:test-jar-no-fork (hadoop-java-sources) @ hadoop-hdfs-project
---
[INFO] 
[INFO] --- maven-enforcer-plugin:1.3.1:enforce (dist-enforce) @ hadoop-hdfs-project ---
[INFO] 
[INFO] --- maven-site-plugin:3.4:attach-descriptor (attach-descriptor) @ hadoop-hdfs-project
---
[INFO] 
[INFO] --- maven-javadoc-plugin:2.8.1:jar (module-javadocs) @ hadoop-hdfs-project ---
[INFO] Skipping javadoc generation
[INFO] 
[INFO] --- maven-enforcer-plugin:1.3.1:enforce (depcheck) @ hadoop-hdfs-project ---
[INFO] 
[INFO] --- maven-checkstyle-plugin:2.15:checkstyle (default-cli) @ hadoop-hdfs-project ---
[INFO] 
[INFO] --- findbugs-maven-plugin:3.0.0:findbugs (default-cli) @ hadoop-hdfs-project ---
[INFO] ------------------------------------------------------------------------
[INFO] Reactor Summary:
[INFO] 
[INFO] Apache Hadoop HDFS Client ......................... SUCCESS [05:28 min]
[INFO] Apache Hadoop HDFS ................................ FAILURE [  01:47 h]
[INFO] Apache Hadoop HttpFS .............................. SKIPPED
[INFO] Apache Hadoop HDFS BookKeeper Journal ............. SKIPPED
[INFO] Apache Hadoop HDFS-NFS ............................ SKIPPED
[INFO] Apache Hadoop HDFS Project ........................ SUCCESS [  0.067 s]
[INFO] ------------------------------------------------------------------------
[INFO] BUILD FAILURE
[INFO] ------------------------------------------------------------------------
[INFO] Total time: 01:53 h
[INFO] Finished at: 2015-09-30T01:06:49+00:00
[INFO] Final Memory: 75M/924M
[INFO] ------------------------------------------------------------------------
[ERROR] Failed to execute goal org.apache.maven.plugins:maven-surefire-plugin:2.17:test (default-test)
on project hadoop-hdfs: ExecutionException: java.lang.RuntimeException: The forked VM terminated
without properly saying goodbye. VM crash or System.exit called?
[ERROR] Command was /bin/sh -c cd <https://builds.apache.org/job/Hadoop-Hdfs-trunk/ws/hadoop-hdfs-project/hadoop-hdfs>
&& /home/jenkins/tools/java/jdk1.7.0_55/jre/bin/java -Xmx2048m -XX:MaxPermSize=768m
-XX:+HeapDumpOnOutOfMemoryError -jar <https://builds.apache.org/job/Hadoop-Hdfs-trunk/ws/hadoop-hdfs-project/hadoop-hdfs/target/surefire/surefirebooter3250428906401346261.jar>
<https://builds.apache.org/job/Hadoop-Hdfs-trunk/ws/hadoop-hdfs-project/hadoop-hdfs/target/surefire/surefire857206128601859968tmp>
<https://builds.apache.org/job/Hadoop-Hdfs-trunk/ws/hadoop-hdfs-project/hadoop-hdfs/target/surefire/surefire_1877552232388633391429tmp>
[ERROR] -> [Help 1]
[ERROR] 
[ERROR] To see the full stack trace of the errors, re-run Maven with the -e switch.
[ERROR] Re-run Maven using the -X switch to enable full debug logging.
[ERROR] 
[ERROR] For more information about the errors and possible solutions, please read the following
articles:
[ERROR] [Help 1] http://cwiki.apache.org/confluence/display/MAVEN/MojoFailureException
[ERROR] 
[ERROR] After correcting the problems, you can resume the build with the command
[ERROR]   mvn <goals> -rf :hadoop-hdfs
Build step 'Execute shell' marked build as failure
Archiving artifacts
Sending artifact delta relative to Hadoop-Hdfs-trunk #2342
Archived 1 artifacts
Archive block size is 32768
Received 0 blocks and 4799240 bytes
Compression is 0.0%
Took 2.7 sec
Recording test results
Updating HDFS-8696
Updating HDFS-9174

Mime
View raw message