hadoop-hdfs-dev mailing list archives

Site index · List index
Message view « Date » · « Thread »
Top « Date » · « Thread »
From Apache Jenkins Server <jenk...@builds.apache.org>
Subject Hadoop-Hdfs-trunk - Build # 2279 - Still Failing
Date Tue, 08 Sep 2015 03:58:24 GMT
See https://builds.apache.org/job/Hadoop-Hdfs-trunk/2279/

###################################################################################
########################## LAST 60 LINES OF THE CONSOLE ###########################
[...truncated 8369 lines...]
[INFO] 
[INFO] --- maven-source-plugin:2.3:jar-no-fork (hadoop-java-sources) @ hadoop-hdfs-project
---
[INFO] 
[INFO] --- maven-source-plugin:2.3:test-jar-no-fork (hadoop-java-sources) @ hadoop-hdfs-project
---
[INFO] 
[INFO] --- maven-enforcer-plugin:1.3.1:enforce (dist-enforce) @ hadoop-hdfs-project ---
[INFO] 
[INFO] --- maven-site-plugin:3.4:attach-descriptor (attach-descriptor) @ hadoop-hdfs-project
---
[INFO] 
[INFO] --- maven-javadoc-plugin:2.8.1:jar (module-javadocs) @ hadoop-hdfs-project ---
[INFO] Skipping javadoc generation
[INFO] 
[INFO] --- maven-enforcer-plugin:1.3.1:enforce (depcheck) @ hadoop-hdfs-project ---
[INFO] 
[INFO] --- maven-checkstyle-plugin:2.15:checkstyle (default-cli) @ hadoop-hdfs-project ---
[INFO] 
[INFO] --- findbugs-maven-plugin:3.0.0:findbugs (default-cli) @ hadoop-hdfs-project ---
[INFO] ------------------------------------------------------------------------
[INFO] Reactor Summary:
[INFO] 
[INFO] Apache Hadoop HDFS Client ......................... SUCCESS [03:14 min]
[INFO] Apache Hadoop HDFS ................................ FAILURE [  03:06 h]
[INFO] Apache Hadoop HttpFS .............................. SKIPPED
[INFO] Apache Hadoop HDFS BookKeeper Journal ............. SKIPPED
[INFO] Apache Hadoop HDFS-NFS ............................ SKIPPED
[INFO] Apache Hadoop HDFS Project ........................ SUCCESS [  0.059 s]
[INFO] ------------------------------------------------------------------------
[INFO] BUILD FAILURE
[INFO] ------------------------------------------------------------------------
[INFO] Total time: 03:09 h
[INFO] Finished at: 2015-09-08T03:58:12+00:00
[INFO] Final Memory: 56M/637M
[INFO] ------------------------------------------------------------------------
[ERROR] Failed to execute goal org.apache.maven.plugins:maven-surefire-plugin:2.17:test (default-test)
on project hadoop-hdfs: There are test failures.
[ERROR] 
[ERROR] Please refer to /home/jenkins/jenkins-slave/workspace/Hadoop-Hdfs-trunk/hadoop-hdfs-project/hadoop-hdfs/target/surefire-reports
for the individual test results.
[ERROR] -> [Help 1]
[ERROR] 
[ERROR] To see the full stack trace of the errors, re-run Maven with the -e switch.
[ERROR] Re-run Maven using the -X switch to enable full debug logging.
[ERROR] 
[ERROR] For more information about the errors and possible solutions, please read the following
articles:
[ERROR] [Help 1] http://cwiki.apache.org/confluence/display/MAVEN/MojoFailureException
[ERROR] 
[ERROR] After correcting the problems, you can resume the build with the command
[ERROR]   mvn <goals> -rf :hadoop-hdfs
Build step 'Execute shell' marked build as failure
Archiving artifacts
Sending artifact delta relative to Hadoop-Hdfs-trunk #2277
Archived 1 artifacts
Archive block size is 32768
Received 0 blocks and 4550640 bytes
Compression is 0.0%
Took 2.1 sec
Recording test results
Updating YARN-2019
Sending e-mails to: hdfs-dev@hadoop.apache.org
Email was triggered for: Failure
Sending email for trigger: Failure



###################################################################################
############################## FAILED TESTS (if any) ##############################
15 tests failed.
REGRESSION:  org.apache.hadoop.cli.TestAclCLI.testAll

Error Message:
org.apache.hadoop.cli.util.CLICommand.getExecutor(Ljava/lang/String;Lorg/apache/hadoop/conf/Configuration;)Lorg/apache/hadoop/cli/util/CommandExecutor;

Stack Trace:
java.lang.NoSuchMethodError: org.apache.hadoop.cli.util.CLICommand.getExecutor(Ljava/lang/String;Lorg/apache/hadoop/conf/Configuration;)Lorg/apache/hadoop/cli/util/CommandExecutor;
	at org.apache.hadoop.cli.TestAclCLI.execute(TestAclCLI.java:76)


REGRESSION:  org.apache.hadoop.cli.TestAclCLI.testAll

Error Message:
One of the tests failed. See the Detailed results to identify the command that failed

Stack Trace:
java.lang.AssertionError: One of the tests failed. See the Detailed results to identify the
command that failed
	at org.junit.Assert.fail(Assert.java:88)
	at org.junit.Assert.assertTrue(Assert.java:41)
	at org.apache.hadoop.cli.CLITestHelper.displayResults(CLITestHelper.java:263)
	at org.apache.hadoop.cli.CLITestHelper.tearDown(CLITestHelper.java:125)
	at org.apache.hadoop.cli.TestAclCLI.tearDown(TestAclCLI.java:49)


REGRESSION:  org.apache.hadoop.cli.TestCacheAdminCLI.testAll

Error Message:
org.apache.hadoop.cli.util.CLICommand.getExecutor(Ljava/lang/String;Lorg/apache/hadoop/conf/Configuration;)Lorg/apache/hadoop/cli/util/CommandExecutor;

Stack Trace:
java.lang.NoSuchMethodError: org.apache.hadoop.cli.util.CLICommand.getExecutor(Ljava/lang/String;Lorg/apache/hadoop/conf/Configuration;)Lorg/apache/hadoop/cli/util/CommandExecutor;
	at org.apache.hadoop.cli.TestCacheAdminCLI.execute(TestCacheAdminCLI.java:134)


REGRESSION:  org.apache.hadoop.cli.TestCacheAdminCLI.testAll

Error Message:
One of the tests failed. See the Detailed results to identify the command that failed

Stack Trace:
java.lang.AssertionError: One of the tests failed. See the Detailed results to identify the
command that failed
	at org.junit.Assert.fail(Assert.java:88)
	at org.junit.Assert.assertTrue(Assert.java:41)
	at org.apache.hadoop.cli.CLITestHelper.displayResults(CLITestHelper.java:263)
	at org.apache.hadoop.cli.CLITestHelper.tearDown(CLITestHelper.java:125)
	at org.apache.hadoop.cli.TestCacheAdminCLI.tearDown(TestCacheAdminCLI.java:84)


REGRESSION:  org.apache.hadoop.cli.TestCryptoAdminCLI.testAll

Error Message:
org.apache.hadoop.cli.util.CLICommand.getExecutor(Ljava/lang/String;Lorg/apache/hadoop/conf/Configuration;)Lorg/apache/hadoop/cli/util/CommandExecutor;

Stack Trace:
java.lang.NoSuchMethodError: org.apache.hadoop.cli.util.CLICommand.getExecutor(Ljava/lang/String;Lorg/apache/hadoop/conf/Configuration;)Lorg/apache/hadoop/cli/util/CommandExecutor;
	at org.apache.hadoop.cli.TestCryptoAdminCLI.execute(TestCryptoAdminCLI.java:163)


REGRESSION:  org.apache.hadoop.cli.TestCryptoAdminCLI.testAll

Error Message:
One of the tests failed. See the Detailed results to identify the command that failed

Stack Trace:
java.lang.AssertionError: One of the tests failed. See the Detailed results to identify the
command that failed
	at org.junit.Assert.fail(Assert.java:88)
	at org.junit.Assert.assertTrue(Assert.java:41)
	at org.apache.hadoop.cli.CLITestHelper.displayResults(CLITestHelper.java:263)
	at org.apache.hadoop.cli.CLITestHelper.tearDown(CLITestHelper.java:125)
	at org.apache.hadoop.cli.TestCryptoAdminCLI.tearDown(TestCryptoAdminCLI.java:94)


REGRESSION:  org.apache.hadoop.cli.TestDeleteCLI.testAll

Error Message:
org.apache.hadoop.cli.util.CLICommand.getExecutor(Ljava/lang/String;Lorg/apache/hadoop/conf/Configuration;)Lorg/apache/hadoop/cli/util/CommandExecutor;

Stack Trace:
java.lang.NoSuchMethodError: org.apache.hadoop.cli.util.CLICommand.getExecutor(Ljava/lang/String;Lorg/apache/hadoop/conf/Configuration;)Lorg/apache/hadoop/cli/util/CommandExecutor;
	at org.apache.hadoop.cli.TestDeleteCLI.execute(TestDeleteCLI.java:84)


REGRESSION:  org.apache.hadoop.cli.TestDeleteCLI.testAll

Error Message:
One of the tests failed. See the Detailed results to identify the command that failed

Stack Trace:
java.lang.AssertionError: One of the tests failed. See the Detailed results to identify the
command that failed
	at org.junit.Assert.fail(Assert.java:88)
	at org.junit.Assert.assertTrue(Assert.java:41)
	at org.apache.hadoop.cli.CLITestHelper.displayResults(CLITestHelper.java:263)
	at org.apache.hadoop.cli.CLITestHelper.tearDown(CLITestHelper.java:125)
	at org.apache.hadoop.cli.TestDeleteCLI.tearDown(TestDeleteCLI.java:66)


REGRESSION:  org.apache.hadoop.cli.TestHDFSCLI.testAll

Error Message:
org.apache.hadoop.cli.util.CLICommand.getExecutor(Ljava/lang/String;Lorg/apache/hadoop/conf/Configuration;)Lorg/apache/hadoop/cli/util/CommandExecutor;

Stack Trace:
java.lang.NoSuchMethodError: org.apache.hadoop.cli.util.CLICommand.getExecutor(Ljava/lang/String;Lorg/apache/hadoop/conf/Configuration;)Lorg/apache/hadoop/cli/util/CommandExecutor;
	at org.apache.hadoop.cli.TestHDFSCLI.execute(TestHDFSCLI.java:98)


REGRESSION:  org.apache.hadoop.cli.TestHDFSCLI.testAll

Error Message:
One of the tests failed. See the Detailed results to identify the command that failed

Stack Trace:
java.lang.AssertionError: One of the tests failed. See the Detailed results to identify the
command that failed
	at org.junit.Assert.fail(Assert.java:88)
	at org.junit.Assert.assertTrue(Assert.java:41)
	at org.apache.hadoop.cli.CLITestHelper.displayResults(CLITestHelper.java:263)
	at org.apache.hadoop.cli.CLITestHelper.tearDown(CLITestHelper.java:125)
	at org.apache.hadoop.cli.TestHDFSCLI.tearDown(TestHDFSCLI.java:85)


REGRESSION:  org.apache.hadoop.cli.TestXAttrCLI.testAll

Error Message:
org.apache.hadoop.cli.util.CLICommand.getExecutor(Ljava/lang/String;Lorg/apache/hadoop/conf/Configuration;)Lorg/apache/hadoop/cli/util/CommandExecutor;

Stack Trace:
java.lang.NoSuchMethodError: org.apache.hadoop.cli.util.CLICommand.getExecutor(Ljava/lang/String;Lorg/apache/hadoop/conf/Configuration;)Lorg/apache/hadoop/cli/util/CommandExecutor;
	at org.apache.hadoop.cli.TestXAttrCLI.execute(TestXAttrCLI.java:90)


REGRESSION:  org.apache.hadoop.cli.TestXAttrCLI.testAll

Error Message:
One of the tests failed. See the Detailed results to identify the command that failed

Stack Trace:
java.lang.AssertionError: One of the tests failed. See the Detailed results to identify the
command that failed
	at org.junit.Assert.fail(Assert.java:88)
	at org.junit.Assert.assertTrue(Assert.java:41)
	at org.apache.hadoop.cli.CLITestHelper.displayResults(CLITestHelper.java:263)
	at org.apache.hadoop.cli.CLITestHelper.tearDown(CLITestHelper.java:125)
	at org.apache.hadoop.cli.TestXAttrCLI.tearDown(TestXAttrCLI.java:75)


REGRESSION:  org.apache.hadoop.hdfs.server.blockmanagement.TestUnderReplicatedBlocks.testSetrepIncWithUnderReplicatedBlocks

Error Message:
test timed out after 60000 milliseconds

Stack Trace:
java.lang.Exception: test timed out after 60000 milliseconds
	at java.lang.Thread.sleep(Native Method)
	at org.apache.hadoop.fs.shell.SetReplication.waitForReplication(SetReplication.java:127)
	at org.apache.hadoop.fs.shell.SetReplication.processArguments(SetReplication.java:77)
	at org.apache.hadoop.fs.shell.FsCommand.processRawArguments(FsCommand.java:119)
	at org.apache.hadoop.fs.shell.Command.run(Command.java:166)
	at org.apache.hadoop.fs.FsShell.run(FsShell.java:310)
	at org.apache.hadoop.hdfs.server.blockmanagement.TestUnderReplicatedBlocks.testSetrepIncWithUnderReplicatedBlocks(TestUnderReplicatedBlocks.java:69)


REGRESSION:  org.apache.hadoop.hdfs.server.namenode.TestFileTruncate.testTruncateWithDataNodesRestartImmediately

Error Message:
inode should complete in ~30000 ms.
Expected: is <true>
     but: was <false>

Stack Trace:
java.lang.AssertionError: inode should complete in ~30000 ms.
Expected: is <true>
     but: was <false>
	at org.hamcrest.MatcherAssert.assertThat(MatcherAssert.java:20)
	at org.junit.Assert.assertThat(Assert.java:865)
	at org.apache.hadoop.hdfs.server.namenode.TestFileTruncate.checkBlockRecovery(TestFileTruncate.java:1187)
	at org.apache.hadoop.hdfs.server.namenode.TestFileTruncate.checkBlockRecovery(TestFileTruncate.java:1171)
	at org.apache.hadoop.hdfs.server.namenode.TestFileTruncate.checkBlockRecovery(TestFileTruncate.java:1166)
	at org.apache.hadoop.hdfs.server.namenode.TestFileTruncate.testTruncateWithDataNodesRestartImmediately(TestFileTruncate.java:794)


REGRESSION:  org.apache.hadoop.hdfs.server.namenode.TestNameNodeMetricsLogger.testDisableMetricsLogger

Error Message:
Problem binding to [localhost:44035] java.net.BindException: Address already in use; For more
details see:  http://wiki.apache.org/hadoop/BindException

Stack Trace:
java.net.BindException: Problem binding to [localhost:44035] java.net.BindException: Address
already in use; For more details see:  http://wiki.apache.org/hadoop/BindException
	at sun.nio.ch.Net.bind0(Native Method)
	at sun.nio.ch.Net.bind(Net.java:444)
	at sun.nio.ch.Net.bind(Net.java:436)
	at sun.nio.ch.ServerSocketChannelImpl.bind(ServerSocketChannelImpl.java:214)
	at sun.nio.ch.ServerSocketAdaptor.bind(ServerSocketAdaptor.java:74)
	at org.apache.hadoop.ipc.Server.bind(Server.java:469)
	at org.apache.hadoop.ipc.Server$Listener.<init>(Server.java:646)
	at org.apache.hadoop.ipc.Server.<init>(Server.java:2396)
	at org.apache.hadoop.ipc.RPC$Server.<init>(RPC.java:945)
	at org.apache.hadoop.ipc.ProtobufRpcEngine$Server.<init>(ProtobufRpcEngine.java:534)
	at org.apache.hadoop.ipc.ProtobufRpcEngine.getServer(ProtobufRpcEngine.java:509)
	at org.apache.hadoop.ipc.RPC$Builder.build(RPC.java:787)
	at org.apache.hadoop.hdfs.server.namenode.NameNodeRpcServer.<init>(NameNodeRpcServer.java:348)
	at org.apache.hadoop.hdfs.server.namenode.NameNode.createRpcServer(NameNode.java:760)
	at org.apache.hadoop.hdfs.server.namenode.NameNode.initialize(NameNode.java:671)
	at org.apache.hadoop.hdfs.server.namenode.NameNode.<init>(NameNode.java:896)
	at org.apache.hadoop.hdfs.server.namenode.NameNode.<init>(NameNode.java:880)
	at org.apache.hadoop.hdfs.server.namenode.TestNameNodeMetricsLogger$TestNameNode.<init>(TestNameNodeMetricsLogger.java:142)
	at org.apache.hadoop.hdfs.server.namenode.TestNameNodeMetricsLogger.makeNameNode(TestNameNodeMetricsLogger.java:118)
	at org.apache.hadoop.hdfs.server.namenode.TestNameNodeMetricsLogger.testDisableMetricsLogger(TestNameNodeMetricsLogger.java:66)



Mime
  • Unnamed multipart/mixed (inline, None, 0 bytes)
View raw message