hadoop-hdfs-dev mailing list archives

Site index · List index
Message view « Date » · « Thread »
Top « Date » · « Thread »
From Apache Jenkins Server <jenk...@builds.apache.org>
Subject Build failed in Jenkins: Hadoop-Hdfs-trunk #2315
Date Wed, 16 Sep 2015 01:43:58 GMT
See <https://builds.apache.org/job/Hadoop-Hdfs-trunk/2315/changes>

Changes:

[xgong] YARN-4149. yarn logs -am should provide an option to fetch all the log

[cnauroth] HDFS-9082. Change the log level in WebHdfsFileSystem.initialize() from INFO to
DEBUG. Contributed by Santhosh Nayak.

[wheat9] HDFS-7986. Allow files / directories to be deleted from the NameNode UI. Contributed
by Ravi Prakash.

------------------------------------------
[...truncated 6837 lines...]
Tests run: 6, Failures: 0, Errors: 0, Skipped: 0, Time elapsed: 24.072 sec - in org.apache.hadoop.hdfs.server.datanode.TestDataNodeVolumeFailure
Running org.apache.hadoop.hdfs.server.datanode.TestFsDatasetCache
Tests run: 8, Failures: 0, Errors: 0, Skipped: 0, Time elapsed: 95.839 sec - in org.apache.hadoop.hdfs.server.datanode.TestFsDatasetCache
Running org.apache.hadoop.hdfs.server.datanode.TestDataNodeUUID
Tests run: 1, Failures: 0, Errors: 0, Skipped: 0, Time elapsed: 1.94 sec - in org.apache.hadoop.hdfs.server.datanode.TestDataNodeUUID
Running org.apache.hadoop.hdfs.server.datanode.TestBPOfferService
Tests run: 9, Failures: 0, Errors: 0, Skipped: 0, Time elapsed: 34.986 sec - in org.apache.hadoop.hdfs.server.datanode.TestBPOfferService
Running org.apache.hadoop.hdfs.server.datanode.fsdataset.impl.TestFsVolumeList
Tests run: 3, Failures: 0, Errors: 0, Skipped: 0, Time elapsed: 1.024 sec - in org.apache.hadoop.hdfs.server.datanode.fsdataset.impl.TestFsVolumeList
Running org.apache.hadoop.hdfs.server.datanode.fsdataset.impl.TestScrLazyPersistFiles
Tests run: 8, Failures: 0, Errors: 0, Skipped: 0, Time elapsed: 24.076 sec - in org.apache.hadoop.hdfs.server.datanode.fsdataset.impl.TestScrLazyPersistFiles
Running org.apache.hadoop.hdfs.server.datanode.fsdataset.impl.TestLazyPersistReplicaRecovery
Tests run: 2, Failures: 0, Errors: 0, Skipped: 0, Time elapsed: 19.596 sec - in org.apache.hadoop.hdfs.server.datanode.fsdataset.impl.TestLazyPersistReplicaRecovery
Running org.apache.hadoop.hdfs.server.datanode.fsdataset.impl.TestReplicaMap
Tests run: 3, Failures: 0, Errors: 0, Skipped: 0, Time elapsed: 0.092 sec - in org.apache.hadoop.hdfs.server.datanode.fsdataset.impl.TestReplicaMap
Running org.apache.hadoop.hdfs.server.datanode.fsdataset.impl.TestLazyPersistFiles
Tests run: 7, Failures: 0, Errors: 0, Skipped: 0, Time elapsed: 112.813 sec - in org.apache.hadoop.hdfs.server.datanode.fsdataset.impl.TestLazyPersistFiles
Running org.apache.hadoop.hdfs.server.datanode.fsdataset.impl.TestWriteToReplica
Tests run: 5, Failures: 0, Errors: 0, Skipped: 0, Time elapsed: 8.072 sec - in org.apache.hadoop.hdfs.server.datanode.fsdataset.impl.TestWriteToReplica
Running org.apache.hadoop.hdfs.server.datanode.fsdataset.impl.TestLazyPersistPolicy
Tests run: 4, Failures: 0, Errors: 0, Skipped: 0, Time elapsed: 11.145 sec - in org.apache.hadoop.hdfs.server.datanode.fsdataset.impl.TestLazyPersistPolicy
Running org.apache.hadoop.hdfs.server.datanode.fsdataset.impl.TestLazyPersistReplicaPlacement
Tests run: 7, Failures: 1, Errors: 0, Skipped: 0, Time elapsed: 27.158 sec <<< FAILURE!
- in org.apache.hadoop.hdfs.server.datanode.fsdataset.impl.TestLazyPersistReplicaPlacement
testSynchronousEviction(org.apache.hadoop.hdfs.server.datanode.fsdataset.impl.TestLazyPersistReplicaPlacement)
 Time elapsed: 5.144 sec  <<< FAILURE!
java.lang.AssertionError: expected:<1> but was:<0>
	at org.junit.Assert.fail(Assert.java:88)
	at org.junit.Assert.failNotEquals(Assert.java:743)
	at org.junit.Assert.assertEquals(Assert.java:118)
	at org.junit.Assert.assertEquals(Assert.java:555)
	at org.junit.Assert.assertEquals(Assert.java:542)
	at org.apache.hadoop.hdfs.server.datanode.fsdataset.impl.LazyPersistTestCase.verifyRamDiskJMXMetric(LazyPersistTestCase.java:483)
	at org.apache.hadoop.hdfs.server.datanode.fsdataset.impl.TestLazyPersistReplicaPlacement.testSynchronousEviction(TestLazyPersistReplicaPlacement.java:92)

Running org.apache.hadoop.hdfs.server.datanode.fsdataset.impl.TestDatanodeRestart
Tests run: 1, Failures: 0, Errors: 0, Skipped: 0, Time elapsed: 5.628 sec - in org.apache.hadoop.hdfs.server.datanode.fsdataset.impl.TestDatanodeRestart
Running org.apache.hadoop.hdfs.server.datanode.fsdataset.impl.TestInterDatanodeProtocol
Tests run: 5, Failures: 0, Errors: 0, Skipped: 0, Time elapsed: 7.922 sec - in org.apache.hadoop.hdfs.server.datanode.fsdataset.impl.TestInterDatanodeProtocol
Running org.apache.hadoop.hdfs.server.datanode.fsdataset.impl.TestLazyPersistLockedMemory
Tests run: 6, Failures: 1, Errors: 0, Skipped: 0, Time elapsed: 17.965 sec <<< FAILURE!
- in org.apache.hadoop.hdfs.server.datanode.fsdataset.impl.TestLazyPersistLockedMemory
testReleaseOnEviction(org.apache.hadoop.hdfs.server.datanode.fsdataset.impl.TestLazyPersistLockedMemory)
 Time elapsed: 1.842 sec  <<< FAILURE!
java.lang.AssertionError: expected:<1> but was:<0>
	at org.junit.Assert.fail(Assert.java:88)
	at org.junit.Assert.failNotEquals(Assert.java:743)
	at org.junit.Assert.assertEquals(Assert.java:118)
	at org.junit.Assert.assertEquals(Assert.java:555)
	at org.junit.Assert.assertEquals(Assert.java:542)
	at org.apache.hadoop.hdfs.server.datanode.fsdataset.impl.LazyPersistTestCase.verifyRamDiskJMXMetric(LazyPersistTestCase.java:483)
	at org.apache.hadoop.hdfs.server.datanode.fsdataset.impl.TestLazyPersistLockedMemory.testReleaseOnEviction(TestLazyPersistLockedMemory.java:122)

Running org.apache.hadoop.hdfs.server.datanode.fsdataset.impl.TestRbwSpaceReservation
Tests run: 7, Failures: 0, Errors: 0, Skipped: 0, Time elapsed: 71.004 sec - in org.apache.hadoop.hdfs.server.datanode.fsdataset.impl.TestRbwSpaceReservation
Running org.apache.hadoop.hdfs.server.datanode.fsdataset.impl.TestFsDatasetImpl
Tests run: 7, Failures: 0, Errors: 0, Skipped: 0, Time elapsed: 7.135 sec - in org.apache.hadoop.hdfs.server.datanode.fsdataset.impl.TestFsDatasetImpl
Running org.apache.hadoop.hdfs.server.datanode.fsdataset.impl.TestLazyWriter
Tests run: 7, Failures: 0, Errors: 0, Skipped: 0, Time elapsed: 103.708 sec - in org.apache.hadoop.hdfs.server.datanode.fsdataset.impl.TestLazyWriter
Running org.apache.hadoop.hdfs.server.datanode.fsdataset.TestRoundRobinVolumeChoosingPolicy
Tests run: 2, Failures: 0, Errors: 0, Skipped: 0, Time elapsed: 0.374 sec - in org.apache.hadoop.hdfs.server.datanode.fsdataset.TestRoundRobinVolumeChoosingPolicy
Running org.apache.hadoop.hdfs.server.datanode.fsdataset.TestAvailableSpaceVolumeChoosingPolicy
Tests run: 11, Failures: 0, Errors: 0, Skipped: 0, Time elapsed: 9.945 sec - in org.apache.hadoop.hdfs.server.datanode.fsdataset.TestAvailableSpaceVolumeChoosingPolicy
Running org.apache.hadoop.hdfs.server.datanode.TestDataNodeECN
Tests run: 1, Failures: 0, Errors: 0, Skipped: 0, Time elapsed: 4.118 sec - in org.apache.hadoop.hdfs.server.datanode.TestDataNodeECN
Running org.apache.hadoop.hdfs.server.datanode.TestBlockHasMultipleReplicasOnSameDN
Tests run: 1, Failures: 0, Errors: 0, Skipped: 0, Time elapsed: 4.527 sec - in org.apache.hadoop.hdfs.server.datanode.TestBlockHasMultipleReplicasOnSameDN
Running org.apache.hadoop.hdfs.server.datanode.extdataset.TestExternalDataset
Tests run: 4, Failures: 0, Errors: 0, Skipped: 0, Time elapsed: 0.142 sec - in org.apache.hadoop.hdfs.server.datanode.extdataset.TestExternalDataset
Running org.apache.hadoop.hdfs.server.datanode.TestDataNodeMetrics
Tests run: 7, Failures: 0, Errors: 0, Skipped: 0, Time elapsed: 41.611 sec - in org.apache.hadoop.hdfs.server.datanode.TestDataNodeMetrics
Running org.apache.hadoop.hdfs.server.datanode.TestTriggerBlockReport
Tests run: 2, Failures: 0, Errors: 0, Skipped: 0, Time elapsed: 6.184 sec - in org.apache.hadoop.hdfs.server.datanode.TestTriggerBlockReport
Running org.apache.hadoop.hdfs.server.datanode.TestIncrementalBrVariations
Tests run: 4, Failures: 0, Errors: 0, Skipped: 0, Time elapsed: 12.575 sec - in org.apache.hadoop.hdfs.server.datanode.TestIncrementalBrVariations
Running org.apache.hadoop.hdfs.server.datanode.TestSimulatedFSDataset
Tests run: 9, Failures: 0, Errors: 0, Skipped: 0, Time elapsed: 1.264 sec - in org.apache.hadoop.hdfs.server.datanode.TestSimulatedFSDataset
Running org.apache.hadoop.hdfs.server.datanode.TestHSync
Tests run: 5, Failures: 0, Errors: 0, Skipped: 0, Time elapsed: 9.216 sec - in org.apache.hadoop.hdfs.server.datanode.TestHSync
Running org.apache.hadoop.hdfs.server.datanode.TestDataNodeRollingUpgrade
Tests run: 6, Failures: 0, Errors: 0, Skipped: 0, Time elapsed: 119.323 sec - in org.apache.hadoop.hdfs.server.datanode.TestDataNodeRollingUpgrade
Running org.apache.hadoop.hdfs.server.datanode.TestIncrementalBlockReports
Tests run: 3, Failures: 0, Errors: 0, Skipped: 0, Time elapsed: 14.107 sec - in org.apache.hadoop.hdfs.server.datanode.TestIncrementalBlockReports
Running org.apache.hadoop.hdfs.server.datanode.TestDnRespectsBlockReportSplitThreshold
Tests run: 3, Failures: 0, Errors: 0, Skipped: 0, Time elapsed: 6.929 sec - in org.apache.hadoop.hdfs.server.datanode.TestDnRespectsBlockReportSplitThreshold
Running org.apache.hadoop.hdfs.server.datanode.TestDataNodeVolumeFailureReporting
Tests run: 4, Failures: 0, Errors: 0, Skipped: 0, Time elapsed: 80.125 sec - in org.apache.hadoop.hdfs.server.datanode.TestDataNodeVolumeFailureReporting
Running org.apache.hadoop.hdfs.server.datanode.TestDataNodeMXBean
Tests run: 1, Failures: 0, Errors: 0, Skipped: 0, Time elapsed: 4.052 sec - in org.apache.hadoop.hdfs.server.datanode.TestDataNodeMXBean
Running org.apache.hadoop.hdfs.server.namenode.TestNameNodeRespectsBindHostKeys
Tests run: 4, Failures: 0, Errors: 0, Skipped: 0, Time elapsed: 8.23 sec - in org.apache.hadoop.hdfs.server.namenode.TestNameNodeRespectsBindHostKeys
Running org.apache.hadoop.hdfs.server.namenode.TestFileJournalManager
Tests run: 14, Failures: 0, Errors: 0, Skipped: 0, Time elapsed: 2.706 sec - in org.apache.hadoop.hdfs.server.namenode.TestFileJournalManager
Running org.apache.hadoop.hdfs.server.namenode.TestProcessCorruptBlocks
Tests run: 4, Failures: 0, Errors: 0, Skipped: 0, Time elapsed: 23.615 sec - in org.apache.hadoop.hdfs.server.namenode.TestProcessCorruptBlocks
Running org.apache.hadoop.hdfs.server.namenode.TestHostsFiles
Tests run: 2, Failures: 0, Errors: 0, Skipped: 0, Time elapsed: 11.755 sec - in org.apache.hadoop.hdfs.server.namenode.TestHostsFiles
Running org.apache.hadoop.hdfs.server.namenode.TestMetaSave
Tests run: 3, Failures: 0, Errors: 0, Skipped: 0, Time elapsed: 35.03 sec - in org.apache.hadoop.hdfs.server.namenode.TestMetaSave
Running org.apache.hadoop.hdfs.server.namenode.TestAllowFormat
Tests run: 2, Failures: 0, Errors: 0, Skipped: 0, Time elapsed: 4.359 sec - in org.apache.hadoop.hdfs.server.namenode.TestAllowFormat
Running org.apache.hadoop.hdfs.server.namenode.web.resources.TestWebHdfsDataLocality
Tests run: 3, Failures: 0, Errors: 0, Skipped: 0, Time elapsed: 7.758 sec - in org.apache.hadoop.hdfs.server.namenode.web.resources.TestWebHdfsDataLocality
Running org.apache.hadoop.hdfs.server.namenode.TestNameNodeAcl
Tests run: 64, Failures: 0, Errors: 0, Skipped: 0, Time elapsed: 23.519 sec - in org.apache.hadoop.hdfs.server.namenode.TestNameNodeAcl
Running org.apache.hadoop.hdfs.server.namenode.TestXAttrConfigFlag
Tests run: 5, Failures: 0, Errors: 0, Skipped: 0, Time elapsed: 9.678 sec - in org.apache.hadoop.hdfs.server.namenode.TestXAttrConfigFlag
Running org.apache.hadoop.hdfs.server.namenode.TestNameNodeRecovery
Tests run: 11, Failures: 0, Errors: 0, Skipped: 0, Time elapsed: 17.489 sec - in org.apache.hadoop.hdfs.server.namenode.TestNameNodeRecovery
Running org.apache.hadoop.hdfs.server.namenode.TestNameNodeRpcServer
Tests run: 1, Failures: 0, Errors: 0, Skipped: 0, Time elapsed: 4.076 sec - in org.apache.hadoop.hdfs.server.namenode.TestNameNodeRpcServer
Running org.apache.hadoop.hdfs.server.namenode.TestFileContextAcl
Tests run: 64, Failures: 0, Errors: 0, Skipped: 0, Time elapsed: 23.512 sec - in org.apache.hadoop.hdfs.server.namenode.TestFileContextAcl
Running org.apache.hadoop.hdfs.server.namenode.TestFsckWithMultipleNameNodes
Tests run: 1, Failures: 0, Errors: 0, Skipped: 0, Time elapsed: 6.064 sec - in org.apache.hadoop.hdfs.server.namenode.TestFsckWithMultipleNameNodes
Running org.apache.hadoop.hdfs.server.namenode.TestMalformedURLs
Tests run: 1, Failures: 0, Errors: 0, Skipped: 0, Time elapsed: 4.074 sec - in org.apache.hadoop.hdfs.server.namenode.TestMalformedURLs
Running org.apache.hadoop.hdfs.server.namenode.TestNameNodeHttpServer
Tests run: 3, Failures: 0, Errors: 0, Skipped: 0, Time elapsed: 2.459 sec - in org.apache.hadoop.hdfs.server.namenode.TestNameNodeHttpServer
Running org.apache.hadoop.hdfs.server.namenode.TestNameNodeOptionParsing
Tests run: 2, Failures: 0, Errors: 0, Skipped: 0, Time elapsed: 0.317 sec - in org.apache.hadoop.hdfs.server.namenode.TestNameNodeOptionParsing
Running org.apache.hadoop.hdfs.server.namenode.TestLeaseManager
Tests run: 3, Failures: 0, Errors: 0, Skipped: 0, Time elapsed: 0.688 sec - in org.apache.hadoop.hdfs.server.namenode.TestLeaseManager
Running org.apache.hadoop.hdfs.server.namenode.TestDeduplicationMap
Tests run: 1, Failures: 0, Errors: 0, Skipped: 0, Time elapsed: 0.09 sec - in org.apache.hadoop.hdfs.server.namenode.TestDeduplicationMap
Running org.apache.hadoop.hdfs.server.namenode.TestSnapshotPathINodes
Tests run: 6, Failures: 0, Errors: 0, Skipped: 0, Time elapsed: 5.589 sec - in org.apache.hadoop.hdfs.server.namenode.TestSnapshotPathINodes
Running org.apache.hadoop.hdfs.server.namenode.TestPathComponents
Tests run: 1, Failures: 0, Errors: 0, Skipped: 0, Time elapsed: 0.247 sec - in org.apache.hadoop.hdfs.server.namenode.TestPathComponents
Running org.apache.hadoop.hdfs.server.namenode.TestINodeFile
Tests run: 26, Failures: 0, Errors: 0, Skipped: 0, Time elapsed: 43.249 sec - in org.apache.hadoop.hdfs.server.namenode.TestINodeFile
Running org.apache.hadoop.hdfs.server.namenode.ha.TestPipelinesFailover
Tests run: 8, Failures: 0, Errors: 0, Skipped: 0, Time elapsed: 95.174 sec - in org.apache.hadoop.hdfs.server.namenode.ha.TestPipelinesFailover
Running org.apache.hadoop.hdfs.server.namenode.ha.TestBootstrapStandbyWithQJM
Tests run: 5, Failures: 0, Errors: 0, Skipped: 0, Time elapsed: 16.371 sec - in org.apache.hadoop.hdfs.server.namenode.ha.TestBootstrapStandbyWithQJM
Running org.apache.hadoop.hdfs.server.namenode.ha.TestEditLogsDuringFailover
Tests run: 3, Failures: 0, Errors: 0, Skipped: 0, Time elapsed: 6.995 sec - in org.apache.hadoop.hdfs.server.namenode.ha.TestEditLogsDuringFailover
Running org.apache.hadoop.hdfs.server.namenode.ha.TestBootstrapStandby
Tests run: 5, Failures: 0, Errors: 0, Skipped: 0, Time elapsed: 10.542 sec - in org.apache.hadoop.hdfs.server.namenode.ha.TestBootstrapStandby
Running org.apache.hadoop.hdfs.server.namenode.ha.TestDFSUpgradeWithHA
Tests run: 9, Failures: 0, Errors: 0, Skipped: 0, Time elapsed: 20.931 sec - in org.apache.hadoop.hdfs.server.namenode.ha.TestDFSUpgradeWithHA
Running org.apache.hadoop.hdfs.server.namenode.ha.TestLossyRetryInvocationHandler
Tests run: 1, Failures: 0, Errors: 0, Skipped: 0, Time elapsed: 4.255 sec - in org.apache.hadoop.hdfs.server.namenode.ha.TestLossyRetryInvocationHandler
Running org.apache.hadoop.hdfs.server.namenode.ha.TestPendingCorruptDnMessages
Tests run: 1, Failures: 0, Errors: 0, Skipped: 0, Time elapsed: 13.621 sec - in org.apache.hadoop.hdfs.server.namenode.ha.TestPendingCorruptDnMessages
Running org.apache.hadoop.hdfs.server.namenode.ha.TestStandbyIsHot
Tests run: 2, Failures: 0, Errors: 0, Skipped: 0, Time elapsed: 17.597 sec - in org.apache.hadoop.hdfs.server.namenode.ha.TestStandbyIsHot
Running org.apache.hadoop.hdfs.server.namenode.ha.TestQuotasWithHA
Tests run: 1, Failures: 0, Errors: 0, Skipped: 0, Time elapsed: 7.832 sec - in org.apache.hadoop.hdfs.server.namenode.ha.TestQuotasWithHA
Running org.apache.hadoop.hdfs.server.namenode.ha.TestHASafeMode
Tests run: 18, Failures: 0, Errors: 0, Skipped: 0, Time elapsed: 75.093 sec - in org.apache.hadoop.hdfs.server.namenode.ha.TestHASafeMode
Running org.apache.hadoop.hdfs.server.namenode.ha.TestXAttrsWithHA
Tests run: 1, Failures: 0, Errors: 0, Skipped: 0, Time elapsed: 5.54 sec - in org.apache.hadoop.hdfs.server.namenode.ha.TestXAttrsWithHA
Running org.apache.hadoop.hdfs.server.namenode.ha.TestStandbyCheckpoints

Results :

Failed tests: 
  TestLazyPersistReplicaPlacement.testSynchronousEviction:92->LazyPersistTestCase.verifyRamDiskJMXMetric:483
expected:<1> but was:<0>
  TestLazyPersistLockedMemory.testReleaseOnEviction:122->LazyPersistTestCase.verifyRamDiskJMXMetric:483
expected:<1> but was:<0>

Tests in error: 
  TestConnCache.testReadFromOneDN:96 ยป IO Timed out waiting for Mini HDFS Cluste...
  TestSecureNNWithQJM.init:92 NoClassDefFound org/apache/hadoop/fs/LocalFileSyst...

Tests run: 1897, Failures: 2, Errors: 2, Skipped: 6

[INFO]                                                                         
[INFO] ------------------------------------------------------------------------
[INFO] Skipping Apache Hadoop HttpFS
[INFO] This project has been banned from the build due to previous failures.
[INFO] ------------------------------------------------------------------------
[INFO]                                                                         
[INFO] ------------------------------------------------------------------------
[INFO] Skipping Apache Hadoop HDFS BookKeeper Journal
[INFO] This project has been banned from the build due to previous failures.
[INFO] ------------------------------------------------------------------------
[INFO]                                                                         
[INFO] ------------------------------------------------------------------------
[INFO] Skipping Apache Hadoop HDFS-NFS
[INFO] This project has been banned from the build due to previous failures.
[INFO] ------------------------------------------------------------------------
[INFO]                                                                         
[INFO] ------------------------------------------------------------------------
[INFO] Building Apache Hadoop HDFS Project 3.0.0-SNAPSHOT
[INFO] ------------------------------------------------------------------------
[INFO] 
[INFO] --- maven-clean-plugin:2.5:clean (default-clean) @ hadoop-hdfs-project ---
[INFO] Deleting <https://builds.apache.org/job/Hadoop-Hdfs-trunk/ws/hadoop-hdfs-project/target>
[INFO] 
[INFO] --- maven-antrun-plugin:1.7:run (create-testdirs) @ hadoop-hdfs-project ---
[INFO] Executing tasks

main:
    [mkdir] Created dir: <https://builds.apache.org/job/Hadoop-Hdfs-trunk/ws/hadoop-hdfs-project/target/test-dir>
[INFO] Executed tasks
[INFO] 
[INFO] --- maven-source-plugin:2.3:jar-no-fork (hadoop-java-sources) @ hadoop-hdfs-project
---
[INFO] 
[INFO] --- maven-source-plugin:2.3:test-jar-no-fork (hadoop-java-sources) @ hadoop-hdfs-project
---
[INFO] 
[INFO] --- maven-enforcer-plugin:1.3.1:enforce (dist-enforce) @ hadoop-hdfs-project ---
[INFO] 
[INFO] --- maven-site-plugin:3.4:attach-descriptor (attach-descriptor) @ hadoop-hdfs-project
---
[INFO] 
[INFO] --- maven-javadoc-plugin:2.8.1:jar (module-javadocs) @ hadoop-hdfs-project ---
[INFO] Skipping javadoc generation
[INFO] 
[INFO] --- maven-enforcer-plugin:1.3.1:enforce (depcheck) @ hadoop-hdfs-project ---
[INFO] 
[INFO] --- maven-checkstyle-plugin:2.15:checkstyle (default-cli) @ hadoop-hdfs-project ---
[INFO] 
[INFO] --- findbugs-maven-plugin:3.0.0:findbugs (default-cli) @ hadoop-hdfs-project ---
[INFO] ------------------------------------------------------------------------
[INFO] Reactor Summary:
[INFO] 
[INFO] Apache Hadoop HDFS Client ......................... SUCCESS [03:22 min]
[INFO] Apache Hadoop HDFS ................................ FAILURE [  01:31 h]
[INFO] Apache Hadoop HttpFS .............................. SKIPPED
[INFO] Apache Hadoop HDFS BookKeeper Journal ............. SKIPPED
[INFO] Apache Hadoop HDFS-NFS ............................ SKIPPED
[INFO] Apache Hadoop HDFS Project ........................ SUCCESS [  0.059 s]
[INFO] ------------------------------------------------------------------------
[INFO] BUILD FAILURE
[INFO] ------------------------------------------------------------------------
[INFO] Total time: 01:34 h
[INFO] Finished at: 2015-09-16T01:43:51+00:00
[INFO] Final Memory: 70M/986M
[INFO] ------------------------------------------------------------------------
[ERROR] Failed to execute goal org.apache.maven.plugins:maven-surefire-plugin:2.17:test (default-test)
on project hadoop-hdfs: ExecutionException: java.lang.RuntimeException: The forked VM terminated
without properly saying goodbye. VM crash or System.exit called?
[ERROR] Command was /bin/sh -c cd <https://builds.apache.org/job/Hadoop-Hdfs-trunk/ws/hadoop-hdfs-project/hadoop-hdfs>
&& /home/jenkins/tools/java/jdk1.7.0_55/jre/bin/java -Xmx4096m -XX:MaxPermSize=768m
-XX:+HeapDumpOnOutOfMemoryError -jar <https://builds.apache.org/job/Hadoop-Hdfs-trunk/ws/hadoop-hdfs-project/hadoop-hdfs/target/surefire/surefirebooter5522113362513410434.jar>
<https://builds.apache.org/job/Hadoop-Hdfs-trunk/ws/hadoop-hdfs-project/hadoop-hdfs/target/surefire/surefire8084078568800431460tmp>
<https://builds.apache.org/job/Hadoop-Hdfs-trunk/ws/hadoop-hdfs-project/hadoop-hdfs/target/surefire/surefire_1172673444125146134480tmp>
[ERROR] -> [Help 1]
[ERROR] 
[ERROR] To see the full stack trace of the errors, re-run Maven with the -e switch.
[ERROR] Re-run Maven using the -X switch to enable full debug logging.
[ERROR] 
[ERROR] For more information about the errors and possible solutions, please read the following
articles:
[ERROR] [Help 1] http://cwiki.apache.org/confluence/display/MAVEN/MojoFailureException
[ERROR] 
[ERROR] After correcting the problems, you can resume the build with the command
[ERROR]   mvn <goals> -rf :hadoop-hdfs
Build step 'Execute shell' marked build as failure
Archiving artifacts
Sending artifact delta relative to Hadoop-Hdfs-trunk #2295
Archived 1 artifacts
Archive block size is 32768
Received 0 blocks and 4569119 bytes
Compression is 0.0%
Took 2.3 sec
Recording test results
Updating YARN-4149
Updating HDFS-7986
Updating HDFS-9082

Mime
View raw message