hadoop-hdfs-dev mailing list archives

Site index · List index
Message view « Date » · « Thread »
Top « Date » · « Thread »
From Apache Jenkins Server <jenk...@builds.apache.org>
Subject Hadoop-Hdfs-trunk-Java8 - Build # 425 - Still Failing
Date Sun, 27 Sep 2015 10:32:52 GMT
See https://builds.apache.org/job/Hadoop-Hdfs-trunk-Java8/425/

###################################################################################
########################## LAST 60 LINES OF THE CONSOLE ###########################
[...truncated 7238 lines...]
main:
    [mkdir] Created dir: /home/jenkins/jenkins-slave/workspace/Hadoop-Hdfs-trunk-Java8/hadoop-hdfs-project/target/test-dir
[INFO] Executed tasks
[INFO] 
[INFO] --- maven-source-plugin:2.3:jar-no-fork (hadoop-java-sources) @ hadoop-hdfs-project
---
[INFO] 
[INFO] --- maven-source-plugin:2.3:test-jar-no-fork (hadoop-java-sources) @ hadoop-hdfs-project
---
[INFO] 
[INFO] --- maven-enforcer-plugin:1.3.1:enforce (dist-enforce) @ hadoop-hdfs-project ---
[INFO] 
[INFO] --- maven-site-plugin:3.4:attach-descriptor (attach-descriptor) @ hadoop-hdfs-project
---
[INFO] 
[INFO] --- maven-javadoc-plugin:2.8.1:jar (module-javadocs) @ hadoop-hdfs-project ---
[INFO] Not executing Javadoc as the project is not a Java classpath-capable package
[INFO] 
[INFO] --- maven-enforcer-plugin:1.3.1:enforce (depcheck) @ hadoop-hdfs-project ---
[INFO] 
[INFO] --- maven-checkstyle-plugin:2.15:checkstyle (default-cli) @ hadoop-hdfs-project ---
[INFO] 
[INFO] --- findbugs-maven-plugin:3.0.0:findbugs (default-cli) @ hadoop-hdfs-project ---
[INFO] ------------------------------------------------------------------------
[INFO] Reactor Summary:
[INFO] 
[INFO] Apache Hadoop HDFS Client ......................... SUCCESS [03:27 min]
[INFO] Apache Hadoop HDFS ................................ FAILURE [  01:40 h]
[INFO] Apache Hadoop HttpFS .............................. SKIPPED
[INFO] Apache Hadoop HDFS BookKeeper Journal ............. SKIPPED
[INFO] Apache Hadoop HDFS-NFS ............................ SKIPPED
[INFO] Apache Hadoop HDFS Project ........................ SUCCESS [  0.060 s]
[INFO] ------------------------------------------------------------------------
[INFO] BUILD FAILURE
[INFO] ------------------------------------------------------------------------
[INFO] Total time: 01:43 h
[INFO] Finished at: 2015-09-27T10:33:06+00:00
[INFO] Final Memory: 82M/1020M
[INFO] ------------------------------------------------------------------------
[ERROR] Failed to execute goal org.apache.maven.plugins:maven-surefire-plugin:2.17:test (default-test)
on project hadoop-hdfs: ExecutionException: org.apache.maven.surefire.booter.SurefireBooterForkException:
Error occurred in starting fork, check output in log -> [Help 1]
[ERROR] 
[ERROR] To see the full stack trace of the errors, re-run Maven with the -e switch.
[ERROR] Re-run Maven using the -X switch to enable full debug logging.
[ERROR] 
[ERROR] For more information about the errors and possible solutions, please read the following
articles:
[ERROR] [Help 1] http://cwiki.apache.org/confluence/display/MAVEN/MojoFailureException
[ERROR] 
[ERROR] After correcting the problems, you can resume the build with the command
[ERROR]   mvn <goals> -rf :hadoop-hdfs
Build step 'Execute shell' marked build as failure
Archiving artifacts
Sending artifact delta relative to Hadoop-Hdfs-trunk-Java8 #222
Archived 1 artifacts
Archive block size is 32768
Received 0 blocks and 5771356 bytes
Compression is 0.0%
Took 2.6 sec
Recording test results
Updating HADOOP-11984
Sending e-mails to: hdfs-dev@hadoop.apache.org
Email was triggered for: Failure
Sending email for trigger: Failure



###################################################################################
############################## FAILED TESTS (if any) ##############################
2 tests failed.
REGRESSION:  org.apache.hadoop.hdfs.server.namenode.TestFileTruncate.testTruncateWithDataNodesShutdownImmediately

Error Message:
inode should complete in ~30000 ms.
Expected: is <true>
     but: was <false>

Stack Trace:
java.lang.AssertionError: inode should complete in ~30000 ms.
Expected: is <true>
     but: was <false>
	at org.hamcrest.MatcherAssert.assertThat(MatcherAssert.java:20)
	at org.junit.Assert.assertThat(Assert.java:865)
	at org.apache.hadoop.hdfs.server.namenode.TestFileTruncate.checkBlockRecovery(TestFileTruncate.java:1189)
	at org.apache.hadoop.hdfs.server.namenode.TestFileTruncate.checkBlockRecovery(TestFileTruncate.java:1173)
	at org.apache.hadoop.hdfs.server.namenode.TestFileTruncate.checkBlockRecovery(TestFileTruncate.java:1168)
	at org.apache.hadoop.hdfs.server.namenode.TestFileTruncate.testTruncateWithDataNodesShutdownImmediately(TestFileTruncate.java:866)


REGRESSION:  org.apache.hadoop.hdfs.server.namenode.ha.TestHarFileSystemWithHA.testHarUriWithHaUriWithNoPort

Error Message:
org/apache/hadoop/fs/HarFileSystem$LruCache

Stack Trace:
java.lang.NoClassDefFoundError: org/apache/hadoop/fs/HarFileSystem$LruCache
	at java.net.URLClassLoader$1.run(URLClassLoader.java:372)
	at java.net.URLClassLoader$1.run(URLClassLoader.java:361)
	at java.security.AccessController.doPrivileged(Native Method)
	at java.net.URLClassLoader.findClass(URLClassLoader.java:360)
	at java.lang.ClassLoader.loadClass(ClassLoader.java:424)
	at sun.misc.Launcher$AppClassLoader.loadClass(Launcher.java:308)
	at java.lang.ClassLoader.loadClass(ClassLoader.java:357)
	at org.apache.hadoop.fs.HarFileSystem.initializeMetadataCache(HarFileSystem.java:105)
	at org.apache.hadoop.fs.HarFileSystem.initialize(HarFileSystem.java:125)
	at org.apache.hadoop.fs.FileSystem.createFileSystem(FileSystem.java:2717)
	at org.apache.hadoop.fs.FileSystem.get(FileSystem.java:372)
	at org.apache.hadoop.fs.Path.getFileSystem(Path.java:294)
	at org.apache.hadoop.hdfs.server.namenode.ha.TestHarFileSystemWithHA.testHarUriWithHaUriWithNoPort(TestHarFileSystemWithHA.java:58)



Mime
  • Unnamed multipart/mixed (inline, None, 0 bytes)
View raw message