hadoop-hdfs-dev mailing list archives

Site index · List index
Message view « Date » · « Thread »
Top « Date » · « Thread »
From Apache Jenkins Server <jenk...@builds.apache.org>
Subject Hadoop-Hdfs-trunk-Java8 - Build # 420 - Still Failing
Date Sat, 26 Sep 2015 06:50:00 GMT
See https://builds.apache.org/job/Hadoop-Hdfs-trunk-Java8/420/

###################################################################################
########################## LAST 60 LINES OF THE CONSOLE ###########################
[...truncated 5790 lines...]
[INFO] --- maven-enforcer-plugin:1.3.1:enforce (dist-enforce) @ hadoop-hdfs-project ---
[INFO] 
[INFO] --- maven-site-plugin:3.4:attach-descriptor (attach-descriptor) @ hadoop-hdfs-project
---
[INFO] 
[INFO] --- maven-javadoc-plugin:2.8.1:jar (module-javadocs) @ hadoop-hdfs-project ---
[INFO] Not executing Javadoc as the project is not a Java classpath-capable package
[INFO] 
[INFO] --- maven-enforcer-plugin:1.3.1:enforce (depcheck) @ hadoop-hdfs-project ---
[INFO] 
[INFO] --- maven-checkstyle-plugin:2.15:checkstyle (default-cli) @ hadoop-hdfs-project ---
[INFO] 
[INFO] --- findbugs-maven-plugin:3.0.0:findbugs (default-cli) @ hadoop-hdfs-project ---
[INFO] ------------------------------------------------------------------------
[INFO] Reactor Summary:
[INFO] 
[INFO] Apache Hadoop HDFS Client ......................... FAILURE [01:40 min]
[INFO] Apache Hadoop HDFS ................................ SKIPPED
[INFO] Apache Hadoop HttpFS .............................. SKIPPED
[INFO] Apache Hadoop HDFS BookKeeper Journal ............. SKIPPED
[INFO] Apache Hadoop HDFS-NFS ............................ SKIPPED
[INFO] Apache Hadoop HDFS Project ........................ SUCCESS [  0.371 s]
[INFO] ------------------------------------------------------------------------
[INFO] BUILD FAILURE
[INFO] ------------------------------------------------------------------------
[INFO] Total time: 01:41 min
[INFO] Finished at: 2015-09-26T06:50:15+00:00
[INFO] Final Memory: 56M/253M
[INFO] ------------------------------------------------------------------------
[ERROR] Failed to execute goal org.apache.maven.plugins:maven-javadoc-plugin:2.8.1:jar (module-javadocs)
on project hadoop-hdfs-client: MavenReportException: Error while creating archive:
[ERROR] Exit code: 1 - /home/jenkins/jenkins-slave/workspace/Hadoop-Hdfs-trunk-Java8/hadoop-hdfs-project/hadoop-hdfs-client/src/main/java/org/apache/hadoop/hdfs/web/URLConnectionFactory.java:36:
error: cannot access AuthenticatedURL
[ERROR] import org.apache.hadoop.security.authentication.client.AuthenticatedURL;
[ERROR] ^
[ERROR] bad class file: /home/jenkins/.m2/repository/org/apache/hadoop/hadoop-auth/3.0.0-SNAPSHOT/hadoop-auth-3.0.0-SNAPSHOT.jar(org/apache/hadoop/security/authentication/client/AuthenticatedURL.class)
[ERROR] unable to access file: corrupted zip file
[ERROR] Please remove or make sure it appears in the correct subdirectory of the classpath.
[ERROR] 
[ERROR] Command line was: /home/jenkins/tools/java/jdk1.8.0/jre/../bin/javadoc -J-Xmx512m
@options @packages
[ERROR] 
[ERROR] Refer to the generated Javadoc files in '/home/jenkins/jenkins-slave/workspace/Hadoop-Hdfs-trunk-Java8/hadoop-hdfs-project/hadoop-hdfs-client/target'
dir.
[ERROR] -> [Help 1]
[ERROR] 
[ERROR] To see the full stack trace of the errors, re-run Maven with the -e switch.
[ERROR] Re-run Maven using the -X switch to enable full debug logging.
[ERROR] 
[ERROR] For more information about the errors and possible solutions, please read the following
articles:
[ERROR] [Help 1] http://cwiki.apache.org/confluence/display/MAVEN/MojoExecutionException
Build step 'Execute shell' marked build as failure
Archiving artifacts
Sending artifact delta relative to Hadoop-Hdfs-trunk-Java8 #222
Archived 1 artifacts
Archive block size is 32768
Received 0 blocks and 5323582 bytes
Compression is 0.0%
Took 5.7 sec
Recording test results
Updating HADOOP-11918
Sending e-mails to: hdfs-dev@hadoop.apache.org
Email was triggered for: Failure
Sending email for trigger: Failure



###################################################################################
############################## FAILED TESTS (if any) ##############################
No tests ran.
Mime
  • Unnamed multipart/mixed (inline, None, 0 bytes)
View raw message