hadoop-hdfs-dev mailing list archives

Site index · List index
Message view « Date » · « Thread »
Top « Date » · « Thread »
From Apache Jenkins Server <jenk...@builds.apache.org>
Subject Hadoop-Hdfs-trunk-Java8 - Build # 327 - Still Failing
Date Thu, 03 Sep 2015 02:07:58 GMT
See https://builds.apache.org/job/Hadoop-Hdfs-trunk-Java8/327/

###################################################################################
########################## LAST 60 LINES OF THE CONSOLE ###########################
[...truncated 7966 lines...]
[INFO] --- maven-source-plugin:2.3:jar-no-fork (hadoop-java-sources) @ hadoop-hdfs-project
---
[INFO] 
[INFO] --- maven-source-plugin:2.3:test-jar-no-fork (hadoop-java-sources) @ hadoop-hdfs-project
---
[INFO] 
[INFO] --- maven-enforcer-plugin:1.3.1:enforce (dist-enforce) @ hadoop-hdfs-project ---
[INFO] 
[INFO] --- maven-site-plugin:3.4:attach-descriptor (attach-descriptor) @ hadoop-hdfs-project
---
[INFO] 
[INFO] --- maven-javadoc-plugin:2.8.1:jar (module-javadocs) @ hadoop-hdfs-project ---
[INFO] Not executing Javadoc as the project is not a Java classpath-capable package
[INFO] 
[INFO] --- maven-enforcer-plugin:1.3.1:enforce (depcheck) @ hadoop-hdfs-project ---
[INFO] 
[INFO] --- maven-checkstyle-plugin:2.15:checkstyle (default-cli) @ hadoop-hdfs-project ---
[INFO] 
[INFO] --- findbugs-maven-plugin:3.0.0:findbugs (default-cli) @ hadoop-hdfs-project ---
[INFO] ------------------------------------------------------------------------
[INFO] Reactor Summary:
[INFO] 
[INFO] Apache Hadoop HDFS Client ......................... SUCCESS [03:14 min]
[INFO] Apache Hadoop HDFS ................................ FAILURE [  02:50 h]
[INFO] Apache Hadoop HttpFS .............................. SKIPPED
[INFO] Apache Hadoop HDFS BookKeeper Journal ............. SKIPPED
[INFO] Apache Hadoop HDFS-NFS ............................ SKIPPED
[INFO] Apache Hadoop HDFS Project ........................ SUCCESS [  0.061 s]
[INFO] ------------------------------------------------------------------------
[INFO] BUILD FAILURE
[INFO] ------------------------------------------------------------------------
[INFO] Total time: 02:54 h
[INFO] Finished at: 2015-09-03T02:09:00+00:00
[INFO] Final Memory: 55M/584M
[INFO] ------------------------------------------------------------------------
[ERROR] Failed to execute goal org.apache.maven.plugins:maven-surefire-plugin:2.17:test (default-test)
on project hadoop-hdfs: There are test failures.
[ERROR] 
[ERROR] Please refer to /home/jenkins/jenkins-slave/workspace/Hadoop-Hdfs-trunk-Java8/hadoop-hdfs-project/hadoop-hdfs/target/surefire-reports
for the individual test results.
[ERROR] -> [Help 1]
[ERROR] 
[ERROR] To see the full stack trace of the errors, re-run Maven with the -e switch.
[ERROR] Re-run Maven using the -X switch to enable full debug logging.
[ERROR] 
[ERROR] For more information about the errors and possible solutions, please read the following
articles:
[ERROR] [Help 1] http://cwiki.apache.org/confluence/display/MAVEN/MojoFailureException
[ERROR] 
[ERROR] After correcting the problems, you can resume the build with the command
[ERROR]   mvn <goals> -rf :hadoop-hdfs
Build step 'Execute shell' marked build as failure
Archiving artifacts
Sending artifact delta relative to Hadoop-Hdfs-trunk-Java8 #222
Archived 1 artifacts
Archive block size is 32768
Received 0 blocks and 5277155 bytes
Compression is 0.0%
Took 3.3 sec
Recording test results
Updating HDFS-8890
Updating HDFS-9003
Sending e-mails to: hdfs-dev@hadoop.apache.org
Email was triggered for: Failure
Sending email for trigger: Failure



###################################################################################
############################## FAILED TESTS (if any) ##############################
3 tests failed.
FAILED:  org.apache.hadoop.hdfs.server.blockmanagement.TestBlockManager.testBlocksAreNotUnderreplicatedInSingleRack

Error Message:

BlockCollection$$EnhancerByMockitoWithCGLIB$$62cb02d5 cannot be returned by isRunning()
isRunning() should return boolean

Stack Trace:
org.mockito.exceptions.misusing.WrongTypeOfReturnValue: 
BlockCollection$$EnhancerByMockitoWithCGLIB$$62cb02d5 cannot be returned by isRunning()
isRunning() should return boolean
	at org.apache.hadoop.hdfs.server.blockmanagement.TestBlockManager.addBlockOnNodes(TestBlockManager.java:443)
	at org.apache.hadoop.hdfs.server.blockmanagement.TestBlockManager.doTestSingleRackClusterIsSufficientlyReplicated(TestBlockManager.java:376)
	at org.apache.hadoop.hdfs.server.blockmanagement.TestBlockManager.testBlocksAreNotUnderreplicatedInSingleRack(TestBlockManager.java:368)


FAILED:  org.apache.hadoop.hdfs.server.datanode.TestFsDatasetCache.testReCacheAfterUncache

Error Message:
org/apache/hadoop/fs/BatchedRemoteIterator

Stack Trace:
java.lang.NoClassDefFoundError: org/apache/hadoop/fs/BatchedRemoteIterator
	at java.net.URLClassLoader$1.run(URLClassLoader.java:372)
	at java.net.URLClassLoader$1.run(URLClassLoader.java:361)
	at java.security.AccessController.doPrivileged(Native Method)
	at java.net.URLClassLoader.findClass(URLClassLoader.java:360)
	at java.lang.ClassLoader.loadClass(ClassLoader.java:424)
	at sun.misc.Launcher$AppClassLoader.loadClass(Launcher.java:308)
	at java.lang.ClassLoader.loadClass(ClassLoader.java:357)
	at java.lang.ClassLoader.defineClass1(Native Method)
	at java.lang.ClassLoader.defineClass(ClassLoader.java:760)
	at java.security.SecureClassLoader.defineClass(SecureClassLoader.java:142)
	at java.net.URLClassLoader.defineClass(URLClassLoader.java:455)
	at java.net.URLClassLoader.access$100(URLClassLoader.java:73)
	at java.net.URLClassLoader$1.run(URLClassLoader.java:367)
	at java.net.URLClassLoader$1.run(URLClassLoader.java:361)
	at java.security.AccessController.doPrivileged(Native Method)
	at java.net.URLClassLoader.findClass(URLClassLoader.java:360)
	at java.lang.ClassLoader.loadClass(ClassLoader.java:424)
	at sun.misc.Launcher$AppClassLoader.loadClass(Launcher.java:308)
	at java.lang.ClassLoader.loadClass(ClassLoader.java:357)
	at org.apache.hadoop.hdfs.DFSClient.listCacheDirectives(DFSClient.java:2351)
	at org.apache.hadoop.hdfs.DistributedFileSystem.listCacheDirectives(DistributedFileSystem.java:1848)
	at org.apache.hadoop.hdfs.server.datanode.TestFsDatasetCache$8.get(TestFsDatasetCache.java:570)
	at org.apache.hadoop.hdfs.server.datanode.TestFsDatasetCache$8.get(TestFsDatasetCache.java:565)
	at org.apache.hadoop.test.GenericTestUtils.waitFor(GenericTestUtils.java:159)
	at org.apache.hadoop.hdfs.server.datanode.TestFsDatasetCache.testReCacheAfterUncache(TestFsDatasetCache.java:565)


FAILED:  org.apache.hadoop.hdfs.server.namenode.ha.TestSeveralNameNodes.testCircularLinkedListWrites

Error Message:
Some writers didn't complete in expected runtime! Current writer state:[Circular Writer:
  directory: /test-0
  target length: 50
  current item: 33
  done: false
, Circular Writer:
  directory: /test-2
  target length: 50
  current item: 36
  done: false
] expected:<0> but was:<2>

Stack Trace:
java.lang.AssertionError: Some writers didn't complete in expected runtime! Current writer
state:[Circular Writer:
	 directory: /test-0
	 target length: 50
	 current item: 33
	 done: false
, Circular Writer:
	 directory: /test-2
	 target length: 50
	 current item: 36
	 done: false
] expected:<0> but was:<2>
	at org.junit.Assert.fail(Assert.java:88)
	at org.junit.Assert.failNotEquals(Assert.java:743)
	at org.junit.Assert.assertEquals(Assert.java:118)
	at org.junit.Assert.assertEquals(Assert.java:555)
	at org.apache.hadoop.hdfs.server.namenode.ha.TestSeveralNameNodes.testCircularLinkedListWrites(TestSeveralNameNodes.java:90)



Mime
  • Unnamed multipart/mixed (inline, None, 0 bytes)
View raw message