hadoop-hdfs-dev mailing list archives

Site index · List index
Message view « Date » · « Thread »
Top « Date » · « Thread »
From Apache Jenkins Server <jenk...@builds.apache.org>
Subject Build failed in Jenkins: Hadoop-Hdfs-trunk #2226
Date Sun, 23 Aug 2015 01:43:29 GMT
See <https://builds.apache.org/job/Hadoop-Hdfs-trunk/2226/changes>

Changes:

[xgong] YARN-221. NM should provide a way for AM to tell it not to aggregate

------------------------------------------
[...truncated 3421 lines...]
Running org.apache.hadoop.hdfs.server.datanode.TestDataNodeMetrics
Tests run: 7, Failures: 0, Errors: 0, Skipped: 0, Time elapsed: 39.791 sec - in org.apache.hadoop.hdfs.server.datanode.TestDataNodeMetrics
Running org.apache.hadoop.hdfs.server.datanode.TestBpServiceActorScheduler
Tests run: 7, Failures: 0, Errors: 0, Skipped: 0, Time elapsed: 0.467 sec - in org.apache.hadoop.hdfs.server.datanode.TestBpServiceActorScheduler
Running org.apache.hadoop.hdfs.server.datanode.TestDataNodeRollingUpgrade
Tests run: 6, Failures: 0, Errors: 0, Skipped: 0, Time elapsed: 119.169 sec - in org.apache.hadoop.hdfs.server.datanode.TestDataNodeRollingUpgrade
Running org.apache.hadoop.hdfs.server.datanode.extdataset.TestExternalDataset
Tests run: 4, Failures: 0, Errors: 0, Skipped: 0, Time elapsed: 0.138 sec - in org.apache.hadoop.hdfs.server.datanode.extdataset.TestExternalDataset
Running org.apache.hadoop.hdfs.server.datanode.TestStartSecureDataNode
Tests run: 1, Failures: 0, Errors: 0, Skipped: 1, Time elapsed: 0.094 sec - in org.apache.hadoop.hdfs.server.datanode.TestStartSecureDataNode
Running org.apache.hadoop.hdfs.server.blockmanagement.TestAvailableSpaceBlockPlacementPolicy
Tests run: 2, Failures: 0, Errors: 0, Skipped: 0, Time elapsed: 3.47 sec - in org.apache.hadoop.hdfs.server.blockmanagement.TestAvailableSpaceBlockPlacementPolicy
Running org.apache.hadoop.hdfs.server.blockmanagement.TestHeartbeatHandling
Tests run: 2, Failures: 0, Errors: 0, Skipped: 0, Time elapsed: 5.03 sec - in org.apache.hadoop.hdfs.server.blockmanagement.TestHeartbeatHandling
Running org.apache.hadoop.hdfs.server.blockmanagement.TestBlockStatsMXBean
Tests run: 2, Failures: 0, Errors: 0, Skipped: 0, Time elapsed: 7.11 sec - in org.apache.hadoop.hdfs.server.blockmanagement.TestBlockStatsMXBean
Running org.apache.hadoop.hdfs.server.blockmanagement.TestNodeCount
Tests run: 1, Failures: 0, Errors: 0, Skipped: 0, Time elapsed: 15.127 sec - in org.apache.hadoop.hdfs.server.blockmanagement.TestNodeCount
Running org.apache.hadoop.hdfs.server.blockmanagement.TestHostFileManager
Tests run: 3, Failures: 0, Errors: 0, Skipped: 0, Time elapsed: 1.235 sec - in org.apache.hadoop.hdfs.server.blockmanagement.TestHostFileManager
Running org.apache.hadoop.hdfs.server.blockmanagement.TestPendingInvalidateBlock
Tests run: 2, Failures: 0, Errors: 0, Skipped: 0, Time elapsed: 30.723 sec - in org.apache.hadoop.hdfs.server.blockmanagement.TestPendingInvalidateBlock
Running org.apache.hadoop.hdfs.server.blockmanagement.TestHost2NodesMap
Tests run: 3, Failures: 0, Errors: 0, Skipped: 0, Time elapsed: 0.29 sec - in org.apache.hadoop.hdfs.server.blockmanagement.TestHost2NodesMap
Running org.apache.hadoop.hdfs.server.blockmanagement.TestBlockTokenWithDFS
Tests run: 4, Failures: 0, Errors: 0, Skipped: 0, Time elapsed: 21.124 sec - in org.apache.hadoop.hdfs.server.blockmanagement.TestBlockTokenWithDFS
Running org.apache.hadoop.hdfs.server.blockmanagement.TestNameNodePrunesMissingStorages
Tests run: 4, Failures: 0, Errors: 0, Skipped: 0, Time elapsed: 8.663 sec - in org.apache.hadoop.hdfs.server.blockmanagement.TestNameNodePrunesMissingStorages
Running org.apache.hadoop.hdfs.server.blockmanagement.TestPendingDataNodeMessages
Tests run: 1, Failures: 0, Errors: 0, Skipped: 0, Time elapsed: 0.31 sec - in org.apache.hadoop.hdfs.server.blockmanagement.TestPendingDataNodeMessages
Running org.apache.hadoop.hdfs.server.blockmanagement.TestBlockManager
Tests run: 13, Failures: 0, Errors: 0, Skipped: 0, Time elapsed: 5.444 sec - in org.apache.hadoop.hdfs.server.blockmanagement.TestBlockManager
Running org.apache.hadoop.hdfs.server.blockmanagement.TestReplicationPolicy
Tests run: 26, Failures: 0, Errors: 0, Skipped: 0, Time elapsed: 8.685 sec - in org.apache.hadoop.hdfs.server.blockmanagement.TestReplicationPolicy
Running org.apache.hadoop.hdfs.server.blockmanagement.TestCachedBlocksList
Tests run: 2, Failures: 0, Errors: 0, Skipped: 0, Time elapsed: 0.351 sec - in org.apache.hadoop.hdfs.server.blockmanagement.TestCachedBlocksList
Running org.apache.hadoop.hdfs.server.blockmanagement.TestRBWBlockInvalidation
Tests run: 2, Failures: 0, Errors: 0, Skipped: 0, Time elapsed: 14.958 sec - in org.apache.hadoop.hdfs.server.blockmanagement.TestRBWBlockInvalidation
Running org.apache.hadoop.hdfs.server.blockmanagement.TestComputeInvalidateWork
Tests run: 3, Failures: 0, Errors: 0, Skipped: 0, Time elapsed: 8.562 sec - in org.apache.hadoop.hdfs.server.blockmanagement.TestComputeInvalidateWork
Running org.apache.hadoop.hdfs.server.blockmanagement.TestBlockUnderConstructionFeature
Tests run: 1, Failures: 0, Errors: 0, Skipped: 0, Time elapsed: 0.359 sec - in org.apache.hadoop.hdfs.server.blockmanagement.TestBlockUnderConstructionFeature
Running org.apache.hadoop.hdfs.server.blockmanagement.TestUnderReplicatedBlockQueues
Tests run: 1, Failures: 0, Errors: 0, Skipped: 0, Time elapsed: 0.277 sec - in org.apache.hadoop.hdfs.server.blockmanagement.TestUnderReplicatedBlockQueues
Running org.apache.hadoop.hdfs.server.blockmanagement.TestPendingReplication
Tests run: 4, Failures: 0, Errors: 0, Skipped: 0, Time elapsed: 25.957 sec - in org.apache.hadoop.hdfs.server.blockmanagement.TestPendingReplication
Running org.apache.hadoop.hdfs.server.blockmanagement.TestCorruptReplicaInfo
Tests run: 1, Failures: 0, Errors: 0, Skipped: 0, Time elapsed: 0.366 sec - in org.apache.hadoop.hdfs.server.blockmanagement.TestCorruptReplicaInfo
Running org.apache.hadoop.hdfs.server.blockmanagement.TestBlockInfo
Tests run: 5, Failures: 0, Errors: 0, Skipped: 0, Time elapsed: 0.452 sec - in org.apache.hadoop.hdfs.server.blockmanagement.TestBlockInfo
Running org.apache.hadoop.hdfs.server.blockmanagement.TestDatanodeDescriptor
Tests run: 2, Failures: 0, Errors: 0, Skipped: 0, Time elapsed: 0.296 sec - in org.apache.hadoop.hdfs.server.blockmanagement.TestDatanodeDescriptor
Running org.apache.hadoop.hdfs.server.blockmanagement.TestUnderReplicatedBlocks
Tests run: 2, Failures: 0, Errors: 0, Skipped: 0, Time elapsed: 21.499 sec - in org.apache.hadoop.hdfs.server.blockmanagement.TestUnderReplicatedBlocks
Running org.apache.hadoop.hdfs.server.blockmanagement.TestReplicationPolicyConsiderLoad
Tests run: 1, Failures: 0, Errors: 0, Skipped: 0, Time elapsed: 2.563 sec - in org.apache.hadoop.hdfs.server.blockmanagement.TestReplicationPolicyConsiderLoad
Running org.apache.hadoop.hdfs.server.blockmanagement.TestOverReplicatedBlocks
Tests run: 3, Failures: 0, Errors: 0, Skipped: 0, Time elapsed: 26.022 sec - in org.apache.hadoop.hdfs.server.blockmanagement.TestOverReplicatedBlocks
Running org.apache.hadoop.hdfs.server.blockmanagement.TestBlockReportRateLimiting
Tests run: 2, Failures: 0, Errors: 0, Skipped: 0, Time elapsed: 8.057 sec - in org.apache.hadoop.hdfs.server.blockmanagement.TestBlockReportRateLimiting
Running org.apache.hadoop.hdfs.server.blockmanagement.TestBlocksWithNotEnoughRacks
Tests run: 9, Failures: 0, Errors: 0, Skipped: 0, Time elapsed: 50.5 sec - in org.apache.hadoop.hdfs.server.blockmanagement.TestBlocksWithNotEnoughRacks
Running org.apache.hadoop.hdfs.server.blockmanagement.TestSequentialBlockId
Tests run: 4, Failures: 0, Errors: 0, Skipped: 0, Time elapsed: 5.47 sec - in org.apache.hadoop.hdfs.server.blockmanagement.TestSequentialBlockId
Running org.apache.hadoop.hdfs.server.blockmanagement.TestDatanodeManager
Tests run: 5, Failures: 0, Errors: 0, Skipped: 0, Time elapsed: 109.918 sec - in org.apache.hadoop.hdfs.server.blockmanagement.TestDatanodeManager
Running org.apache.hadoop.hdfs.server.blockmanagement.TestReplicationPolicyWithNodeGroup
Tests run: 13, Failures: 0, Errors: 0, Skipped: 0, Time elapsed: 6.736 sec - in org.apache.hadoop.hdfs.server.blockmanagement.TestReplicationPolicyWithNodeGroup
Running org.apache.hadoop.hdfs.server.balancer.TestBalancerWithHANameNodes
Tests run: 1, Failures: 0, Errors: 0, Skipped: 0, Time elapsed: 10.077 sec - in org.apache.hadoop.hdfs.server.balancer.TestBalancerWithHANameNodes
Running org.apache.hadoop.hdfs.server.balancer.TestBalancer
Tests run: 27, Failures: 0, Errors: 0, Skipped: 0, Time elapsed: 242.768 sec - in org.apache.hadoop.hdfs.server.balancer.TestBalancer
Running org.apache.hadoop.hdfs.server.balancer.TestBalancerWithMultipleNameNodes
Tests run: 2, Failures: 0, Errors: 0, Skipped: 0, Time elapsed: 22.45 sec - in org.apache.hadoop.hdfs.server.balancer.TestBalancerWithMultipleNameNodes
Running org.apache.hadoop.hdfs.server.balancer.TestBalancerWithSaslDataTransfer
Tests run: 3, Failures: 0, Errors: 0, Skipped: 0, Time elapsed: 52.195 sec - in org.apache.hadoop.hdfs.server.balancer.TestBalancerWithSaslDataTransfer
Running org.apache.hadoop.hdfs.server.balancer.TestBalancerWithEncryptedTransfer
Tests run: 3, Failures: 0, Errors: 0, Skipped: 0, Time elapsed: 28.462 sec - in org.apache.hadoop.hdfs.server.balancer.TestBalancerWithEncryptedTransfer
Running org.apache.hadoop.hdfs.server.balancer.TestBalancerWithNodeGroup
Tests run: 3, Failures: 0, Errors: 0, Skipped: 0, Time elapsed: 29.686 sec - in org.apache.hadoop.hdfs.server.balancer.TestBalancerWithNodeGroup
Running org.apache.hadoop.hdfs.server.mover.TestMover
Tests run: 9, Failures: 0, Errors: 0, Skipped: 0, Time elapsed: 48.405 sec - in org.apache.hadoop.hdfs.server.mover.TestMover
Running org.apache.hadoop.hdfs.server.mover.TestStorageMover
Tests run: 6, Failures: 0, Errors: 0, Skipped: 0, Time elapsed: 184.384 sec - in org.apache.hadoop.hdfs.server.mover.TestStorageMover
Running org.apache.hadoop.hdfs.server.common.TestJspHelper
Tests run: 9, Failures: 0, Errors: 0, Skipped: 0, Time elapsed: 1.651 sec - in org.apache.hadoop.hdfs.server.common.TestJspHelper
Running org.apache.hadoop.hdfs.server.common.TestGetUriFromString
Tests run: 3, Failures: 0, Errors: 0, Skipped: 0, Time elapsed: 0.205 sec - in org.apache.hadoop.hdfs.server.common.TestGetUriFromString
Running org.apache.hadoop.hdfs.TestMissingBlocksAlert
Tests run: 1, Failures: 0, Errors: 0, Skipped: 0, Time elapsed: 4.436 sec - in org.apache.hadoop.hdfs.TestMissingBlocksAlert
Running org.apache.hadoop.hdfs.TestDFSShell
Tests run: 33, Failures: 0, Errors: 0, Skipped: 0, Time elapsed: 31.487 sec - in org.apache.hadoop.hdfs.TestDFSShell
Running org.apache.hadoop.hdfs.TestDatanodeReport
Tests run: 1, Failures: 0, Errors: 0, Skipped: 0, Time elapsed: 20.737 sec - in org.apache.hadoop.hdfs.TestDatanodeReport
Running org.apache.hadoop.hdfs.client.impl.TestLeaseRenewer
Tests run: 4, Failures: 0, Errors: 0, Skipped: 0, Time elapsed: 1.462 sec - in org.apache.hadoop.hdfs.client.impl.TestLeaseRenewer
Running org.apache.hadoop.hdfs.TestLeaseRecovery2
Tests run: 7, Failures: 0, Errors: 0, Skipped: 0, Time elapsed: 69.752 sec - in org.apache.hadoop.hdfs.TestLeaseRecovery2
Running org.apache.hadoop.hdfs.TestParallelRead
Tests run: 4, Failures: 0, Errors: 0, Skipped: 0, Time elapsed: 41.238 sec - in org.apache.hadoop.hdfs.TestParallelRead
Running org.apache.hadoop.hdfs.TestPread
Tests run: 7, Failures: 0, Errors: 1, Skipped: 0, Time elapsed: 96.046 sec <<< FAILURE!
- in org.apache.hadoop.hdfs.TestPread
testPreadDFSNoChecksum(org.apache.hadoop.hdfs.TestPread)  Time elapsed: 0.009 sec  <<<
ERROR!
java.lang.ClassCastException: org.slf4j.impl.Log4jLoggerAdapter cannot be cast to org.apache.commons.logging.impl.Log4JLogger
	at org.apache.hadoop.hdfs.TestPread.testPreadDFSNoChecksum(TestPread.java:264)

Running org.apache.hadoop.hdfs.TestBlocksScheduledCounter
Tests run: 1, Failures: 0, Errors: 0, Skipped: 0, Time elapsed: 4.578 sec - in org.apache.hadoop.hdfs.TestBlocksScheduledCounter
Running org.apache.hadoop.hdfs.TestDFSClientFailover
Tests run: 8, Failures: 0, Errors: 0, Skipped: 0, Time elapsed: 13.242 sec - in org.apache.hadoop.hdfs.TestDFSClientFailover
Running org.apache.hadoop.hdfs.TestLargeBlock
Tests run: 1, Failures: 0, Errors: 0, Skipped: 0, Time elapsed: 14.028 sec - in org.apache.hadoop.hdfs.TestLargeBlock
Running org.apache.hadoop.hdfs.TestDFSClientExcludedNodes
Tests run: 2, Failures: 0, Errors: 0, Skipped: 0, Time elapsed: 12.43 sec - in org.apache.hadoop.hdfs.TestDFSClientExcludedNodes
Running org.apache.hadoop.hdfs.TestFileLengthOnClusterRestart
Tests run: 1, Failures: 0, Errors: 0, Skipped: 0, Time elapsed: 9.638 sec - in org.apache.hadoop.hdfs.TestFileLengthOnClusterRestart
Running org.apache.hadoop.hdfs.tools.offlineEditsViewer.TestOfflineEditsViewer
Tests run: 3, Failures: 0, Errors: 0, Skipped: 0, Time elapsed: 14.9 sec - in org.apache.hadoop.hdfs.tools.offlineEditsViewer.TestOfflineEditsViewer
Running org.apache.hadoop.hdfs.tools.TestStoragePolicyCommands
Tests run: 1, Failures: 0, Errors: 0, Skipped: 0, Time elapsed: 4.611 sec - in org.apache.hadoop.hdfs.tools.TestStoragePolicyCommands
Running org.apache.hadoop.hdfs.tools.TestDelegationTokenFetcher
Tests run: 4, Failures: 0, Errors: 0, Skipped: 0, Time elapsed: 3.878 sec - in org.apache.hadoop.hdfs.tools.TestDelegationTokenFetcher
Running org.apache.hadoop.hdfs.tools.TestDebugAdmin
Tests run: 3, Failures: 0, Errors: 0, Skipped: 0, Time elapsed: 6.033 sec - in org.apache.hadoop.hdfs.tools.TestDebugAdmin
Running org.apache.hadoop.hdfs.tools.TestDFSAdminWithHA
Tests run: 10, Failures: 0, Errors: 0, Skipped: 0, Time elapsed: 20.189 sec - in org.apache.hadoop.hdfs.tools.TestDFSAdminWithHA
Running org.apache.hadoop.hdfs.tools.TestDFSHAAdminMiniCluster
Tests run: 6, Failures: 0, Errors: 0, Skipped: 0, Time elapsed: 7.745 sec - in org.apache.hadoop.hdfs.tools.TestDFSHAAdminMiniCluster
Running org.apache.hadoop.hdfs.tools.offlineImageViewer.TestOfflineImageViewerForXAttr
Tests run: 6, Failures: 0, Errors: 0, Skipped: 0, Time elapsed: 4.734 sec - in org.apache.hadoop.hdfs.tools.offlineImageViewer.TestOfflineImageViewerForXAttr
Running org.apache.hadoop.hdfs.tools.offlineImageViewer.TestOfflineImageViewer
Tests run: 6, Failures: 0, Errors: 0, Skipped: 0, Time elapsed: 5.563 sec - in org.apache.hadoop.hdfs.tools.offlineImageViewer.TestOfflineImageViewer
Running org.apache.hadoop.hdfs.tools.offlineImageViewer.TestOfflineImageViewerForAcl
Tests run: 2, Failures: 0, Errors: 0, Skipped: 0, Time elapsed: 5.133 sec - in org.apache.hadoop.hdfs.tools.offlineImageViewer.TestOfflineImageViewerForAcl
Running org.apache.hadoop.hdfs.tools.offlineImageViewer.TestOfflineImageViewerForContentSummary
Tests run: 6, Failures: 0, Errors: 0, Skipped: 0, Time elapsed: 5.433 sec - in org.apache.hadoop.hdfs.tools.offlineImageViewer.TestOfflineImageViewerForContentSummary
Running org.apache.hadoop.hdfs.tools.TestDFSHAAdmin
Tests run: 20, Failures: 0, Errors: 0, Skipped: 0, Time elapsed: 2.07 sec - in org.apache.hadoop.hdfs.tools.TestDFSHAAdmin
Running org.apache.hadoop.hdfs.tools.TestDFSZKFailoverController
Tests run: 4, Failures: 0, Errors: 0, Skipped: 0, Time elapsed: 29.478 sec - in org.apache.hadoop.hdfs.tools.TestDFSZKFailoverController
Running org.apache.hadoop.hdfs.tools.TestDFSAdmin
Tests run: 2, Failures: 0, Errors: 0, Skipped: 0, Time elapsed: 5.73 sec - in org.apache.hadoop.hdfs.tools.TestDFSAdmin
Running org.apache.hadoop.hdfs.tools.TestGetConf
Tests run: 10, Failures: 0, Errors: 0, Skipped: 0, Time elapsed: 1.332 sec - in org.apache.hadoop.hdfs.tools.TestGetConf
Running org.apache.hadoop.hdfs.tools.TestGetGroups
Tests run: 6, Failures: 0, Errors: 0, Skipped: 0, Time elapsed: 5.285 sec - in org.apache.hadoop.hdfs.tools.TestGetGroups
Running org.apache.hadoop.hdfs.TestDFSInputStream
Tests run: 4, Failures: 0, Errors: 0, Skipped: 0, Time elapsed: 10.889 sec - in org.apache.hadoop.hdfs.TestDFSInputStream
Running org.apache.hadoop.hdfs.TestFetchImage
Tests run: 1, Failures: 0, Errors: 0, Skipped: 0, Time elapsed: 4.197 sec - in org.apache.hadoop.hdfs.TestFetchImage
Running org.apache.hadoop.hdfs.TestRenameWhileOpen
Tests run: 4, Failures: 0, Errors: 0, Skipped: 0, Time elapsed: 48.423 sec - in org.apache.hadoop.hdfs.TestRenameWhileOpen
Running org.apache.hadoop.hdfs.TestDatanodeRegistration
Tests run: 5, Failures: 0, Errors: 0, Skipped: 0, Time elapsed: 9.107 sec - in org.apache.hadoop.hdfs.TestDatanodeRegistration
Running org.apache.hadoop.hdfs.TestSmallBlock
Tests run: 2, Failures: 0, Errors: 0, Skipped: 0, Time elapsed: 5.949 sec - in org.apache.hadoop.hdfs.TestSmallBlock
Running org.apache.hadoop.hdfs.TestDFSClientRetries

Results :

Tests in error: 
  TestPread.testPreadDFSNoChecksum:264 ClassCast org.slf4j.impl.Log4jLoggerAdapt...

Tests run: 2533, Failures: 0, Errors: 1, Skipped: 11

[INFO]                                                                         
[INFO] ------------------------------------------------------------------------
[INFO] Skipping Apache Hadoop HttpFS
[INFO] This project has been banned from the build due to previous failures.
[INFO] ------------------------------------------------------------------------
[INFO]                                                                         
[INFO] ------------------------------------------------------------------------
[INFO] Skipping Apache Hadoop HDFS BookKeeper Journal
[INFO] This project has been banned from the build due to previous failures.
[INFO] ------------------------------------------------------------------------
[INFO]                                                                         
[INFO] ------------------------------------------------------------------------
[INFO] Skipping Apache Hadoop HDFS-NFS
[INFO] This project has been banned from the build due to previous failures.
[INFO] ------------------------------------------------------------------------
[INFO]                                                                         
[INFO] ------------------------------------------------------------------------
[INFO] Building Apache Hadoop HDFS Project 3.0.0-SNAPSHOT
[INFO] ------------------------------------------------------------------------
[INFO] 
[INFO] --- maven-clean-plugin:2.5:clean (default-clean) @ hadoop-hdfs-project ---
[INFO] Deleting <https://builds.apache.org/job/Hadoop-Hdfs-trunk/ws/hadoop-hdfs-project/target>
[INFO] 
[INFO] --- maven-antrun-plugin:1.7:run (create-testdirs) @ hadoop-hdfs-project ---
[INFO] Executing tasks

main:
    [mkdir] Created dir: <https://builds.apache.org/job/Hadoop-Hdfs-trunk/ws/hadoop-hdfs-project/target/test-dir>
[INFO] Executed tasks
[INFO] 
[INFO] --- maven-source-plugin:2.3:jar-no-fork (hadoop-java-sources) @ hadoop-hdfs-project
---
[INFO] 
[INFO] --- maven-source-plugin:2.3:test-jar-no-fork (hadoop-java-sources) @ hadoop-hdfs-project
---
[INFO] 
[INFO] --- maven-enforcer-plugin:1.3.1:enforce (dist-enforce) @ hadoop-hdfs-project ---
[INFO] 
[INFO] --- maven-site-plugin:3.4:attach-descriptor (attach-descriptor) @ hadoop-hdfs-project
---
[INFO] 
[INFO] --- maven-javadoc-plugin:2.8.1:jar (module-javadocs) @ hadoop-hdfs-project ---
[INFO] Skipping javadoc generation
[INFO] 
[INFO] --- maven-enforcer-plugin:1.3.1:enforce (depcheck) @ hadoop-hdfs-project ---
[INFO] 
[INFO] --- maven-checkstyle-plugin:2.15:checkstyle (default-cli) @ hadoop-hdfs-project ---
[INFO] 
[INFO] --- findbugs-maven-plugin:3.0.0:findbugs (default-cli) @ hadoop-hdfs-project ---
[INFO] ------------------------------------------------------------------------
[INFO] Reactor Summary:
[INFO] 
[INFO] Apache Hadoop HDFS Client ......................... SUCCESS [03:08 min]
[INFO] Apache Hadoop HDFS ................................ FAILURE [  01:54 h]
[INFO] Apache Hadoop HttpFS .............................. SKIPPED
[INFO] Apache Hadoop HDFS BookKeeper Journal ............. SKIPPED
[INFO] Apache Hadoop HDFS-NFS ............................ SKIPPED
[INFO] Apache Hadoop HDFS Project ........................ SUCCESS [  0.059 s]
[INFO] ------------------------------------------------------------------------
[INFO] BUILD FAILURE
[INFO] ------------------------------------------------------------------------
[INFO] Total time: 01:57 h
[INFO] Finished at: 2015-08-23T01:44:22+00:00
[INFO] Final Memory: 66M/974M
[INFO] ------------------------------------------------------------------------
[ERROR] Failed to execute goal org.apache.maven.plugins:maven-surefire-plugin:2.17:test (default-test)
on project hadoop-hdfs: ExecutionException: java.lang.RuntimeException: The forked VM terminated
without properly saying goodbye. VM crash or System.exit called?
[ERROR] Command was /bin/sh -c cd <https://builds.apache.org/job/Hadoop-Hdfs-trunk/ws/hadoop-hdfs-project/hadoop-hdfs>
&& /home/jenkins/tools/java/jdk1.7.0_55/jre/bin/java -Xmx4096m -XX:MaxPermSize=768m
-XX:+HeapDumpOnOutOfMemoryError -jar <https://builds.apache.org/job/Hadoop-Hdfs-trunk/ws/hadoop-hdfs-project/hadoop-hdfs/target/surefire/surefirebooter4756679182791593876.jar>
<https://builds.apache.org/job/Hadoop-Hdfs-trunk/ws/hadoop-hdfs-project/hadoop-hdfs/target/surefire/surefire6529909152232704420tmp>
<https://builds.apache.org/job/Hadoop-Hdfs-trunk/ws/hadoop-hdfs-project/hadoop-hdfs/target/surefire/surefire_1834965311855662921199tmp>
[ERROR] -> [Help 1]
[ERROR] 
[ERROR] To see the full stack trace of the errors, re-run Maven with the -e switch.
[ERROR] Re-run Maven using the -X switch to enable full debug logging.
[ERROR] 
[ERROR] For more information about the errors and possible solutions, please read the following
articles:
[ERROR] [Help 1] http://cwiki.apache.org/confluence/display/MAVEN/MojoFailureException
[ERROR] 
[ERROR] After correcting the problems, you can resume the build with the command
[ERROR]   mvn <goals> -rf :hadoop-hdfs
Build step 'Execute shell' marked build as failure
Archiving artifacts
Sending artifact delta relative to Hadoop-Hdfs-trunk #2221
Archived 1 artifacts
Archive block size is 32768
Received 0 blocks and 3947541 bytes
Compression is 0.0%
Took 1.7 sec
Recording test results
Updating YARN-221

Mime
View raw message