hadoop-hdfs-dev mailing list archives

Site index · List index
Message view « Date » · « Thread »
Top « Date » · « Thread »
From Apache Jenkins Server <jenk...@builds.apache.org>
Subject Hadoop-Hdfs-trunk-Java8 - Build # 274 - Still Failing
Date Wed, 12 Aug 2015 15:17:45 GMT
See https://builds.apache.org/job/Hadoop-Hdfs-trunk-Java8/274/

###################################################################################
########################## LAST 60 LINES OF THE CONSOLE ###########################
[...truncated 7887 lines...]
[INFO] 
[INFO] --- maven-source-plugin:2.3:jar-no-fork (hadoop-java-sources) @ hadoop-hdfs-project
---
[INFO] 
[INFO] --- maven-source-plugin:2.3:test-jar-no-fork (hadoop-java-sources) @ hadoop-hdfs-project
---
[INFO] 
[INFO] --- maven-enforcer-plugin:1.3.1:enforce (dist-enforce) @ hadoop-hdfs-project ---
[INFO] 
[INFO] --- maven-site-plugin:3.4:attach-descriptor (attach-descriptor) @ hadoop-hdfs-project
---
[INFO] 
[INFO] --- maven-javadoc-plugin:2.8.1:jar (module-javadocs) @ hadoop-hdfs-project ---
[INFO] Not executing Javadoc as the project is not a Java classpath-capable package
[INFO] 
[INFO] --- maven-enforcer-plugin:1.3.1:enforce (depcheck) @ hadoop-hdfs-project ---
[INFO] 
[INFO] --- maven-checkstyle-plugin:2.15:checkstyle (default-cli) @ hadoop-hdfs-project ---
[INFO] 
[INFO] --- findbugs-maven-plugin:3.0.0:findbugs (default-cli) @ hadoop-hdfs-project ---
[INFO] ------------------------------------------------------------------------
[INFO] Reactor Summary:
[INFO] 
[INFO] Apache Hadoop HDFS Client ......................... SUCCESS [03:02 min]
[INFO] Apache Hadoop HDFS ................................ FAILURE [  03:01 h]
[INFO] Apache Hadoop HttpFS .............................. SKIPPED
[INFO] Apache Hadoop HDFS BookKeeper Journal ............. SKIPPED
[INFO] Apache Hadoop HDFS-NFS ............................ SKIPPED
[INFO] Apache Hadoop HDFS Project ........................ SUCCESS [  0.047 s]
[INFO] ------------------------------------------------------------------------
[INFO] BUILD FAILURE
[INFO] ------------------------------------------------------------------------
[INFO] Total time: 03:05 h
[INFO] Finished at: 2015-08-12T15:17:41+00:00
[INFO] Final Memory: 63M/709M
[INFO] ------------------------------------------------------------------------
[ERROR] Failed to execute goal org.apache.maven.plugins:maven-surefire-plugin:2.17:test (default-test)
on project hadoop-hdfs: There was a timeout or other error in the fork -> [Help 1]
[ERROR] 
[ERROR] To see the full stack trace of the errors, re-run Maven with the -e switch.
[ERROR] Re-run Maven using the -X switch to enable full debug logging.
[ERROR] 
[ERROR] For more information about the errors and possible solutions, please read the following
articles:
[ERROR] [Help 1] http://cwiki.apache.org/confluence/display/MAVEN/MojoFailureException
[ERROR] 
[ERROR] After correcting the problems, you can resume the build with the command
[ERROR]   mvn <goals> -rf :hadoop-hdfs
Build step 'Execute shell' marked build as failure
Archiving artifacts
Sending artifact delta relative to Hadoop-Hdfs-trunk-Java8 #222
Archived 1 artifacts
Archive block size is 32768
Received 0 blocks and 4343016 bytes
Compression is 0.0%
Took 35 sec
Recording test results
Updating HDFS-8805
Updating YARN-4023
Updating HDFS-8887
Updating YARN-3999
Sending e-mails to: hdfs-dev@hadoop.apache.org
Email was triggered for: Failure
Sending email for trigger: Failure



###################################################################################
############################## FAILED TESTS (if any) ##############################
2 tests failed.
REGRESSION:  org.apache.hadoop.hdfs.server.namenode.ha.TestStandbyCheckpoints.testCheckpointCancellationDuringUpload

Error Message:
Expected non-empty /home/jenkins/jenkins-slave/workspace/Hadoop-Hdfs-trunk-Java8/hadoop-hdfs-project/hadoop-hdfs/target/test/data/dfs/name-0-5/current/fsimage_0000000000000000104

Stack Trace:
java.lang.AssertionError: Expected non-empty /home/jenkins/jenkins-slave/workspace/Hadoop-Hdfs-trunk-Java8/hadoop-hdfs-project/hadoop-hdfs/target/test/data/dfs/name-0-5/current/fsimage_0000000000000000104
	at org.junit.Assert.fail(Assert.java:88)
	at org.junit.Assert.assertTrue(Assert.java:41)
	at org.apache.hadoop.hdfs.server.namenode.FSImageTestUtil.assertNNHasCheckpoints(FSImageTestUtil.java:470)
	at org.apache.hadoop.hdfs.server.namenode.ha.HATestUtil.waitForCheckpoint(HATestUtil.java:235)
	at org.apache.hadoop.hdfs.server.namenode.ha.TestStandbyCheckpoints.testCheckpointCancellationDuringUpload(TestStandbyCheckpoints.java:317)


REGRESSION:  org.apache.hadoop.hdfs.web.TestWebHdfsTimeouts.testReadTimeout

Error Message:
expected:<Read timed out> but was:<null>

Stack Trace:
java.lang.AssertionError: expected:<Read timed out> but was:<null>
	at org.junit.Assert.fail(Assert.java:88)
	at org.junit.Assert.failNotEquals(Assert.java:743)
	at org.junit.Assert.assertEquals(Assert.java:118)
	at org.junit.Assert.assertEquals(Assert.java:144)
	at org.apache.hadoop.hdfs.web.TestWebHdfsTimeouts.testReadTimeout(TestWebHdfsTimeouts.java:131)



Mime
  • Unnamed multipart/mixed (inline, None, 0 bytes)
View raw message