hadoop-hdfs-dev mailing list archives

Site index · List index
Message view « Date » · « Thread »
Top « Date » · « Thread »
From Apache Jenkins Server <jenk...@builds.apache.org>
Subject Hadoop-Hdfs-trunk-Java8 - Build # 263 - Still Failing
Date Sat, 01 Aug 2015 14:31:39 GMT
See https://builds.apache.org/job/Hadoop-Hdfs-trunk-Java8/263/

###################################################################################
########################## LAST 60 LINES OF THE CONSOLE ###########################
[...truncated 8051 lines...]
[INFO] 
[INFO] --- maven-javadoc-plugin:2.8.1:jar (module-javadocs) @ hadoop-hdfs-project ---
[INFO] Not executing Javadoc as the project is not a Java classpath-capable package
[INFO] 
[INFO] --- maven-enforcer-plugin:1.3.1:enforce (depcheck) @ hadoop-hdfs-project ---
[INFO] 
[INFO] --- maven-checkstyle-plugin:2.15:checkstyle (default-cli) @ hadoop-hdfs-project ---
[INFO] 
[INFO] --- findbugs-maven-plugin:3.0.0:findbugs (default-cli) @ hadoop-hdfs-project ---
[INFO] ------------------------------------------------------------------------
[INFO] Reactor Summary:
[INFO] 
[INFO] Apache Hadoop HDFS Client ......................... SUCCESS [03:03 min]
[INFO] Apache Hadoop HDFS ................................ FAILURE [  02:49 h]
[INFO] Apache Hadoop HttpFS .............................. SKIPPED
[INFO] Apache Hadoop HDFS BookKeeper Journal ............. SKIPPED
[INFO] Apache Hadoop HDFS-NFS ............................ SKIPPED
[INFO] Apache Hadoop HDFS Project ........................ SUCCESS [  0.091 s]
[INFO] ------------------------------------------------------------------------
[INFO] BUILD FAILURE
[INFO] ------------------------------------------------------------------------
[INFO] Total time: 02:52 h
[INFO] Finished at: 2015-08-01T14:28:02+00:00
[INFO] Final Memory: 53M/768M
[INFO] ------------------------------------------------------------------------
[ERROR] Failed to execute goal org.apache.maven.plugins:maven-surefire-plugin:2.17:test (default-test)
on project hadoop-hdfs: There are test failures.
[ERROR] 
[ERROR] Please refer to /home/jenkins/jenkins-slave/workspace/Hadoop-Hdfs-trunk-Java8/hadoop-hdfs-project/hadoop-hdfs/target/surefire-reports
for the individual test results.
[ERROR] -> [Help 1]
[ERROR] 
[ERROR] To see the full stack trace of the errors, re-run Maven with the -e switch.
[ERROR] Re-run Maven using the -X switch to enable full debug logging.
[ERROR] 
[ERROR] For more information about the errors and possible solutions, please read the following
articles:
[ERROR] [Help 1] http://cwiki.apache.org/confluence/display/MAVEN/MojoFailureException
[ERROR] 
[ERROR] After correcting the problems, you can resume the build with the command
[ERROR]   mvn <goals> -rf :hadoop-hdfs
Build step 'Execute shell' marked build as failure
Archiving artifacts
Sending artifact delta relative to Hadoop-Hdfs-trunk-Java8 #222
Archived 1 artifacts
Archive block size is 32768
Received 0 blocks and 4319627 bytes
Compression is 0.0%
Took 8 sec
Recording test results
Updating YARN-3990
Updating HDFS-8847
Updating HADOOP-12268
Updating HADOOP-7824
Updating MAPREDUCE-6394
Updating HADOOP-10854
Updating HDFS-6860
Updating HADOOP-12183
Updating HADOOP-12249
Sending e-mails to: hdfs-dev@hadoop.apache.org
Email was triggered for: Failure
Sending email for trigger: Failure



###################################################################################
############################## FAILED TESTS (if any) ##############################
4 tests failed.
FAILED:  org.apache.hadoop.hdfs.TestAppendSnapshotTruncate.testAST

Error Message:
dir has ERROR

Stack Trace:
java.lang.IllegalStateException: dir has ERROR
	at org.apache.hadoop.hdfs.TestAppendSnapshotTruncate$Worker.checkErrorState(TestAppendSnapshotTruncate.java:430)
	at org.apache.hadoop.hdfs.TestAppendSnapshotTruncate$Worker.stop(TestAppendSnapshotTruncate.java:483)
	at org.apache.hadoop.hdfs.TestAppendSnapshotTruncate.testAST(TestAppendSnapshotTruncate.java:128)
Caused by: java.lang.IllegalStateException: null
	at com.google.common.base.Preconditions.checkState(Preconditions.java:129)
	at org.apache.hadoop.hdfs.TestAppendSnapshotTruncate$Worker.pause(TestAppendSnapshotTruncate.java:479)
	at org.apache.hadoop.hdfs.TestAppendSnapshotTruncate$DirWorker.pauseAllFiles(TestAppendSnapshotTruncate.java:247)
	at org.apache.hadoop.hdfs.TestAppendSnapshotTruncate$DirWorker.call(TestAppendSnapshotTruncate.java:220)
	at org.apache.hadoop.hdfs.TestAppendSnapshotTruncate$DirWorker.call(TestAppendSnapshotTruncate.java:140)
	at org.apache.hadoop.hdfs.TestAppendSnapshotTruncate$Worker$1.run(TestAppendSnapshotTruncate.java:454)
	at java.lang.Thread.run(Thread.java:744)


FAILED:  org.apache.hadoop.hdfs.server.datanode.TestDataNodeMetrics.testDataNodeTimeSpend

Error Message:
null

Stack Trace:
java.lang.AssertionError: null
	at org.junit.Assert.fail(Assert.java:86)
	at org.junit.Assert.assertTrue(Assert.java:41)
	at org.junit.Assert.assertTrue(Assert.java:52)
	at org.apache.hadoop.hdfs.server.datanode.TestDataNodeMetrics.testDataNodeTimeSpend(TestDataNodeMetrics.java:288)


FAILED:  org.apache.hadoop.hdfs.server.namenode.ha.TestSeveralNameNodes.testCircularLinkedListWrites

Error Message:
Some writers didn't complete in expected runtime! Current writer state:[Circular Writer:
  directory: /test-0
  target length: 50
  current item: 45
  done: false
, Circular Writer:
  directory: /test-1
  target length: 50
  current item: 10
  done: false
, Circular Writer:
  directory: /test-2
  target length: 50
  current item: 43
  done: false
] expected:<0> but was:<3>

Stack Trace:
java.lang.AssertionError: Some writers didn't complete in expected runtime! Current writer
state:[Circular Writer:
	 directory: /test-0
	 target length: 50
	 current item: 45
	 done: false
, Circular Writer:
	 directory: /test-1
	 target length: 50
	 current item: 10
	 done: false
, Circular Writer:
	 directory: /test-2
	 target length: 50
	 current item: 43
	 done: false
] expected:<0> but was:<3>
	at org.junit.Assert.fail(Assert.java:88)
	at org.junit.Assert.failNotEquals(Assert.java:743)
	at org.junit.Assert.assertEquals(Assert.java:118)
	at org.junit.Assert.assertEquals(Assert.java:555)
	at org.apache.hadoop.hdfs.server.namenode.ha.TestSeveralNameNodes.testCircularLinkedListWrites(TestSeveralNameNodes.java:90)


FAILED:  org.apache.hadoop.hdfs.server.namenode.ha.TestStandbyIsHot.testDatanodeRestarts

Error Message:
expected:<0> but was:<4>

Stack Trace:
java.lang.AssertionError: expected:<0> but was:<4>
	at org.junit.Assert.fail(Assert.java:88)
	at org.junit.Assert.failNotEquals(Assert.java:743)
	at org.junit.Assert.assertEquals(Assert.java:118)
	at org.junit.Assert.assertEquals(Assert.java:555)
	at org.junit.Assert.assertEquals(Assert.java:542)
	at org.apache.hadoop.hdfs.server.namenode.ha.TestStandbyIsHot.testDatanodeRestarts(TestStandbyIsHot.java:188)



Mime
  • Unnamed multipart/mixed (inline, None, 0 bytes)
View raw message