hadoop-hdfs-dev mailing list archives

Site index · List index
Message view « Date » · « Thread »
Top « Date » · « Thread »
From Apache Jenkins Server <jenk...@builds.apache.org>
Subject Build failed in Jenkins: Hadoop-Hdfs-trunk-Java8 #302
Date Thu, 27 Aug 2015 14:38:47 GMT
See <https://builds.apache.org/job/Hadoop-Hdfs-trunk-Java8/302/changes>

Changes:

[harsh] HDFS-2390. dfsadmin -setBalancerBandwidth does not validate -ve value. Contributed
by Gautam Gopalakrishnan.

------------------------------------------
[...truncated 7745 lines...]
Tests run: 10, Failures: 0, Errors: 0, Skipped: 1, Time elapsed: 15.473 sec - in org.apache.hadoop.fs.TestEnhancedByteBufferAccess
Java HotSpot(TM) 64-Bit Server VM warning: ignoring option MaxPermSize=768m; support was removed
in 8.0
Running org.apache.hadoop.fs.TestHdfsNativeCodeLoader
Tests run: 1, Failures: 0, Errors: 0, Skipped: 0, Time elapsed: 0.197 sec - in org.apache.hadoop.fs.TestHdfsNativeCodeLoader
Java HotSpot(TM) 64-Bit Server VM warning: ignoring option MaxPermSize=768m; support was removed
in 8.0
Running org.apache.hadoop.fs.TestUrlStreamHandlerFactory
Tests run: 1, Failures: 0, Errors: 0, Skipped: 0, Time elapsed: 1.242 sec - in org.apache.hadoop.fs.TestUrlStreamHandlerFactory
Java HotSpot(TM) 64-Bit Server VM warning: ignoring option MaxPermSize=768m; support was removed
in 8.0
Running org.apache.hadoop.fs.TestHDFSFileContextMainOperations
Tests run: 68, Failures: 0, Errors: 0, Skipped: 0, Time elapsed: 8.238 sec - in org.apache.hadoop.fs.TestHDFSFileContextMainOperations
Java HotSpot(TM) 64-Bit Server VM warning: ignoring option MaxPermSize=768m; support was removed
in 8.0
Running org.apache.hadoop.fs.shell.TestHdfsTextCommand
Tests run: 1, Failures: 0, Errors: 0, Skipped: 0, Time elapsed: 4.601 sec - in org.apache.hadoop.fs.shell.TestHdfsTextCommand
Java HotSpot(TM) 64-Bit Server VM warning: ignoring option MaxPermSize=768m; support was removed
in 8.0
Running org.apache.hadoop.fs.TestSWebHdfsFileContextMainOperations
Tests run: 60, Failures: 0, Errors: 0, Skipped: 0, Time elapsed: 13.21 sec - in org.apache.hadoop.fs.TestSWebHdfsFileContextMainOperations
Java HotSpot(TM) 64-Bit Server VM warning: ignoring option MaxPermSize=768m; support was removed
in 8.0
Running org.apache.hadoop.fs.TestResolveHdfsSymlink
Tests run: 4, Failures: 0, Errors: 0, Skipped: 0, Time elapsed: 4.006 sec - in org.apache.hadoop.fs.TestResolveHdfsSymlink
Java HotSpot(TM) 64-Bit Server VM warning: ignoring option MaxPermSize=768m; support was removed
in 8.0
Running org.apache.hadoop.fs.TestWebHdfsFileContextMainOperations
Tests run: 60, Failures: 0, Errors: 0, Skipped: 0, Time elapsed: 10.538 sec - in org.apache.hadoop.fs.TestWebHdfsFileContextMainOperations
Java HotSpot(TM) 64-Bit Server VM warning: ignoring option MaxPermSize=768m; support was removed
in 8.0
Running org.apache.hadoop.fs.viewfs.TestViewFsWithAcls
Tests run: 1, Failures: 0, Errors: 0, Skipped: 0, Time elapsed: 5.049 sec - in org.apache.hadoop.fs.viewfs.TestViewFsWithAcls
Java HotSpot(TM) 64-Bit Server VM warning: ignoring option MaxPermSize=768m; support was removed
in 8.0
Running org.apache.hadoop.fs.viewfs.TestViewFsFileStatusHdfs
Tests run: 2, Failures: 0, Errors: 0, Skipped: 0, Time elapsed: 4.265 sec - in org.apache.hadoop.fs.viewfs.TestViewFsFileStatusHdfs
Java HotSpot(TM) 64-Bit Server VM warning: ignoring option MaxPermSize=768m; support was removed
in 8.0
Running org.apache.hadoop.fs.viewfs.TestViewFileSystemHdfs
Tests run: 60, Failures: 0, Errors: 0, Skipped: 0, Time elapsed: 10.468 sec - in org.apache.hadoop.fs.viewfs.TestViewFileSystemHdfs
Java HotSpot(TM) 64-Bit Server VM warning: ignoring option MaxPermSize=768m; support was removed
in 8.0
Running org.apache.hadoop.fs.viewfs.TestViewFsWithXAttrs
Tests run: 1, Failures: 0, Errors: 0, Skipped: 0, Time elapsed: 4.822 sec - in org.apache.hadoop.fs.viewfs.TestViewFsWithXAttrs
Java HotSpot(TM) 64-Bit Server VM warning: ignoring option MaxPermSize=768m; support was removed
in 8.0
Running org.apache.hadoop.fs.viewfs.TestViewFsAtHdfsRoot
Tests run: 58, Failures: 0, Errors: 0, Skipped: 0, Time elapsed: 7.604 sec - in org.apache.hadoop.fs.viewfs.TestViewFsAtHdfsRoot
Java HotSpot(TM) 64-Bit Server VM warning: ignoring option MaxPermSize=768m; support was removed
in 8.0
Running org.apache.hadoop.fs.viewfs.TestViewFsHdfs
Tests run: 58, Failures: 0, Errors: 0, Skipped: 0, Time elapsed: 7.465 sec - in org.apache.hadoop.fs.viewfs.TestViewFsHdfs
Java HotSpot(TM) 64-Bit Server VM warning: ignoring option MaxPermSize=768m; support was removed
in 8.0
Running org.apache.hadoop.fs.viewfs.TestViewFileSystemWithAcls
Tests run: 1, Failures: 0, Errors: 0, Skipped: 0, Time elapsed: 5.101 sec - in org.apache.hadoop.fs.viewfs.TestViewFileSystemWithAcls
Java HotSpot(TM) 64-Bit Server VM warning: ignoring option MaxPermSize=768m; support was removed
in 8.0
Running org.apache.hadoop.fs.viewfs.TestViewFileSystemAtHdfsRoot
Tests run: 60, Failures: 0, Errors: 0, Skipped: 0, Time elapsed: 10.722 sec - in org.apache.hadoop.fs.viewfs.TestViewFileSystemAtHdfsRoot
Java HotSpot(TM) 64-Bit Server VM warning: ignoring option MaxPermSize=768m; support was removed
in 8.0
Running org.apache.hadoop.fs.viewfs.TestViewFileSystemWithXAttrs
Tests run: 1, Failures: 0, Errors: 0, Skipped: 0, Time elapsed: 4.952 sec - in org.apache.hadoop.fs.viewfs.TestViewFileSystemWithXAttrs
Java HotSpot(TM) 64-Bit Server VM warning: ignoring option MaxPermSize=768m; support was removed
in 8.0
Running org.apache.hadoop.fs.viewfs.TestViewFsDefaultValue
Tests run: 4, Failures: 0, Errors: 0, Skipped: 0, Time elapsed: 4.274 sec - in org.apache.hadoop.fs.viewfs.TestViewFsDefaultValue
Java HotSpot(TM) 64-Bit Server VM warning: ignoring option MaxPermSize=768m; support was removed
in 8.0
Running org.apache.hadoop.fs.TestSymlinkHdfsFileContext
Tests run: 71, Failures: 0, Errors: 0, Skipped: 0, Time elapsed: 9.037 sec - in org.apache.hadoop.fs.TestSymlinkHdfsFileContext
Java HotSpot(TM) 64-Bit Server VM warning: ignoring option MaxPermSize=768m; support was removed
in 8.0
Running org.apache.hadoop.fs.contract.hdfs.TestHDFSContractDelete
Tests run: 8, Failures: 0, Errors: 0, Skipped: 0, Time elapsed: 4.968 sec - in org.apache.hadoop.fs.contract.hdfs.TestHDFSContractDelete
Java HotSpot(TM) 64-Bit Server VM warning: ignoring option MaxPermSize=768m; support was removed
in 8.0
Running org.apache.hadoop.fs.contract.hdfs.TestHDFSContractSetTimes
Tests run: 1, Failures: 0, Errors: 0, Skipped: 0, Time elapsed: 3.962 sec - in org.apache.hadoop.fs.contract.hdfs.TestHDFSContractSetTimes
Java HotSpot(TM) 64-Bit Server VM warning: ignoring option MaxPermSize=768m; support was removed
in 8.0
Running org.apache.hadoop.fs.contract.hdfs.TestHDFSContractMkdir
Tests run: 5, Failures: 0, Errors: 0, Skipped: 0, Time elapsed: 4.924 sec - in org.apache.hadoop.fs.contract.hdfs.TestHDFSContractMkdir
Java HotSpot(TM) 64-Bit Server VM warning: ignoring option MaxPermSize=768m; support was removed
in 8.0
Running org.apache.hadoop.fs.contract.hdfs.TestHDFSContractOpen
Tests run: 6, Failures: 0, Errors: 0, Skipped: 0, Time elapsed: 5.121 sec - in org.apache.hadoop.fs.contract.hdfs.TestHDFSContractOpen
Java HotSpot(TM) 64-Bit Server VM warning: ignoring option MaxPermSize=768m; support was removed
in 8.0
Running org.apache.hadoop.fs.contract.hdfs.TestHDFSContractRootDirectory
Tests run: 5, Failures: 0, Errors: 0, Skipped: 0, Time elapsed: 4.255 sec - in org.apache.hadoop.fs.contract.hdfs.TestHDFSContractRootDirectory
Java HotSpot(TM) 64-Bit Server VM warning: ignoring option MaxPermSize=768m; support was removed
in 8.0
Running org.apache.hadoop.fs.contract.hdfs.TestHDFSContractAppend
Tests run: 5, Failures: 0, Errors: 0, Skipped: 0, Time elapsed: 5.22 sec - in org.apache.hadoop.fs.contract.hdfs.TestHDFSContractAppend
Java HotSpot(TM) 64-Bit Server VM warning: ignoring option MaxPermSize=768m; support was removed
in 8.0
Running org.apache.hadoop.fs.contract.hdfs.TestHDFSContractCreate
Tests run: 6, Failures: 0, Errors: 0, Skipped: 0, Time elapsed: 5.012 sec - in org.apache.hadoop.fs.contract.hdfs.TestHDFSContractCreate
Java HotSpot(TM) 64-Bit Server VM warning: ignoring option MaxPermSize=768m; support was removed
in 8.0
Running org.apache.hadoop.fs.contract.hdfs.TestHDFSContractSeek
Tests run: 10, Failures: 0, Errors: 0, Skipped: 0, Time elapsed: 6.778 sec - in org.apache.hadoop.fs.contract.hdfs.TestHDFSContractSeek
Java HotSpot(TM) 64-Bit Server VM warning: ignoring option MaxPermSize=768m; support was removed
in 8.0
Running org.apache.hadoop.fs.contract.hdfs.TestHDFSContractRename
Tests run: 6, Failures: 0, Errors: 0, Skipped: 0, Time elapsed: 5.076 sec - in org.apache.hadoop.fs.contract.hdfs.TestHDFSContractRename
Java HotSpot(TM) 64-Bit Server VM warning: ignoring option MaxPermSize=768m; support was removed
in 8.0
Running org.apache.hadoop.fs.contract.hdfs.TestHDFSContractGetFileStatus
Tests run: 1, Failures: 0, Errors: 0, Skipped: 0, Time elapsed: 4.216 sec - in org.apache.hadoop.fs.contract.hdfs.TestHDFSContractGetFileStatus
Java HotSpot(TM) 64-Bit Server VM warning: ignoring option MaxPermSize=768m; support was removed
in 8.0
Running org.apache.hadoop.fs.contract.hdfs.TestHDFSContractConcat
Tests run: 4, Failures: 0, Errors: 0, Skipped: 0, Time elapsed: 4.993 sec - in org.apache.hadoop.fs.contract.hdfs.TestHDFSContractConcat
Java HotSpot(TM) 64-Bit Server VM warning: ignoring option MaxPermSize=768m; support was removed
in 8.0
Running org.apache.hadoop.fs.permission.TestStickyBit
Tests run: 6, Failures: 0, Errors: 0, Skipped: 0, Time elapsed: 9.307 sec - in org.apache.hadoop.fs.permission.TestStickyBit
Java HotSpot(TM) 64-Bit Server VM warning: ignoring option MaxPermSize=768m; support was removed
in 8.0
Running org.apache.hadoop.TestRefreshCallQueue
Tests run: 1, Failures: 0, Errors: 0, Skipped: 0, Time elapsed: 4.346 sec - in org.apache.hadoop.TestRefreshCallQueue
Java HotSpot(TM) 64-Bit Server VM warning: ignoring option MaxPermSize=768m; support was removed
in 8.0
Running org.apache.hadoop.security.TestPermissionSymlinks
Tests run: 15, Failures: 0, Errors: 0, Skipped: 0, Time elapsed: 5.489 sec - in org.apache.hadoop.security.TestPermissionSymlinks
Java HotSpot(TM) 64-Bit Server VM warning: ignoring option MaxPermSize=768m; support was removed
in 8.0
Running org.apache.hadoop.security.TestRefreshUserMappings
Tests run: 2, Failures: 0, Errors: 0, Skipped: 0, Time elapsed: 6.16 sec - in org.apache.hadoop.security.TestRefreshUserMappings
Java HotSpot(TM) 64-Bit Server VM warning: ignoring option MaxPermSize=768m; support was removed
in 8.0
Running org.apache.hadoop.security.TestPermission
Tests run: 3, Failures: 0, Errors: 0, Skipped: 0, Time elapsed: 6.923 sec - in org.apache.hadoop.security.TestPermission
Java HotSpot(TM) 64-Bit Server VM warning: ignoring option MaxPermSize=768m; support was removed
in 8.0
Running org.apache.hadoop.tools.TestTools
Tests run: 5, Failures: 0, Errors: 0, Skipped: 0, Time elapsed: 1.085 sec - in org.apache.hadoop.tools.TestTools
Java HotSpot(TM) 64-Bit Server VM warning: ignoring option MaxPermSize=768m; support was removed
in 8.0
Running org.apache.hadoop.tools.TestJMXGet
Tests run: 2, Failures: 0, Errors: 0, Skipped: 0, Time elapsed: 5.973 sec - in org.apache.hadoop.tools.TestJMXGet
Java HotSpot(TM) 64-Bit Server VM warning: ignoring option MaxPermSize=768m; support was removed
in 8.0
Running org.apache.hadoop.tools.TestHdfsConfigFields
Tests run: 2, Failures: 0, Errors: 0, Skipped: 0, Time elapsed: 0.517 sec - in org.apache.hadoop.tools.TestHdfsConfigFields
Java HotSpot(TM) 64-Bit Server VM warning: ignoring option MaxPermSize=768m; support was removed
in 8.0
Running org.apache.hadoop.tracing.TestTracing
Tests run: 1, Failures: 0, Errors: 0, Skipped: 0, Time elapsed: 5.31 sec - in org.apache.hadoop.tracing.TestTracing
Java HotSpot(TM) 64-Bit Server VM warning: ignoring option MaxPermSize=768m; support was removed
in 8.0
Running org.apache.hadoop.tracing.TestTraceAdmin
Tests run: 1, Failures: 0, Errors: 0, Skipped: 0, Time elapsed: 4.421 sec - in org.apache.hadoop.tracing.TestTraceAdmin
Java HotSpot(TM) 64-Bit Server VM warning: ignoring option MaxPermSize=768m; support was removed
in 8.0
Running org.apache.hadoop.tracing.TestTracingShortCircuitLocalRead
Tests run: 1, Failures: 0, Errors: 0, Skipped: 0, Time elapsed: 4.61 sec - in org.apache.hadoop.tracing.TestTracingShortCircuitLocalRead
Java HotSpot(TM) 64-Bit Server VM warning: ignoring option MaxPermSize=768m; support was removed
in 8.0
Running org.apache.hadoop.net.TestNetworkTopology
Tests run: 10, Failures: 0, Errors: 0, Skipped: 0, Time elapsed: 10.057 sec - in org.apache.hadoop.net.TestNetworkTopology
Java HotSpot(TM) 64-Bit Server VM warning: ignoring option MaxPermSize=768m; support was removed
in 8.0
Running org.apache.hadoop.TestGenericRefresh
Tests run: 9, Failures: 0, Errors: 0, Skipped: 0, Time elapsed: 4.181 sec - in org.apache.hadoop.TestGenericRefresh
Java HotSpot(TM) 64-Bit Server VM warning: ignoring option MaxPermSize=768m; support was removed
in 8.0
Running org.apache.hadoop.cli.TestHDFSCLI
Tests run: 1, Failures: 0, Errors: 0, Skipped: 0, Time elapsed: 64.69 sec - in org.apache.hadoop.cli.TestHDFSCLI
Java HotSpot(TM) 64-Bit Server VM warning: ignoring option MaxPermSize=768m; support was removed
in 8.0
Running org.apache.hadoop.cli.TestCacheAdminCLI
Tests run: 1, Failures: 0, Errors: 0, Skipped: 0, Time elapsed: 6.867 sec - in org.apache.hadoop.cli.TestCacheAdminCLI
Java HotSpot(TM) 64-Bit Server VM warning: ignoring option MaxPermSize=768m; support was removed
in 8.0
Running org.apache.hadoop.cli.TestAclCLI
Tests run: 1, Failures: 0, Errors: 0, Skipped: 0, Time elapsed: 6.559 sec - in org.apache.hadoop.cli.TestAclCLI
Java HotSpot(TM) 64-Bit Server VM warning: ignoring option MaxPermSize=768m; support was removed
in 8.0
Running org.apache.hadoop.cli.TestCryptoAdminCLI
Tests run: 1, Failures: 0, Errors: 0, Skipped: 0, Time elapsed: 7.216 sec - in org.apache.hadoop.cli.TestCryptoAdminCLI
Java HotSpot(TM) 64-Bit Server VM warning: ignoring option MaxPermSize=768m; support was removed
in 8.0
Running org.apache.hadoop.cli.TestXAttrCLI
Tests run: 1, Failures: 0, Errors: 0, Skipped: 0, Time elapsed: 7.716 sec - in org.apache.hadoop.cli.TestXAttrCLI

Results :

Failed tests: 
  TestDNFencing.testQueueingWithAppend:463 expected:<21> but was:<20>
  TestSeveralNameNodes.testCircularLinkedListWrites:90 Some writers didn't complete in expected
runtime! Current writer state:[Circular Writer:
	 directory: /test-0
	 target length: 50
	 current item: 28
	 done: false
, Circular Writer:
	 directory: /test-2
	 target length: 50
	 current item: 32
	 done: false
] expected:<0> but was:<2>

Tests in error: 
  TestBlockManager.testBlocksAreNotUnderreplicatedInSingleRack:368->doTestSingleRackClusterIsSufficientlyReplicated:376->addBlockOnNodes:443
WrongTypeOfReturnValue

Tests run: 3647, Failures: 2, Errors: 1, Skipped: 16

[INFO]                                                                         
[INFO] ------------------------------------------------------------------------
[INFO] Skipping Apache Hadoop HttpFS
[INFO] This project has been banned from the build due to previous failures.
[INFO] ------------------------------------------------------------------------
[INFO]                                                                         
[INFO] ------------------------------------------------------------------------
[INFO] Skipping Apache Hadoop HDFS BookKeeper Journal
[INFO] This project has been banned from the build due to previous failures.
[INFO] ------------------------------------------------------------------------
[INFO]                                                                         
[INFO] ------------------------------------------------------------------------
[INFO] Skipping Apache Hadoop HDFS-NFS
[INFO] This project has been banned from the build due to previous failures.
[INFO] ------------------------------------------------------------------------
[INFO]                                                                         
[INFO] ------------------------------------------------------------------------
[INFO] Building Apache Hadoop HDFS Project 3.0.0-SNAPSHOT
[INFO] ------------------------------------------------------------------------
[INFO] 
[INFO] --- maven-clean-plugin:2.5:clean (default-clean) @ hadoop-hdfs-project ---
[INFO] Deleting <https://builds.apache.org/job/Hadoop-Hdfs-trunk-Java8/ws/hadoop-hdfs-project/target>
[INFO] 
[INFO] --- maven-antrun-plugin:1.7:run (create-testdirs) @ hadoop-hdfs-project ---
[INFO] Executing tasks

main:
    [mkdir] Created dir: <https://builds.apache.org/job/Hadoop-Hdfs-trunk-Java8/ws/hadoop-hdfs-project/target/test-dir>
[INFO] Executed tasks
[INFO] 
[INFO] --- maven-source-plugin:2.3:jar-no-fork (hadoop-java-sources) @ hadoop-hdfs-project
---
[INFO] 
[INFO] --- maven-source-plugin:2.3:test-jar-no-fork (hadoop-java-sources) @ hadoop-hdfs-project
---
[INFO] 
[INFO] --- maven-enforcer-plugin:1.3.1:enforce (dist-enforce) @ hadoop-hdfs-project ---
[INFO] 
[INFO] --- maven-site-plugin:3.4:attach-descriptor (attach-descriptor) @ hadoop-hdfs-project
---
[INFO] 
[INFO] --- maven-javadoc-plugin:2.8.1:jar (module-javadocs) @ hadoop-hdfs-project ---
[INFO] Not executing Javadoc as the project is not a Java classpath-capable package
[INFO] 
[INFO] --- maven-enforcer-plugin:1.3.1:enforce (depcheck) @ hadoop-hdfs-project ---
[INFO] 
[INFO] --- maven-checkstyle-plugin:2.15:checkstyle (default-cli) @ hadoop-hdfs-project ---
[INFO] 
[INFO] --- findbugs-maven-plugin:3.0.0:findbugs (default-cli) @ hadoop-hdfs-project ---
[INFO] ------------------------------------------------------------------------
[INFO] Reactor Summary:
[INFO] 
[INFO] Apache Hadoop HDFS Client ......................... SUCCESS [03:06 min]
[INFO] Apache Hadoop HDFS ................................ FAILURE [  02:47 h]
[INFO] Apache Hadoop HttpFS .............................. SKIPPED
[INFO] Apache Hadoop HDFS BookKeeper Journal ............. SKIPPED
[INFO] Apache Hadoop HDFS-NFS ............................ SKIPPED
[INFO] Apache Hadoop HDFS Project ........................ SUCCESS [  0.059 s]
[INFO] ------------------------------------------------------------------------
[INFO] BUILD FAILURE
[INFO] ------------------------------------------------------------------------
[INFO] Total time: 02:51 h
[INFO] Finished at: 2015-08-27T14:39:40+00:00
[INFO] Final Memory: 53M/621M
[INFO] ------------------------------------------------------------------------
[ERROR] Failed to execute goal org.apache.maven.plugins:maven-surefire-plugin:2.17:test (default-test)
on project hadoop-hdfs: There are test failures.
[ERROR] 
[ERROR] Please refer to <https://builds.apache.org/job/Hadoop-Hdfs-trunk-Java8/ws/hadoop-hdfs-project/hadoop-hdfs/target/surefire-reports>
for the individual test results.
[ERROR] -> [Help 1]
[ERROR] 
[ERROR] To see the full stack trace of the errors, re-run Maven with the -e switch.
[ERROR] Re-run Maven using the -X switch to enable full debug logging.
[ERROR] 
[ERROR] For more information about the errors and possible solutions, please read the following
articles:
[ERROR] [Help 1] http://cwiki.apache.org/confluence/display/MAVEN/MojoFailureException
[ERROR] 
[ERROR] After correcting the problems, you can resume the build with the command
[ERROR]   mvn <goals> -rf :hadoop-hdfs
Build step 'Execute shell' marked build as failure
Archiving artifacts
Sending artifact delta relative to Hadoop-Hdfs-trunk-Java8 #222
Archived 1 artifacts
Archive block size is 32768
Received 0 blocks and 4695863 bytes
Compression is 0.0%
Took 3.8 sec
Recording test results
Updating HDFS-2390

Mime
View raw message