hadoop-hdfs-dev mailing list archives

Site index · List index
Message view « Date » · « Thread »
Top « Date » · « Thread »
From Apache Jenkins Server <jenk...@builds.apache.org>
Subject Hadoop-Hdfs-trunk-Java8 - Build # 268 - Still Failing
Date Thu, 06 Aug 2015 16:45:17 GMT
See https://builds.apache.org/job/Hadoop-Hdfs-trunk-Java8/268/

###################################################################################
########################## LAST 60 LINES OF THE CONSOLE ###########################
[...truncated 7912 lines...]
[INFO] --- maven-javadoc-plugin:2.8.1:jar (module-javadocs) @ hadoop-hdfs-project ---
[INFO] Not executing Javadoc as the project is not a Java classpath-capable package
[INFO] 
[INFO] --- maven-enforcer-plugin:1.3.1:enforce (depcheck) @ hadoop-hdfs-project ---
[INFO] 
[INFO] --- maven-checkstyle-plugin:2.15:checkstyle (default-cli) @ hadoop-hdfs-project ---
[INFO] 
[INFO] --- findbugs-maven-plugin:3.0.0:findbugs (default-cli) @ hadoop-hdfs-project ---
[INFO] ------------------------------------------------------------------------
[INFO] Reactor Summary:
[INFO] 
[INFO] Apache Hadoop HDFS Client ......................... SUCCESS [03:08 min]
[INFO] Apache Hadoop HDFS ................................ FAILURE [  02:48 h]
[INFO] Apache Hadoop HttpFS .............................. SKIPPED
[INFO] Apache Hadoop HDFS BookKeeper Journal ............. SKIPPED
[INFO] Apache Hadoop HDFS-NFS ............................ SKIPPED
[INFO] Apache Hadoop HDFS Project ........................ SUCCESS [  0.057 s]
[INFO] ------------------------------------------------------------------------
[INFO] BUILD FAILURE
[INFO] ------------------------------------------------------------------------
[INFO] Total time: 02:52 h
[INFO] Finished at: 2015-08-06T16:45:37+00:00
[INFO] Final Memory: 53M/647M
[INFO] ------------------------------------------------------------------------
[ERROR] Failed to execute goal org.apache.maven.plugins:maven-surefire-plugin:2.17:test (default-test)
on project hadoop-hdfs: There are test failures.
[ERROR] 
[ERROR] Please refer to /home/jenkins/jenkins-slave/workspace/Hadoop-Hdfs-trunk-Java8/hadoop-hdfs-project/hadoop-hdfs/target/surefire-reports
for the individual test results.
[ERROR] -> [Help 1]
[ERROR] 
[ERROR] To see the full stack trace of the errors, re-run Maven with the -e switch.
[ERROR] Re-run Maven using the -X switch to enable full debug logging.
[ERROR] 
[ERROR] For more information about the errors and possible solutions, please read the following
articles:
[ERROR] [Help 1] http://cwiki.apache.org/confluence/display/MAVEN/MojoFailureException
[ERROR] 
[ERROR] After correcting the problems, you can resume the build with the command
[ERROR]   mvn <goals> -rf :hadoop-hdfs
Build step 'Execute shell' marked build as failure
Archiving artifacts
Sending artifact delta relative to Hadoop-Hdfs-trunk-Java8 #222
Archived 1 artifacts
Archive block size is 32768
Received 0 blocks and 4346902 bytes
Compression is 0.0%
Took 3.8 sec
Recording test results
Updating YARN-3736
Updating HADOOP-7824
Updating HADOOP-11932
Updating HDFS-8815
Updating YARN-3961
Updating HADOOP-12302
Updating HADOOP-12304
Updating HADOOP-12280
Updating YARN-3992
Updating YARN-3983
Sending e-mails to: hdfs-dev@hadoop.apache.org
Email was triggered for: Failure
Sending email for trigger: Failure



###################################################################################
############################## FAILED TESTS (if any) ##############################
1 tests failed.
FAILED:  org.apache.hadoop.hdfs.server.namenode.ha.TestSeveralNameNodes.testCircularLinkedListWrites

Error Message:
Some writers didn't complete in expected runtime! Current writer state:[Circular Writer:
  directory: /test-0
  target length: 50
  current item: 1
  done: false
, Circular Writer:
  directory: /test-2
  target length: 50
  current item: 50
  done: false
] expected:<0> but was:<2>

Stack Trace:
java.lang.AssertionError: Some writers didn't complete in expected runtime! Current writer
state:[Circular Writer:
	 directory: /test-0
	 target length: 50
	 current item: 1
	 done: false
, Circular Writer:
	 directory: /test-2
	 target length: 50
	 current item: 50
	 done: false
] expected:<0> but was:<2>
	at org.junit.Assert.fail(Assert.java:88)
	at org.junit.Assert.failNotEquals(Assert.java:743)
	at org.junit.Assert.assertEquals(Assert.java:118)
	at org.junit.Assert.assertEquals(Assert.java:555)
	at org.apache.hadoop.hdfs.server.namenode.ha.TestSeveralNameNodes.testCircularLinkedListWrites(TestSeveralNameNodes.java:90)



Mime
  • Unnamed multipart/mixed (inline, None, 0 bytes)
View raw message