hadoop-hdfs-dev mailing list archives

Site index · List index
Message view « Date » · « Thread »
Top « Date » · « Thread »
From Apache Jenkins Server <jenk...@builds.apache.org>
Subject Hadoop-Hdfs-trunk - Build # 2172 - Still Failing
Date Wed, 01 Jul 2015 14:20:32 GMT
See https://builds.apache.org/job/Hadoop-Hdfs-trunk/2172/

###################################################################################
########################## LAST 60 LINES OF THE CONSOLE ###########################
[...truncated 7347 lines...]
[INFO] ------------------------------------------------------------------------
[INFO] Total time: 02:44 h
[INFO] Finished at: 2015-07-01T14:20:06+00:00
[INFO] Final Memory: 58M/665M
[INFO] ------------------------------------------------------------------------
[ERROR] Failed to execute goal org.apache.maven.plugins:maven-surefire-plugin:2.17:test (default-test)
on project hadoop-hdfs: There are test failures.
[ERROR] 
[ERROR] Please refer to /home/jenkins/jenkins-slave/workspace/Hadoop-Hdfs-trunk/hadoop-hdfs-project/hadoop-hdfs/target/surefire-reports
for the individual test results.
[ERROR] -> [Help 1]
[ERROR] 
[ERROR] To see the full stack trace of the errors, re-run Maven with the -e switch.
[ERROR] Re-run Maven using the -X switch to enable full debug logging.
[ERROR] 
[ERROR] For more information about the errors and possible solutions, please read the following
articles:
[ERROR] [Help 1] http://cwiki.apache.org/confluence/display/MAVEN/MojoFailureException
[ERROR] 
[ERROR] After correcting the problems, you can resume the build with the command
[ERROR]   mvn <goals> -rf :hadoop-hdfs
Build step 'Execute shell' marked build as failure
Archiving artifacts
Sending artifact delta relative to Hadoop-Hdfs-trunk #2170
Archived 1 artifacts
Archive block size is 32768
Received 0 blocks and 381052 bytes
Compression is 0.0%
Took 6.9 sec
Recording test results
Updating HADOOP-12124
Updating HADOOP-12107
Updating HADOOP-12104
Updating YARN-3827
Updating HDFS-8627
Updating YARN-3695
Updating MAPREDUCE-6384
Updating HADOOP-12009
Updating HADOOP-12164
Updating YARN-3823
Updating HADOOP-12089
Updating HADOOP-12149
Updating MAPREDUCE-6407
Updating HDFS-8687
Updating HDFS-8493
Updating YARN-3770
Updating HADOOP-12116
Updating HDFS-8659
Updating HDFS-7390
Updating HADOOP-10798
Updating HDFS-8579
Updating HADOOP-12112
Updating HDFS-8653
Updating MAPREDUCE-6121
Updating HDFS-8635
Updating HADOOP-12154
Updating YARN-3768
Updating HADOOP-12159
Updating HADOOP-12158
Sending e-mails to: hdfs-dev@hadoop.apache.org
Email was triggered for: Failure
Sending email for trigger: Failure



###################################################################################
############################## FAILED TESTS (if any) ##############################
1 tests failed.
FAILED:  org.apache.hadoop.hdfs.server.namenode.ha.TestStandbyIsHot.testDatanodeRestarts

Error Message:
expected:<0> but was:<2>

Stack Trace:
java.lang.AssertionError: expected:<0> but was:<2>
	at org.junit.Assert.fail(Assert.java:88)
	at org.junit.Assert.failNotEquals(Assert.java:743)
	at org.junit.Assert.assertEquals(Assert.java:118)
	at org.junit.Assert.assertEquals(Assert.java:555)
	at org.junit.Assert.assertEquals(Assert.java:542)
	at org.apache.hadoop.hdfs.server.namenode.ha.TestStandbyIsHot.testDatanodeRestarts(TestStandbyIsHot.java:188)



Mime
  • Unnamed multipart/mixed (inline, None, 0 bytes)
View raw message